<svg
    width="65px"
    height="65px"
    viewBox="0 -38.5 1101 1101"
    class="icon"
    version="1.1"
    xmlns="http://www.w3.org/2000/svg"
    fill="#000000">
    <g id="SVGRepo_bgCarrier" stroke-width="0"></g>
    <g id="SVGRepo_tracerCarrier" stroke-linecap="round" stroke-linejoin="round"></g>
    <g id="SVGRepo_iconCarrier">
        <path
            d="M94.853634 1000.019601A32.511575 32.511575 0 0 1 62.342059 968.430341c-1.844628-41.965295-5.303306-88.54216-7.609092-115.289272l1016.851374-102.607451a391.983523 391.983523 0 0 1-12.451242 109.294229 37.814881 37.814881 0 0 1-26.055375 27.438847c-290.528964 89.925632-790.884402 109.063651-937.532355 112.983486z"
            fill="#FDCA89"></path>
        <path
            d="M1048.526486 776.127836a472.455434 472.455434 0 0 1-11.990084 78.627283 14.526448 14.526448 0 0 1-10.376034 10.606613C737.937189 954.134471 240.809851 973.27249 94.853634 976.961747A9.684299 9.684299 0 0 1 85.399913 968.430341c-1.383471-32.511575-3.689257-67.328934-5.764463-93.845467l968.429879-97.765302m41.734717-50.496701l-1060.661297 106.988444s6.917356 73.323977 9.45372 137.194233a55.569429 55.569429 0 0 0 55.569429 53.494221h1.383471c164.63308-4.150414 653.229012-23.057854 943.757976-113.9058a60.642157 60.642157 0 0 0 41.734716-44.27108c8.761985-38.967774 20.060333-102.376873 8.761985-138.347126z"
            fill="#5C2D51"></path>
        <path
            d="M164.257775 864.208839c-53.263643 0-89.003317-1.61405-108.833072-2.997521l-3.919835-50.727279 17.754547-64.561992c106.988444-17.523969 769.440597-124.97357 961.512524-124.97357A248.794248 248.794248 0 0 1 1060.747149 622.562527l9.223142 135.349604A4737.005582 4737.005582 0 0 1 461.242938 851.757598c-111.369436 8.300828-211.209945 12.451241-296.985163 12.451241z"
            fill="#FDCA89"></path>
        <path
            d="M1030.54136 644.006331h9.45372l6.4562 95.459517a4663.220448 4663.220448 0 0 1-587.05297 89.464474c-110.677701 8.070249-210.057052 12.220663-295.371114 12.220663-38.04546 0-67.098356 0-87.389267-1.844628l-2.075207-26.516533 12.68182-46.115708c141.805804-23.057854 760.909191-122.206628 943.06624-122.206628m0-46.115708c-212.362838 0-979.958807 127.740513-979.958807 127.740512l-23.057854 82.777697 5.764463 74.246291s40.351245 4.611571 130.276877 4.611571c69.173563 0 167.169443-2.766943 299.752105-12.220663a4786.810547 4786.810547 0 0 0 632.246365-99.609931l-11.528928-169.705807c-4.150414-5.764464-23.057854-8.300828-53.033064-8.300828z"
            fill="#5C2D51"></path>
        <path
            d="M814.028108 872.04851a19.138019 19.138019 0 0 1-14.987605-9.223142c-48.421494-69.173563-234.959535-107.219022-367.311618-125.434727l597.659582-141.114068a219.97193 219.97193 0 0 1 28.59174 152.642995c-10.145456 42.426452-102.607452 89.464475-241.185156 122.667785z"
            fill="#9FDBAD"></path>
        <path
            d="M1017.628962 622.562527a186.538041 186.538041 0 0 1 18.215705 120.823156c-5.303306 23.057854-68.02067 67.559513-219.049616 104.45208-40.581824-56.030586-155.409938-92.231417-267.701688-115.289272L1017.628962 622.562527m23.057854-52.802487l-744.768693 175.70085s415.041377 31.128103 484.21494 130.276876a41.965295 41.965295 0 0 0 33.895045 19.138019 36.200831 36.200831 0 0 0 8.531407 0c72.401662-17.293391 240.262842-65.253728 258.247967-139.730596 23.057854-96.151252-40.351245-184.462834-40.351245-184.462835z"
            fill="#5C2D51"></path>
        <path
            d="M51.274289 688.969147L46.201561 682.743526a9.223142 9.223142 0 0 1 0-6.22562c0-3.919835 7.378513-10.376034 21.674383-16.601656C163.104882 617.489799 392.069375 564.456734 576.532209 530.331109a2724.746639 2724.746639 0 0 1 416.886006-46.115708 407.201706 407.201706 0 0 1 44.501658 2.075207 67.790092 67.790092 0 0 1 6.686778 23.057854 32.280996 32.280996 0 0 0 5.764464 14.29587 855.215815 855.215815 0 0 1 10.837191 107.680179C640.402466 764.598909 161.490833 783.967506 51.274289 786.273292z"
            fill="#F05071"></path>
        <path
            d="M994.340529 507.273255h27.669425v5.072728a57.875214 57.875214 0 0 0 6.917356 19.368598c2.766943 13.834713 5.995042 47.268601 8.300828 81.624804-388.524845 121.053735-822.70424 144.572746-962.895995 149.184317v-80.471911h1.844629c94.537203-41.734716 322.80996-94.306624 505.658744-127.740513a2700.305314 2700.305314 0 0 1 412.735591-46.115709m0-46.115708A2730.511103 2730.511103 0 0 0 573.30411 507.273255c-178.237214 32.511575-415.041377 85.775218-516.034779 130.968612-55.800007 24.671904-29.283475 58.105793-29.283475 58.105793v112.522329S595.900807 807.025361 1086.110789 645.620381c0 0-6.456199-138.347126-17.062812-138.347126 0 0-4.150414-42.195873-24.441326-44.962816a406.740549 406.740549 0 0 0-50.266122-1.152892z"
            fill="#5C2D51"></path>
        <path
            d="M38.823048 678.362534a227.8116 227.8116 0 0 1-14.526448-110.908279l520.415771-507.272794A126.126463 126.126463 0 0 1 633.485109 23.058315a124.512413 124.512413 0 0 1 44.732238 8.300828c120.823156 46.115709 332.494259 153.104152 395.211622 349.557071a129.354562 129.354562 0 0 1-21.213226 111.369436c-139.730597 105.604973-644.928184 184.462834-1013.392695 186.076884z"
            fill="#FDCA89"></path>
        <path
            d="M633.485109 46.11617a101.454559 101.454559 0 0 1 35.278518 6.686777c118.056214 44.732237 322.80996 147.800846 382.529802 335.030623v2.305785a107.910758 107.910758 0 0 1-17.062812 85.775218C899.342169 574.832768 408.209873 651.615423 54.27181 655.074101A244.874412 244.874412 0 0 1 46.201561 578.060868L560.852869 75.860802A103.299187 103.299187 0 0 1 633.485109 46.11617m0-46.115709a150.106631 150.106631 0 0 0-104.682658 42.887609L2.622217 556.386485c-7.147935 42.426452 0 122.437206 25.363639 145.033903 356.705006 0 894.414167-77.47439 1041.062121-194.147133a152.642995 152.642995 0 0 0 26.055375-134.196712C1029.849624 168.783954 812.644637 58.106254 686.518174 9.68476a147.800846 147.800846 0 0 0-53.033065-9.684299z"
            fill="#5C2D51"></path>
        <path
            d="M123.445373 556.155906c-27.208268 0-54.185958 0-80.70249-1.844628a3.689257 3.689257 0 0 1-2.536364-0.922314L544.942949 59.259147A126.126463 126.126463 0 0 1 633.485109 23.058315a124.512413 124.512413 0 0 1 44.732238 8.300828c116.672743 44.732237 318.198389 145.956218 388.063687 329.727316-92.692574 38.04546-502.430645 195.069447-942.835661 195.069447z"
            fill="#FDCA89"></path>
        <path
            d="M633.485109 46.11617a101.454559 101.454559 0 0 1 35.278518 6.686777c108.371915 41.504138 292.373592 133.043819 366.158725 295.371114-122.206628 48.190915-503.814116 184.462834-912.629872 184.462834H92.31727L560.852869 75.860802A103.299187 103.299187 0 0 1 633.485109 46.11617m0-46.115709a150.106631 150.106631 0 0 0-104.682658 42.887609L2.622217 556.386485c23.057854 1.844628 15.909919 20.060333 38.967773 20.982647q41.042981 1.844628 81.624804 1.844628c509.809158 0 971.888558-205.445482 971.888558-205.445481C1029.849624 168.783954 812.644637 58.106254 686.518174 9.68476a147.800846 147.800846 0 0 0-53.033065-9.684299z"
            fill="#5C2D51"></path>
    </g>
</svg>