[
    {
        "title": "LP SIL spécialité Administration de Systèmes et d'Applications Répartis",
        "city": "Belfort",
        "link":"",
        "details": "Bac + 2 en informatique",
        "description": "Cette spécialité a pour objectif de former des informaticiens capables d’administrer les réseaux, les systèmes d’exploitation et les environnements multi tiers de l’entreprise ainsi que de maintenir les applications s’y exécutant."
    },
    {
        "title": "LP SIL spécialité Systèmes informatiques et logiciels spécialité Audit et sécurité des réseaux et des systèmes d'information",
        "city": "Caen",
        "link":"",
        "details": "Bac + 2 en informatique - 16 places - en alternance (apprentissage et contrat de professionnalisation), en formation continue et en formation initiale",
        "description": "Cette licence vise à former des professionnels en informatique et réseaux qui auront intégré dans leur culture et dans leurs pratiques les problèmes de sécurité que pose l'informatique. Ils seront capables de conduire un audit de sécurité informatique, et de mettre en place une politique de sécurité des réseaux et systèmes informatiques adaptée dans une entreprise, puis d'en assurer le suivi.."
    },
    {
        "title": "LP Réseaux et télécommunications spécialité Réseaux et Systèmes de Communication",
        "city": "Calais",
        "link":"",
        "details": "Bac + 2 en informatique - 32 places",
        "description": "Répondre à un besoin croissant dans les entreprises de qualifications performantes dans le domaine des réseaux et systèmes de communication."
    },
    {
        "title": "LP SIL spécialité MESSI : Métiers de l'administration et de la Sécurité et des Systèmes d'Information",
        "city": "Grenoble",
        "link":"",
        "details": "BAC+2 en informatique - 15 places - en alternance (apprentissage et contrat de professionnalisation) et en formation continue",
        "description": "Cette formation spécialise des informaticiens pour qu'ils soient capables d'organiser, de gérer, d'administrer, de faire évoluer un parc informatique et capables de mettre en place des procédures et méthodes pour assurer la sécurité de données (protection, sauvegarde, restauration) et des infrastructures informatiques."
    },
    {
        "title": "LP Réseaux et Télécommunications spécialité gestion des systèmes et réseaux pour les petites et moyennes organisations",
        "city": "Lannion",
        "link":"",
        "details": "En partenariat avec le département R&T de Lanion - Bac + 2, DUT R&T, Info, BTS Info gestion (arle), BTS Iris - 26 places",
        "description": "Former les responsables des services informatique d'une petite ou moyenne organisation."
    },
    {
        "title": "LP SIL spécialité sécurité informatique",
        "city": "Lens",
        "link":"",
        "details": "Bac + 2 en informatique - 26 places",
        "description": "Former des informaticiens généralistes capables de proposer des solutions informatiques avec le souci de sécurité et de fiabilité nécessaire à un développement viable."
    },
    {
        "title": "LP SIL spécialité Administrateur de Réseaux et de Bases de Données",
        "city": "Limoges",
        "link":"",
        "details": "BTS IG DUT INFO/RT/SRC/GEII/MP L2 - 28 places",
        "description": "La formation proposée porte sur l’administration des réseaux et des bases de données. Elle permet d’accéder aux emplois de gestionnaire de réseaux, de chef de projets, d’architecte de systèmes d’information, d’analyste, de consultant ou d’administrateur système."
    },
    {
        "title": "LP SIL spécialité DASI : Développeur et Administrateur de Systèmes d'Information",
        "city": "Lyon",
        "link":"",
        "details": "Bac + 2 informatique - 32 places en alternance 24 places en formation continue (cours du soir)",
        "description": "Former des professionnels de niveau II spécialisés dans l'administration des systèmes d’entreprise et gestion des serveurs d’applications."
    },
    {
        "title": "LP SIL - spécialité Métiers de l'administration des systèmes et des réseaux",
        "city": "Metz",
        "link":"",
        "details": "BAC+2 en informatique (BTS IG, IRIS, DUT GTR, Info, DEUST TIC, L2) -  26 places - en alternance",
        "description": "Acquérir les compétences nécessaires pour rédiger le cahier des charges, installer, maintenir, et gérer des réseaux d'ordinateurs et des ordinateurs reliés à des réseaux. "
    },
    {
        "title": "LP SIL - spécialité ASRALL : Administration de systèmes, réseaux et applications à base de logiciels libres",
        "city": "Nancy",
        "link":"",
        "details": "BAC+2 en informatique -  28 places",
        "description": "Cette licence a pour objectif de former des administrateurs de systèmes, réseaux et applications utilisant prioritairement des logiciels libres. Le diplômé sera capable, seul ou dans le cadre d'une équipe, d'administrer les ressources informatiques de petites ou moyennes entreprises."
    },
    {
        "title": "LP SIL - spécialité Administration des systèmes et réseaux",
        "city": "Nice",
        "link":"",
        "details": "BAC+2 en informatique -  130 places réparties en 5 spécialités - apprentissage possible",
        "description": "Après un tronc commum, les étudiants se spécialisent au deuxième semestre sur la thématique de la spécialité."
    },
    {
        "title": "LP Réseaux et Télécommunications spécialité Sécurité des Réseaux et Systèmes Informatique",
        "city": "Orsay",
        "link":"",
        "details": "DUT info, BTS info, L2 info -  24 places en alternance",
        "description": "Former des professionnels destinés à occuper des emplois de niveau II (technicien supérieur, assistant ingénieur), dans l’exercice de l’activité professionnelle de gestion de parc d’ordinateurs et qualifiés dans les domaines suivants : administration réseaux et infogérance, intégration de services Internet/Intranet, traitement et transmission sécurisée de l’information ."
    },
    {
        "title": "LP SIL - spécialité administration de réseaux et services",
        "city": "Strasbourg",
        "link":"",
        "details": "BAC+2 en informatique -  12 places en formation continue (en partie par enseignement  à distance)",
        "description": "Acquérir une bonne connaissance des concepts, des protocoles, des réseaux d’entreprise, des services réseaux et Internet. Etre capable de définir, déployer et administrer les équipements d’un réseau local et les services associés. Assurer la sécurité des réseaux et des communications."
    },
    {
        "title": "LP SIL spécialité Sécurité des réseaux et des systèmes",
        "city": "Toulouse",
        "link":"",
        "details": "BAC+2 en informatique -  24 places",
        "description": "Maîtriser les moyens technologiques et architectureaux pour la sécurité des réseaux, des systèmes et des services associés."
    },
    {
        "title": "LP Réseaux et Télécommunications spécialité intégrateur de systèmes distribués et réseaux numériques",
        "city": "Velizy",
        "link":"",
        "details": "DUT Informatique, DUT GTR, DUT GEII, BTS informatique ou IRIS, 120 ECTS dans un cursus sciences et technologies -  26 places en formation intiale et 26 places en alternance",
        "description": "L'objectif de cette licence professionnelle est de former des cadres de niveau II capables de s'adapter à un monde industriel marqué par d'incessantes évolutions technologiques et organisationnelles orientées vers la mise en place d'une société de communication et d'externalisation de services."
    }

]