-----BEGIN PGP SIGNATURE-----

iQGzBAABCgAdFiEEsPB3MygbkbezD7NAKqh0wvy977sFAmXpvsYACgkQKqh0wvy9
77vx8Qv/b3UFrJHcaB5bmZO5VY+EiNPenRPDFqbLDH7cX8DlV/lSuAwHUIqbXEAx
iQ/SIXISLROukxWRM1O68XiQIFxOmY6/8heHzEriczIoOWhuTVF0JvHNB+btZk0i
q0sTlBk2OVATyH3QysHWsLCOKfevqi+F8f8gocQ4NssDMTDbEMOD5CN30bn5NQGd
b7RS0rtF4QLTrRrBti0cAcgmmsvUaWsu6fk/inmVq902Dw8AibdXVK/gUEErGpzb
IxZ223ced4TBW2kpgBStlr1QTVODIjRZ1jb13B4z7Kj/jzCgaAAnYyXz8hHy6ofN
smNvOM2Ift+H4s07x+TCWPnBp+Bpg8Nz3fHVd0X6mQFv7j072SPtz6wJCtS2KDq6
8DABUdNCMfPB3MPq0N+frjXNBM6SJEkKs1V9hsjq1fPPQwIhP3wSRdDEM3hhYTL3
XYlwldbaMnLtxZu5bTxpJb3Kip1I5157L+ecMTeXHhsTB2kVpZrHeTm2nEnHNmHQ
zA6dzE3s
=6gAG
-----END PGP SIGNATURE-----
