-----BEGIN PGP SIGNATURE-----

iQGzBAABCgAdFiEEsPB3MygbkbezD7NAKqh0wvy977sFAmXTVWEACgkQKqh0wvy9
77ufhgv/V28f0i5HDcyiOda/yiPgqvjf4XhwhaB0AdQSvhRUPKUHmMEuRxPiJQcp
ExU8GyAj24bTlMqyxgSVfqyp2Ur6SJNo+dkSMRuHUi1BRdMKGgGQWvz1R6Vm5XGU
Iur0Gbjrfsy1fnU0sA/msA0yYKPacUqDC6QRXFxLLTBoRK5o8PIHKVF243gUyIk+
rhO+qZBwx9McS3UQTl+Dr1bJzxzwOA8pzCDN7iNsH1A5ad7JSleb1B67Z6u1iVq4
hRsg5oFOJ9SOM4I/9M29Gg+SKTcb+pypp3r9JTO73SY9jh9I0fU/VtPtqnCiHBtl
BEIn4iK29vLvGDLmIr/gmyTI6yZxgXSHJR3G4GyRXa2h6PCDXkldcs+enzFIDOtX
8YM/fw2a1p3HSGnALmDql0bsw+iwhiykx1Zj5QWhFDvNOoINwkrCt3uVjOizc6IK
ydJB0kGEaWh6wvLkd1nqNqwQ6lqLUOynJ8Dl6w4SMszWVWWjcz+kBnoG6aWTT8OR
dvx/LB+m
=zdrQ
-----END PGP SIGNATURE-----
