-----BEGIN PGP SIGNATURE-----

iQGzBAABCgAdFiEEsPB3MygbkbezD7NAKqh0wvy977sFAmXmzEAACgkQKqh0wvy9
77uR8gv+Lp/LwXV+qdK7lbE2pf4RDbr2KvvauGJskC0iGnZoZO5o152BFPC7HH5M
CVjEzMcS8sOWUi9P67UfGNbyt85wMB62KonoqhxWCul2TFO81Y1lM8S4w7DUF9s2
p1AdJSpZcRXACiHyfFUk5PVyhnmBLRsSED08o6t5poXkI8a7OPtGJEpJAHrpbbb4
ayD1c4AC69P1icSXjEV1RrupvFSNSPsDF/d9UtAG1mMR6GrGcu11uot5KlNF5jjL
ieZvj0VQ8ebJH7qOPr3MuV2ooutDDXdfOxGEVTWCQR/5AS+KOu++XUuUvRZBOkiv
YWBRCfTZZ38fVNT3wKu2nUsxweRER6H2km+Yt3cC2lCJYM9b8xEc+oV3UkfolO+D
9NRWwRiKGXyQr0RoRW8AhjNOZW7KfkcEJ7nb6AQUSnJtvlyWSOb6X8/8MAe7OI9e
DVs65eJ/bxPPvX/LmMwFW/S1DqOaFCsneTYOGSe1c0G1lq88VqNSUvCWYG5Tw+vD
VHVDR9ul
=Qg5k
-----END PGP SIGNATURE-----
