-----BEGIN PGP SIGNATURE-----

iQGzBAABCgAdFiEEsPB3MygbkbezD7NAKqh0wvy977sFAmXmzEAACgkQKqh0wvy9
77tTXgv/VAaAbRECdyjBzvPdTeKud7/vmeZ6oOylVZrzPuk7eubcRwlY4b7fW1lf
EmH0TiBvxypXDYdFuXp+qXQeBsVJnMBHVp+qZ1wwmpxsjdhFF7b3nWrHbQuiN12u
TZkBS7/BCf38wv+2MY6nmXEoui3kazVOX8LcvG1XtTZK2X+y0gEb+xUuPz23cxux
3yuzb/A7AW0zvIlNXN8Gm0roe+6PvoH9gNIp/nKbwXkGw0aU40HC0xYSeIr7CZhQ
2SBc2Vkc2WhRkxG6Cvxx/tD+R0Yyv6iNrwRrSO1wK2z8WsSflRL9CqL7zFS8LgC2
jvtuYSkbpfA0Bw1TrAg8N2m4Q+JIoQ5/U+3vWCTLOuIVzhYsIp3cbqOmtUlHf1bl
ijReKhbCjOvZE4Fg17sZKzjOJUDTVvzzWxKrCdycPUDAk1L7MVlbeMeQRN5W0PY3
BcXWd7IL+2kxl5l6WWNqerwUBjtioJuStdqFGixd8bkryRtyyGV64MUUiIAmK88e
c35CrjpS
=C094
-----END PGP SIGNATURE-----
