-----BEGIN PGP SIGNATURE-----

iQGzBAABCgAdFiEEsPB3MygbkbezD7NAKqh0wvy977sFAmXXFvkACgkQKqh0wvy9
77svAAv/cL8FiEBeUbdSMKW8KjlEsZRLydEgU40V4aYb2dNpPj5QeyhftOKIH0CG
/dO2pritqgoOgIn+x3JwSpUak4aMtamXgG5duf280c2GkR7qiQvMgX8jwl3D/8X9
ahyphAOgiBwswo0nZYh+kNs5B50nO8MhHuH9cJWFkYfqO5NExrFR14fme4+UFze1
OQ/ZyV9xSIqpYVYnJiRMY6v2LHSoAJhkJB1eOrVnllUo4/HJz5Ubki/R6qs1nxBM
Jyp4wKhXWDkDwHNfWLL6Ame/xtb71ND5wPSe7lD+PKXlUqaVmpPXgSJpPCElR2yK
42sh2vhC9sb2ZJTwdM8xnOVE6bpAQQBg5mF3tF08DL14S3Dm3WdV1c8ivUnCyC0+
Ct3TCmyEzcCefhef/Va/PRHP9BmFJgRnX4VhfvgbKWFgbLStwUzzqmzAwZcRg5pl
Pz2m6rgpJUjgtvjsbRlzgDrotan23q0iFrxNHqt7TdGlElFZr8b8Nv5fLu0xaiHU
Eylkm6Cz
=s4JH
-----END PGP SIGNATURE-----
