-----BEGIN PGP SIGNATURE-----

iQGzBAABCgAdFiEEsPB3MygbkbezD7NAKqh0wvy977sFAmXe/VUACgkQKqh0wvy9
77vHFAwA3GIix7IENI29tYqc2v+jd1gApYGuY/lGnH0Y7kXpzbjV0w7jcOp5dxqT
IJ1wKY4bq4F1JXY7JNTO4qY7T9ga6UktmJZ/F7e4r8g0ujxingOohIVg1E/Dh3FD
+sSiSriBXep7deSJyCtFKY70TN33gv4gos7JUg8jjQwxksvtNYbLtopAP4EYdsqQ
g3qebT1yJbRQN9rdcgmswYI5/McocVnciFrF35QB+tuv+hCA7KoXC0BmEHWIsMqZ
4em2eZTFCSwj1p72vreA+iB/8s1vhedubcw01P2b+5FH2GZRQBm83LQZoSx3IpWC
AtYfgeTXrpe8BocGPh9XvE/R0ltPoUoR8PwXpOcaSfcFgu9McXK/0adTTqmW0mFh
SGphOAAtiCWK8C/MwGRLb4wNntwTUE8uo2z0+Cm7cTmkcrCgD5iVLUlz/VKESaOE
UAQTwmXSpxtyNC1rY3LwVWzl0GDF8udGsqzmf+n9JY0s8/kWP+oG5GDGYbmoTWDf
zO09YZqw
=XAJe
-----END PGP SIGNATURE-----
