-----BEGIN PGP SIGNATURE-----

iQGzBAABCgAdFiEEsPB3MygbkbezD7NAKqh0wvy977sFAmXpvsUACgkQKqh0wvy9
77slRAwAmm7kuiFGrAVRrK3HjNxDFJac/JyqsjoLm9gUv7Rf6Cv3lGrlddFu/OFQ
cQ3OjlammrtubU+QZtXGUfBWmZspE3LAiTmak9fkjI/8/Vmbf684Zz//c85eB34I
evLmIvb2Ksi8cYMD7NPOx/GSmylClzn7SNCKed4awA3XGbWigKaHj8Yzm+QzbQh/
+Kex8QKe5p1zqAFCNLzomqBC1NHa04SwDlYMpfNboRbUke/7rwhNgmX5ko3l8yhZ
f2YBjegr+RqN0Kszy3oV1RpzsfYG6z/CjAvu/8JUOemYYQA5mBM6MB97m+a9o9jE
jaOHM8cNtpBl+q4UClbAjPEBqOuOPoln0o9td4Lb5DmIHEmt0N/aUacXr/sEYR7G
jVCAX5fgkJeHrYEXSumQCU/pYAja13qC7vwMWiYVaMEq5LOXbpUKzH3EjAiN6FlI
Bv7SxBukhRMJ+lJXXcyj3evNSSDcnDQy1ZGALqnYobU9GTLR8pR8Gb90hEhoFKUI
tGucgsyh
=zkRE
-----END PGP SIGNATURE-----
