-----BEGIN PGP SIGNATURE-----

iQGzBAABCgAdFiEEsPB3MygbkbezD7NAKqh0wvy977sFAmXW1uMACgkQKqh0wvy9
77tRZQv9ED2Wm7FFciCncVB844zHZo05TSwu21QLRqCebMX9EvE5KUFv7k3qTW5L
WV/NgATgWTbfRP77dUaz9FldMN72ETVoS5yu37PTF7B5XZjIF/4GHQ1bFGfJwANq
xomLkE3HT3u+5E3wHFhsisK9bz+r8kpacWkrPNigFSNXpeaGPxBEG5g/dwbYf5Yz
VZVJgk2gtc4ANnfbUoz0knsdLQtkpJRhDN8GVw4bQpvBLnGQO6zKYEonArcUIwFu
OkgyPyTVh4KPi7VAxe23H391pcLE/tSu9G9GqMUHVlwoYk2U7y0z7sH1AK3b1ssI
/xIUmfTT4Sj7Ax3lWbC23NtZNqwmrRyvck4agf9G0tOmI9f9TUT0YoyVDXQa8D3j
XDLLP8+oDJwc6o+OLr9jXBjRIXQthLacwpRHFcfPhTO6Dq4wbBKqrl2GvXAE9Y7w
dIME3KirkctRL5/EIEXJ2XSdA1SDY6TxL++T1xfJkusunj2IncCwW3H3fuVzPDxx
LCvsQAKV
=Xwsb
-----END PGP SIGNATURE-----
