-----BEGIN PGP SIGNATURE-----

iQGzBAABCgAdFiEEsPB3MygbkbezD7NAKqh0wvy977sFAmXXFvgACgkQKqh0wvy9
77sjBgv+OOLzp5oGi3yrUr2QoRKnX30OMcy3+SoQPXwMbxEkTxL+bdh3dQ8MM9DF
5Rpif+Ovc7jgPGSrwapRrpg6+6dgm1/6r6KkZdXEOBmXMz+5AjFh8dzQMcw4LRqe
T2fNwIKwSKoOCrGZfEQ+bt2o16xYqD+W4mqjMbDt+f1vFZbvOza2VJgeQGPQvfAU
SQyvS9V7AYZ/lBsg2NQJvxmKKep5A7OpuHjmQUQtIokN06t6KZRB/J7/M3OzTYmd
oi5DfdY6Sjhd0N4ifX6BiQy8WXRBn/yjYArehPCUOOqhzl5qUkQn9SV/JINdsDCt
T+VbqOJXqS67lCvu27RIoOOF0AFyVRmt9hDhsPeaXB8OzD26I4YKDUqXn+LSjYkF
UtwWkLNm0h2vcfyxxzmTiP4nZoVi58LEDNLVdJBePNRWT+6W3ug5Bj6tFmB62fIx
IYQvwYlYNtezsy6xEssxWY6vZJZEvIA+/R5nN51ahPsJ7XnCzomoor0UvxIZ8+cv
D93J1tjf
=B82i
-----END PGP SIGNATURE-----
