{
  "properties": {
    "identifications": {
      "items": {
        "properties": {
          "scientificName" : {
            "properties": {
              "scientificNameGroup": {
                "type": "string"
              }
            }
          }
        }
      }
    }
  }
}
