{
  "index": {
    "mapping": {
      "nested_fields": {
        "limit": 75
      }
    },
    "number_of_replicas": 0,
    "number_of_shards": 12,
    "refresh_interval": -1,
    "max_result_window": 50000,
    "analysis": {
      "analyzer": {
        "case_insensitive_analyzer": {
          "filter": "lowercase",
          "tokenizer": "keyword"
        },
        "contains_analyzer": {
          "filter": "lowercase",
          "tokenizer": "contains_tokenizer"
        }
      },
      "tokenizer": {
        "contains_tokenizer": {
          "min_gram": 3,
          "max_gram": 15,
          "token_chars": [],
          "type": "ngram"
        }
      }
    },
    "max_ngram_diff": 12
  }
}