{
  "dynamic": "strict",
  "properties": {
    "date": {
      "type": "date",
      "format": "basic_date_time||date_hour_minute_second||strict_date_hour_minute_second"
    },
    "sourceSystemCode": {
      "type": "keyword"
    },
    "status": {
      "type": "keyword"
    },
    "unitID": {
      "type": "keyword"
    }
  }
}