{
  "dynamic": "strict",
  "properties": {
    "areaType": {
      "type": "keyword",
      "fields": {
        "analyzed": {
          "type": "text"
        },
        "ignoreCase": {
          "type": "text",
          "analyzer": "case_insensitive_analyzer"
        }
      }
    },
    "countryNL": {
      "type": "keyword",
      "fields": {
        "analyzed": {
          "type": "text"
        },
        "ignoreCase": {
          "type": "text",
          "analyzer": "case_insensitive_analyzer"
        }
      }
    },
    "isoCode": {
      "type": "keyword",
      "fields": {
        "analyzed": {
          "type": "text"
        },
        "ignoreCase": {
          "type": "text",
          "analyzer": "case_insensitive_analyzer"
        }
      }
    },
    "locality": {
      "type": "keyword",
      "fields": {
        "analyzed": {
          "type": "text"
        },
        "ignoreCase": {
          "type": "text",
          "analyzer": "case_insensitive_analyzer"
        },
        "contains": {
          "type": "text",
          "analyzer": "contains_analyzer"
        }
      }
    },
    "recordURI": {
      "type": "keyword",
      "fields": {
        "analyzed": {
          "type": "text"
        },
        "ignoreCase": {
          "type": "text",
          "analyzer": "case_insensitive_analyzer"
        }
      }
    },
    "shape": {
      "type": "geo_shape",
      "precision": "5000.0m"
    },
    "source": {
      "type": "keyword",
      "fields": {
        "analyzed": {
          "type": "text"
        },
        "ignoreCase": {
          "type": "text",
          "analyzer": "case_insensitive_analyzer"
        }
      }
    },
    "sourceSystem": {
      "properties": {
        "code": {
          "type": "keyword",
          "fields": {
            "analyzed": {
              "type": "text"
            },
            "ignoreCase": {
              "type": "text",
              "analyzer": "case_insensitive_analyzer"
            }
          }
        },
        "name": {
          "type": "keyword",
          "fields": {
            "analyzed": {
              "type": "text"
            },
            "ignoreCase": {
              "type": "text",
              "analyzer": "case_insensitive_analyzer"
            }
          }
        }
      }
    },
    "sourceSystemId": {
      "type": "keyword",
      "fields": {
        "analyzed": {
          "type": "text"
        },
        "ignoreCase": {
          "type": "text",
          "analyzer": "case_insensitive_analyzer"
        }
      }
    }
  }
}