{
  "settings": {
    "index": {
      "mapping": {
        "nested_fields": {
          "limit": 75
        }
      },
      "number_of_replicas": 0,
      "number_of_shards": 12,
      "refresh_interval": -1,
      "max_result_window": 50000,
      "analysis": {
        "analyzer": {
          "case_insensitive_analyzer": {
            "filter": "lowercase",
            "tokenizer": "keyword"
          },
          "contains_analyzer": {
            "filter": "lowercase",
            "tokenizer": "contains_tokenizer"
          }
        },
        "tokenizer": {
          "contains_tokenizer": {
            "min_gram": 3,
            "max_gram": 15,
            "token_chars": [],
            "type": "ngram"
          }
        }
      },
      "max_ngram_diff": 12
    }
  },
  "mappings": {
    "dynamic": "strict",
    "properties": {
      "associatedSpecimenReference": {
        "type": "keyword",
        "fields": {
          "analyzed": {
            "type": "text"
          },
          "ignoreCase": {
            "type": "text",
            "analyzer": "case_insensitive_analyzer"
          }
        }
      },
      "associatedTaxonReference": {
        "type": "keyword",
        "fields": {
          "analyzed": {
            "type": "text"
          },
          "ignoreCase": {
            "type": "text",
            "analyzer": "case_insensitive_analyzer"
          }
        }
      },
      "caption": {
        "type": "keyword",
        "fields": {
          "analyzed": {
            "type": "text"
          },
          "ignoreCase": {
            "type": "text",
            "analyzer": "case_insensitive_analyzer"
          },
          "contains": {
            "type": "text",
            "analyzer": "contains_analyzer"
          }
        }
      },
      "collectionType": {
        "type": "keyword",
        "fields": {
          "analyzed": {
            "type": "text"
          },
          "ignoreCase": {
            "type": "text",
            "analyzer": "case_insensitive_analyzer"
          },
          "contains": {
            "type": "text",
            "analyzer": "contains_analyzer"
          }
        }
      },
      "copyrightText": {
        "type": "keyword",
        "fields": {
          "analyzed": {
            "type": "text"
          },
          "ignoreCase": {
            "type": "text",
            "analyzer": "case_insensitive_analyzer"
          }
        }
      },
      "creator": {
        "type": "keyword",
        "fields": {
          "analyzed": {
            "type": "text"
          },
          "ignoreCase": {
            "type": "text",
            "analyzer": "case_insensitive_analyzer"
          },
          "contains": {
            "type": "text",
            "analyzer": "contains_analyzer"
          }
        }
      },
      "dataGeneralizations": {
        "type": "keyword",
        "fields": {
          "analyzed": {
            "type": "text"
          },
          "ignoreCase": {
            "type": "text",
            "analyzer": "case_insensitive_analyzer"
          }
        }
      },
      "description": {
        "type": "keyword",
        "fields": {
          "analyzed": {
            "type": "text"
          },
          "ignoreCase": {
            "type": "text",
            "analyzer": "case_insensitive_analyzer"
          },
          "contains": {
            "type": "text",
            "analyzer": "contains_analyzer"
          }
        }
      },
      "gatheringEvents": {
        "type": "nested",
        "properties": {
          "altitude": {
            "type": "keyword",
            "fields": {
              "analyzed": {
                "type": "text"
              },
              "ignoreCase": {
                "type": "text",
                "analyzer": "case_insensitive_analyzer"
              }
            }
          },
          "altitudeUnifOfMeasurement": {
            "type": "keyword",
            "fields": {
              "analyzed": {
                "type": "text"
              },
              "ignoreCase": {
                "type": "text",
                "analyzer": "case_insensitive_analyzer"
              }
            }
          },
          "associatedTaxa": {
            "type": "nested",
            "properties": {
              "name": {
                "type": "keyword",
                "fields": {
                  "analyzed": {
                    "type": "text"
                  },
                  "ignoreCase": {
                    "type": "text",
                    "analyzer": "case_insensitive_analyzer"
                  },
                  "contains": {
                    "type": "text",
                    "analyzer": "contains_analyzer"
                  }
                }
              },
              "relationType": {
                "type": "keyword",
                "fields": {
                  "ignoreCase": {
                    "type": "text",
                    "analyzer": "case_insensitive_analyzer"
                  }
                }
              }
            }
          },
          "behavior": {
            "type": "keyword",
            "fields": {
              "analyzed": {
                "type": "text"
              },
              "ignoreCase": {
                "type": "text",
                "analyzer": "case_insensitive_analyzer"
              }
            }
          },
          "bioStratigraphy": {
            "type": "nested",
            "properties": {
              "bioDatingQualifier": {
                "type": "keyword",
                "fields": {
                  "analyzed": {
                    "type": "text"
                  },
                  "ignoreCase": {
                    "type": "text",
                    "analyzer": "case_insensitive_analyzer"
                  }
                }
              },
              "bioIdentifier": {
                "type": "keyword",
                "fields": {
                  "analyzed": {
                    "type": "text"
                  },
                  "ignoreCase": {
                    "type": "text",
                    "analyzer": "case_insensitive_analyzer"
                  }
                }
              },
              "bioPreferredFlag": {
                "type": "boolean"
              },
              "oldBioCertainty": {
                "type": "keyword",
                "fields": {
                  "analyzed": {
                    "type": "text"
                  },
                  "ignoreCase": {
                    "type": "text",
                    "analyzer": "case_insensitive_analyzer"
                  }
                }
              },
              "oldBioName": {
                "type": "keyword",
                "fields": {
                  "analyzed": {
                    "type": "text"
                  },
                  "ignoreCase": {
                    "type": "text",
                    "analyzer": "case_insensitive_analyzer"
                  }
                }
              },
              "oldBioStratType": {
                "type": "keyword",
                "fields": {
                  "analyzed": {
                    "type": "text"
                  },
                  "ignoreCase": {
                    "type": "text",
                    "analyzer": "case_insensitive_analyzer"
                  }
                }
              },
              "oldFossilSubzone": {
                "type": "keyword",
                "fields": {
                  "analyzed": {
                    "type": "text"
                  },
                  "ignoreCase": {
                    "type": "text",
                    "analyzer": "case_insensitive_analyzer"
                  }
                }
              },
              "oldFossilzone": {
                "type": "keyword",
                "fields": {
                  "analyzed": {
                    "type": "text"
                  },
                  "ignoreCase": {
                    "type": "text",
                    "analyzer": "case_insensitive_analyzer"
                  }
                }
              },
              "rangePosition": {
                "type": "keyword",
                "fields": {
                  "analyzed": {
                    "type": "text"
                  },
                  "ignoreCase": {
                    "type": "text",
                    "analyzer": "case_insensitive_analyzer"
                  }
                }
              },
              "youngBioCertainty": {
                "type": "keyword",
                "fields": {
                  "analyzed": {
                    "type": "text"
                  },
                  "ignoreCase": {
                    "type": "text",
                    "analyzer": "case_insensitive_analyzer"
                  }
                }
              },
              "youngBioDatingQualifier": {
                "type": "keyword",
                "fields": {
                  "analyzed": {
                    "type": "text"
                  },
                  "ignoreCase": {
                    "type": "text",
                    "analyzer": "case_insensitive_analyzer"
                  }
                }
              },
              "youngBioName": {
                "type": "keyword",
                "fields": {
                  "analyzed": {
                    "type": "text"
                  },
                  "ignoreCase": {
                    "type": "text",
                    "analyzer": "case_insensitive_analyzer"
                  }
                }
              },
              "youngFossilSubZone": {
                "type": "keyword",
                "fields": {
                  "analyzed": {
                    "type": "text"
                  },
                  "ignoreCase": {
                    "type": "text",
                    "analyzer": "case_insensitive_analyzer"
                  }
                }
              },
              "youngFossilZone": {
                "type": "keyword",
                "fields": {
                  "analyzed": {
                    "type": "text"
                  },
                  "ignoreCase": {
                    "type": "text",
                    "analyzer": "case_insensitive_analyzer"
                  }
                }
              },
              "youngStratType": {
                "type": "keyword",
                "fields": {
                  "analyzed": {
                    "type": "text"
                  },
                  "ignoreCase": {
                    "type": "text",
                    "analyzer": "case_insensitive_analyzer"
                  }
                }
              }
            }
          },
          "biotopeText": {
            "type": "keyword",
            "fields": {
              "analyzed": {
                "type": "text"
              },
              "ignoreCase": {
                "type": "text",
                "analyzer": "case_insensitive_analyzer"
              }
            }
          },
          "chronoStratigraphy": {
            "type": "nested",
            "properties": {
              "chronoIdentifier": {
                "type": "keyword",
                "fields": {
                  "analyzed": {
                    "type": "text"
                  },
                  "ignoreCase": {
                    "type": "text",
                    "analyzer": "case_insensitive_analyzer"
                  }
                }
              },
              "chronoPreferredFlag": {
                "type": "boolean"
              },
              "oldCertainty": {
                "type": "keyword",
                "fields": {
                  "analyzed": {
                    "type": "text"
                  },
                  "ignoreCase": {
                    "type": "text",
                    "analyzer": "case_insensitive_analyzer"
                  }
                }
              },
              "oldChronoName": {
                "type": "keyword",
                "fields": {
                  "analyzed": {
                    "type": "text"
                  },
                  "ignoreCase": {
                    "type": "text",
                    "analyzer": "case_insensitive_analyzer"
                  }
                }
              },
              "oldDatingQualifier": {
                "type": "keyword",
                "fields": {
                  "analyzed": {
                    "type": "text"
                  },
                  "ignoreCase": {
                    "type": "text",
                    "analyzer": "case_insensitive_analyzer"
                  }
                }
              },
              "oldInternEonothem": {
                "type": "keyword",
                "fields": {
                  "analyzed": {
                    "type": "text"
                  },
                  "ignoreCase": {
                    "type": "text",
                    "analyzer": "case_insensitive_analyzer"
                  }
                }
              },
              "oldInternErathem": {
                "type": "keyword",
                "fields": {
                  "analyzed": {
                    "type": "text"
                  },
                  "ignoreCase": {
                    "type": "text",
                    "analyzer": "case_insensitive_analyzer"
                  }
                }
              },
              "oldInternSeries": {
                "type": "keyword",
                "fields": {
                  "analyzed": {
                    "type": "text"
                  },
                  "ignoreCase": {
                    "type": "text",
                    "analyzer": "case_insensitive_analyzer"
                  }
                }
              },
              "oldInternStage": {
                "type": "keyword",
                "fields": {
                  "analyzed": {
                    "type": "text"
                  },
                  "ignoreCase": {
                    "type": "text",
                    "analyzer": "case_insensitive_analyzer"
                  }
                }
              },
              "oldInternSubstage": {
                "type": "keyword",
                "fields": {
                  "analyzed": {
                    "type": "text"
                  },
                  "ignoreCase": {
                    "type": "text",
                    "analyzer": "case_insensitive_analyzer"
                  }
                }
              },
              "oldInternSystem": {
                "type": "keyword",
                "fields": {
                  "analyzed": {
                    "type": "text"
                  },
                  "ignoreCase": {
                    "type": "text",
                    "analyzer": "case_insensitive_analyzer"
                  }
                }
              },
              "oldRegionalSeries": {
                "type": "keyword",
                "fields": {
                  "analyzed": {
                    "type": "text"
                  },
                  "ignoreCase": {
                    "type": "text",
                    "analyzer": "case_insensitive_analyzer"
                  }
                }
              },
              "oldRegionalStage": {
                "type": "keyword",
                "fields": {
                  "analyzed": {
                    "type": "text"
                  },
                  "ignoreCase": {
                    "type": "text",
                    "analyzer": "case_insensitive_analyzer"
                  }
                }
              },
              "oldRegionalSubstage": {
                "type": "keyword",
                "fields": {
                  "analyzed": {
                    "type": "text"
                  },
                  "ignoreCase": {
                    "type": "text",
                    "analyzer": "case_insensitive_analyzer"
                  }
                }
              },
              "youngCertainty": {
                "type": "keyword",
                "fields": {
                  "analyzed": {
                    "type": "text"
                  },
                  "ignoreCase": {
                    "type": "text",
                    "analyzer": "case_insensitive_analyzer"
                  }
                }
              },
              "youngChronoName": {
                "type": "keyword",
                "fields": {
                  "analyzed": {
                    "type": "text"
                  },
                  "ignoreCase": {
                    "type": "text",
                    "analyzer": "case_insensitive_analyzer"
                  }
                }
              },
              "youngDatingQualifier": {
                "type": "keyword",
                "fields": {
                  "analyzed": {
                    "type": "text"
                  },
                  "ignoreCase": {
                    "type": "text",
                    "analyzer": "case_insensitive_analyzer"
                  }
                }
              },
              "youngInternEonothem": {
                "type": "keyword",
                "fields": {
                  "analyzed": {
                    "type": "text"
                  },
                  "ignoreCase": {
                    "type": "text",
                    "analyzer": "case_insensitive_analyzer"
                  }
                }
              },
              "youngInternErathem": {
                "type": "keyword",
                "fields": {
                  "analyzed": {
                    "type": "text"
                  },
                  "ignoreCase": {
                    "type": "text",
                    "analyzer": "case_insensitive_analyzer"
                  }
                }
              },
              "youngInternSeries": {
                "type": "keyword",
                "fields": {
                  "analyzed": {
                    "type": "text"
                  },
                  "ignoreCase": {
                    "type": "text",
                    "analyzer": "case_insensitive_analyzer"
                  }
                }
              },
              "youngInternStage": {
                "type": "keyword",
                "fields": {
                  "analyzed": {
                    "type": "text"
                  },
                  "ignoreCase": {
                    "type": "text",
                    "analyzer": "case_insensitive_analyzer"
                  }
                }
              },
              "youngInternSubstage": {
                "type": "keyword",
                "fields": {
                  "analyzed": {
                    "type": "text"
                  },
                  "ignoreCase": {
                    "type": "text",
                    "analyzer": "case_insensitive_analyzer"
                  }
                }
              },
              "youngInternSystem": {
                "type": "keyword",
                "fields": {
                  "analyzed": {
                    "type": "text"
                  },
                  "ignoreCase": {
                    "type": "text",
                    "analyzer": "case_insensitive_analyzer"
                  }
                }
              },
              "youngRegionalSeries": {
                "type": "keyword",
                "fields": {
                  "analyzed": {
                    "type": "text"
                  },
                  "ignoreCase": {
                    "type": "text",
                    "analyzer": "case_insensitive_analyzer"
                  }
                }
              },
              "youngRegionalStage": {
                "type": "keyword",
                "fields": {
                  "analyzed": {
                    "type": "text"
                  },
                  "ignoreCase": {
                    "type": "text",
                    "analyzer": "case_insensitive_analyzer"
                  }
                }
              },
              "youngRegionalSubstage": {
                "type": "keyword",
                "fields": {
                  "analyzed": {
                    "type": "text"
                  },
                  "ignoreCase": {
                    "type": "text",
                    "analyzer": "case_insensitive_analyzer"
                  }
                }
              }
            }
          },
          "city": {
            "type": "keyword",
            "fields": {
              "analyzed": {
                "type": "text"
              },
              "ignoreCase": {
                "type": "text",
                "analyzer": "case_insensitive_analyzer"
              },
              "contains": {
                "type": "text",
                "analyzer": "contains_analyzer"
              }
            }
          },
          "code": {
            "type": "keyword",
            "fields": {
              "analyzed": {
                "type": "text"
              },
              "ignoreCase": {
                "type": "text",
                "analyzer": "case_insensitive_analyzer"
              }
            }
          },
          "continent": {
            "type": "keyword",
            "fields": {
              "analyzed": {
                "type": "text"
              },
              "ignoreCase": {
                "type": "text",
                "analyzer": "case_insensitive_analyzer"
              },
              "contains": {
                "type": "text",
                "analyzer": "contains_analyzer"
              }
            }
          },
          "country": {
            "type": "keyword",
            "fields": {
              "analyzed": {
                "type": "text"
              },
              "ignoreCase": {
                "type": "text",
                "analyzer": "case_insensitive_analyzer"
              },
              "contains": {
                "type": "text",
                "analyzer": "contains_analyzer"
              }
            }
          },
          "dateText": {
            "type": "keyword",
            "fields": {
              "analyzed": {
                "type": "text"
              },
              "ignoreCase": {
                "type": "text",
                "analyzer": "case_insensitive_analyzer"
              }
            }
          },
          "dateTimeBegin": {
            "type": "date",
            "format": "yyyy-MM-dd'T'HH:mm:ssZ||basic_date_time||strict_date_hour_minute_second"
          },
          "dateTimeEnd": {
            "type": "date",
            "format": "yyyy-MM-dd'T'HH:mm:ssZ||basic_date_time||strict_date_hour_minute_second"
          },
          "depth": {
            "type": "keyword",
            "fields": {
              "analyzed": {
                "type": "text"
              },
              "ignoreCase": {
                "type": "text",
                "analyzer": "case_insensitive_analyzer"
              }
            }
          },
          "depthUnitOfMeasurement": {
            "type": "keyword",
            "fields": {
              "analyzed": {
                "type": "text"
              },
              "ignoreCase": {
                "type": "text",
                "analyzer": "case_insensitive_analyzer"
              }
            }
          },
          "establishmentMeans": {
            "type": "keyword",
            "fields": {
              "analyzed": {
                "type": "text"
              },
              "ignoreCase": {
                "type": "text",
                "analyzer": "case_insensitive_analyzer"
              }
            }
          },
          "gatheringOrganizations": {
            "type": "nested",
            "properties": {
              "agentText": {
                "type": "keyword",
                "fields": {
                  "analyzed": {
                    "type": "text"
                  },
                  "ignoreCase": {
                    "type": "text",
                    "analyzer": "case_insensitive_analyzer"
                  }
                }
              },
              "name": {
                "type": "keyword",
                "fields": {
                  "analyzed": {
                    "type": "text"
                  },
                  "ignoreCase": {
                    "type": "text",
                    "analyzer": "case_insensitive_analyzer"
                  },
                  "contains": {
                    "type": "text",
                    "analyzer": "contains_analyzer"
                  }
                }
              }
            }
          },
          "gatheringPersons": {
            "type": "nested",
            "properties": {
              "agentText": {
                "type": "keyword",
                "fields": {
                  "analyzed": {
                    "type": "text"
                  },
                  "ignoreCase": {
                    "type": "text",
                    "analyzer": "case_insensitive_analyzer"
                  }
                }
              },
              "fullName": {
                "type": "keyword",
                "fields": {
                  "analyzed": {
                    "type": "text"
                  },
                  "ignoreCase": {
                    "type": "text",
                    "analyzer": "case_insensitive_analyzer"
                  },
                  "contains": {
                    "type": "text",
                    "analyzer": "contains_analyzer"
                  }
                }
              },
              "organization": {
                "properties": {
                  "agentText": {
                    "type": "keyword",
                    "fields": {
                      "analyzed": {
                        "type": "text"
                      },
                      "ignoreCase": {
                        "type": "text",
                        "analyzer": "case_insensitive_analyzer"
                      }
                    }
                  },
                  "name": {
                    "type": "keyword",
                    "fields": {
                      "analyzed": {
                        "type": "text"
                      },
                      "ignoreCase": {
                        "type": "text",
                        "analyzer": "case_insensitive_analyzer"
                      },
                      "contains": {
                        "type": "text",
                        "analyzer": "contains_analyzer"
                      }
                    }
                  }
                }
              }
            }
          },
          "island": {
            "type": "keyword",
            "fields": {
              "analyzed": {
                "type": "text"
              },
              "ignoreCase": {
                "type": "text",
                "analyzer": "case_insensitive_analyzer"
              },
              "contains": {
                "type": "text",
                "analyzer": "contains_analyzer"
              }
            }
          },
          "iso3166Code": {
            "type": "keyword",
            "fields": {
              "analyzed": {
                "type": "text"
              },
              "ignoreCase": {
                "type": "text",
                "analyzer": "case_insensitive_analyzer"
              }
            }
          },
          "lithoStratigraphy": {
            "type": "nested",
            "properties": {
              "bed": {
                "type": "keyword",
                "fields": {
                  "analyzed": {
                    "type": "text"
                  },
                  "ignoreCase": {
                    "type": "text",
                    "analyzer": "case_insensitive_analyzer"
                  }
                }
              },
              "bed2": {
                "type": "keyword",
                "fields": {
                  "analyzed": {
                    "type": "text"
                  },
                  "ignoreCase": {
                    "type": "text",
                    "analyzer": "case_insensitive_analyzer"
                  }
                }
              },
              "certainty": {
                "type": "keyword",
                "fields": {
                  "analyzed": {
                    "type": "text"
                  },
                  "ignoreCase": {
                    "type": "text",
                    "analyzer": "case_insensitive_analyzer"
                  }
                }
              },
              "certainty2": {
                "type": "keyword",
                "fields": {
                  "analyzed": {
                    "type": "text"
                  },
                  "ignoreCase": {
                    "type": "text",
                    "analyzer": "case_insensitive_analyzer"
                  }
                }
              },
              "formation": {
                "type": "keyword",
                "fields": {
                  "analyzed": {
                    "type": "text"
                  },
                  "ignoreCase": {
                    "type": "text",
                    "analyzer": "case_insensitive_analyzer"
                  }
                }
              },
              "formation2": {
                "type": "keyword",
                "fields": {
                  "analyzed": {
                    "type": "text"
                  },
                  "ignoreCase": {
                    "type": "text",
                    "analyzer": "case_insensitive_analyzer"
                  }
                }
              },
              "formationGroup": {
                "type": "keyword",
                "fields": {
                  "analyzed": {
                    "type": "text"
                  },
                  "ignoreCase": {
                    "type": "text",
                    "analyzer": "case_insensitive_analyzer"
                  }
                }
              },
              "formationGroup2": {
                "type": "keyword",
                "fields": {
                  "analyzed": {
                    "type": "text"
                  },
                  "ignoreCase": {
                    "type": "text",
                    "analyzer": "case_insensitive_analyzer"
                  }
                }
              },
              "importedName1": {
                "type": "keyword",
                "fields": {
                  "analyzed": {
                    "type": "text"
                  },
                  "ignoreCase": {
                    "type": "text",
                    "analyzer": "case_insensitive_analyzer"
                  }
                }
              },
              "importedName2": {
                "type": "keyword",
                "fields": {
                  "analyzed": {
                    "type": "text"
                  },
                  "ignoreCase": {
                    "type": "text",
                    "analyzer": "case_insensitive_analyzer"
                  }
                }
              },
              "informalName": {
                "type": "keyword",
                "fields": {
                  "analyzed": {
                    "type": "text"
                  },
                  "ignoreCase": {
                    "type": "text",
                    "analyzer": "case_insensitive_analyzer"
                  }
                }
              },
              "informalName2": {
                "type": "keyword",
                "fields": {
                  "analyzed": {
                    "type": "text"
                  },
                  "ignoreCase": {
                    "type": "text",
                    "analyzer": "case_insensitive_analyzer"
                  }
                }
              },
              "lithoIdentifier": {
                "type": "keyword",
                "fields": {
                  "analyzed": {
                    "type": "text"
                  },
                  "ignoreCase": {
                    "type": "text",
                    "analyzer": "case_insensitive_analyzer"
                  }
                }
              },
              "member": {
                "type": "keyword",
                "fields": {
                  "analyzed": {
                    "type": "text"
                  },
                  "ignoreCase": {
                    "type": "text",
                    "analyzer": "case_insensitive_analyzer"
                  }
                }
              },
              "member2": {
                "type": "keyword",
                "fields": {
                  "analyzed": {
                    "type": "text"
                  },
                  "ignoreCase": {
                    "type": "text",
                    "analyzer": "case_insensitive_analyzer"
                  }
                }
              },
              "preferredFlag": {
                "type": "boolean"
              },
              "qualifier": {
                "type": "keyword",
                "fields": {
                  "analyzed": {
                    "type": "text"
                  },
                  "ignoreCase": {
                    "type": "text",
                    "analyzer": "case_insensitive_analyzer"
                  }
                }
              }
            }
          },
          "locality": {
            "type": "keyword",
            "fields": {
              "analyzed": {
                "type": "text"
              },
              "ignoreCase": {
                "type": "text",
                "analyzer": "case_insensitive_analyzer"
              },
              "contains": {
                "type": "text",
                "analyzer": "contains_analyzer"
              }
            }
          },
          "localityText": {
            "type": "keyword",
            "fields": {
              "analyzed": {
                "type": "text"
              },
              "ignoreCase": {
                "type": "text",
                "analyzer": "case_insensitive_analyzer"
              },
              "contains": {
                "type": "text",
                "analyzer": "contains_analyzer"
              }
            }
          },
          "method": {
            "type": "keyword",
            "fields": {
              "analyzed": {
                "type": "text"
              },
              "ignoreCase": {
                "type": "text",
                "analyzer": "case_insensitive_analyzer"
              }
            }
          },
          "namedAreas": {
            "type": "nested",
            "properties": {
              "areaClass": {
                "type": "keyword",
                "fields": {
                  "ignoreCase": {
                    "type": "text",
                    "analyzer": "case_insensitive_analyzer"
                  }
                }
              },
              "areaName": {
                "type": "keyword",
                "fields": {
                  "analyzed": {
                    "type": "text"
                  },
                  "ignoreCase": {
                    "type": "text",
                    "analyzer": "case_insensitive_analyzer"
                  },
                  "contains": {
                    "type": "text",
                    "analyzer": "contains_analyzer"
                  }
                }
              }
            }
          },
          "projectTitle": {
            "type": "keyword",
            "fields": {
              "analyzed": {
                "type": "text"
              },
              "ignoreCase": {
                "type": "text",
                "analyzer": "case_insensitive_analyzer"
              },
              "contains": {
                "type": "text",
                "analyzer": "contains_analyzer"
              }
            }
          },
          "provinceState": {
            "type": "keyword",
            "fields": {
              "analyzed": {
                "type": "text"
              },
              "ignoreCase": {
                "type": "text",
                "analyzer": "case_insensitive_analyzer"
              },
              "contains": {
                "type": "text",
                "analyzer": "contains_analyzer"
              }
            }
          },
          "siteCoordinates": {
            "type": "nested",
            "properties": {
              "coordinateErrorDistanceInMeters": {
                "type": "integer"
              },
              "geoShape": {
                "type": "geo_shape",
                "precision": "5000.0m",
                "points_only": true
              },
              "gridCellCode": {
                "type": "keyword",
                "fields": {
                  "analyzed": {
                    "type": "text"
                  },
                  "ignoreCase": {
                    "type": "text",
                    "analyzer": "case_insensitive_analyzer"
                  }
                }
              },
              "gridCellSystem": {
                "type": "keyword",
                "fields": {
                  "analyzed": {
                    "type": "text"
                  },
                  "ignoreCase": {
                    "type": "text",
                    "analyzer": "case_insensitive_analyzer"
                  }
                }
              },
              "gridLatitudeDecimal": {
                "type": "double"
              },
              "gridLongitudeDecimal": {
                "type": "double"
              },
              "gridQualifier": {
                "type": "keyword",
                "fields": {
                  "analyzed": {
                    "type": "text"
                  },
                  "ignoreCase": {
                    "type": "text",
                    "analyzer": "case_insensitive_analyzer"
                  }
                }
              },
              "latitudeDecimal": {
                "type": "double"
              },
              "longitudeDecimal": {
                "type": "double"
              },
              "spatialDatum": {
                "type": "keyword",
                "fields": {
                  "analyzed": {
                    "type": "text"
                  },
                  "ignoreCase": {
                    "type": "text",
                    "analyzer": "case_insensitive_analyzer"
                  }
                }
              }
            }
          },
          "sublocality": {
            "type": "keyword",
            "fields": {
              "analyzed": {
                "type": "text"
              },
              "ignoreCase": {
                "type": "text",
                "analyzer": "case_insensitive_analyzer"
              },
              "contains": {
                "type": "text",
                "analyzer": "contains_analyzer"
              }
            }
          },
          "worldRegion": {
            "type": "keyword",
            "fields": {
              "analyzed": {
                "type": "text"
              },
              "ignoreCase": {
                "type": "text",
                "analyzer": "case_insensitive_analyzer"
              },
              "contains": {
                "type": "text",
                "analyzer": "contains_analyzer"
              }
            }
          }
        }
      },
      "identifications": {
        "type": "nested",
        "properties": {
          "dateIdentified": {
            "type": "date",
            "format": "yyyy-MM-dd'T'HH:mm:ssZ||basic_date_time||strict_date_hour_minute_second"
          },
          "defaultClassification": {
            "properties": {
              "domain": {
                "type": "keyword",
                "fields": {
                  "analyzed": {
                    "type": "text"
                  },
                  "ignoreCase": {
                    "type": "text",
                    "analyzer": "case_insensitive_analyzer"
                  },
                  "contains": {
                    "type": "text",
                    "analyzer": "contains_analyzer"
                  }
                }
              },
              "kingdom": {
                "type": "keyword",
                "fields": {
                  "analyzed": {
                    "type": "text"
                  },
                  "ignoreCase": {
                    "type": "text",
                    "analyzer": "case_insensitive_analyzer"
                  },
                  "contains": {
                    "type": "text",
                    "analyzer": "contains_analyzer"
                  }
                }
              },
              "subKingdom": {
                "type": "keyword",
                "fields": {
                  "analyzed": {
                    "type": "text"
                  },
                  "ignoreCase": {
                    "type": "text",
                    "analyzer": "case_insensitive_analyzer"
                  },
                  "contains": {
                    "type": "text",
                    "analyzer": "contains_analyzer"
                  }
                }
              },
              "phylum": {
                "type": "keyword",
                "fields": {
                  "analyzed": {
                    "type": "text"
                  },
                  "ignoreCase": {
                    "type": "text",
                    "analyzer": "case_insensitive_analyzer"
                  },
                  "contains": {
                    "type": "text",
                    "analyzer": "contains_analyzer"
                  }
                }
              },
              "subPhylum": {
                "type": "keyword",
                "fields": {
                  "analyzed": {
                    "type": "text"
                  },
                  "ignoreCase": {
                    "type": "text",
                    "analyzer": "case_insensitive_analyzer"
                  },
                  "contains": {
                    "type": "text",
                    "analyzer": "contains_analyzer"
                  }
                }
              },
              "superClass": {
                "type": "keyword",
                "fields": {
                  "analyzed": {
                    "type": "text"
                  },
                  "ignoreCase": {
                    "type": "text",
                    "analyzer": "case_insensitive_analyzer"
                  },
                  "contains": {
                    "type": "text",
                    "analyzer": "contains_analyzer"
                  }
                }
              },
              "className": {
                "type": "keyword",
                "fields": {
                  "analyzed": {
                    "type": "text"
                  },
                  "ignoreCase": {
                    "type": "text",
                    "analyzer": "case_insensitive_analyzer"
                  },
                  "contains": {
                    "type": "text",
                    "analyzer": "contains_analyzer"
                  }
                }
              },
              "subClass": {
                "type": "keyword",
                "fields": {
                  "analyzed": {
                    "type": "text"
                  },
                  "ignoreCase": {
                    "type": "text",
                    "analyzer": "case_insensitive_analyzer"
                  },
                  "contains": {
                    "type": "text",
                    "analyzer": "contains_analyzer"
                  }
                }
              },
              "superOrder": {
                "type": "keyword",
                "fields": {
                  "analyzed": {
                    "type": "text"
                  },
                  "ignoreCase": {
                    "type": "text",
                    "analyzer": "case_insensitive_analyzer"
                  },
                  "contains": {
                    "type": "text",
                    "analyzer": "contains_analyzer"
                  }
                }
              },
              "order": {
                "type": "keyword",
                "fields": {
                  "analyzed": {
                    "type": "text"
                  },
                  "ignoreCase": {
                    "type": "text",
                    "analyzer": "case_insensitive_analyzer"
                  },
                  "contains": {
                    "type": "text",
                    "analyzer": "contains_analyzer"
                  }
                }
              },
              "subOrder": {
                "type": "keyword",
                "fields": {
                  "analyzed": {
                    "type": "text"
                  },
                  "ignoreCase": {
                    "type": "text",
                    "analyzer": "case_insensitive_analyzer"
                  },
                  "contains": {
                    "type": "text",
                    "analyzer": "contains_analyzer"
                  }
                }
              },
              "infraOrder": {
                "type": "keyword",
                "fields": {
                  "analyzed": {
                    "type": "text"
                  },
                  "ignoreCase": {
                    "type": "text",
                    "analyzer": "case_insensitive_analyzer"
                  },
                  "contains": {
                    "type": "text",
                    "analyzer": "contains_analyzer"
                  }
                }
              },
              "superFamily": {
                "type": "keyword",
                "fields": {
                  "analyzed": {
                    "type": "text"
                  },
                  "ignoreCase": {
                    "type": "text",
                    "analyzer": "case_insensitive_analyzer"
                  },
                  "contains": {
                    "type": "text",
                    "analyzer": "contains_analyzer"
                  }
                }
              },
              "family": {
                "type": "keyword",
                "fields": {
                  "analyzed": {
                    "type": "text"
                  },
                  "ignoreCase": {
                    "type": "text",
                    "analyzer": "case_insensitive_analyzer"
                  },
                  "contains": {
                    "type": "text",
                    "analyzer": "contains_analyzer"
                  }
                }
              },
              "subFamily": {
                "type": "keyword",
                "fields": {
                  "analyzed": {
                    "type": "text"
                  },
                  "ignoreCase": {
                    "type": "text",
                    "analyzer": "case_insensitive_analyzer"
                  },
                  "contains": {
                    "type": "text",
                    "analyzer": "contains_analyzer"
                  }
                }
              },
              "tribe": {
                "type": "keyword",
                "fields": {
                  "analyzed": {
                    "type": "text"
                  },
                  "ignoreCase": {
                    "type": "text",
                    "analyzer": "case_insensitive_analyzer"
                  },
                  "contains": {
                    "type": "text",
                    "analyzer": "contains_analyzer"
                  }
                }
              },
              "subTribe": {
                "type": "keyword",
                "fields": {
                  "analyzed": {
                    "type": "text"
                  },
                  "ignoreCase": {
                    "type": "text",
                    "analyzer": "case_insensitive_analyzer"
                  },
                  "contains": {
                    "type": "text",
                    "analyzer": "contains_analyzer"
                  }
                }
              },
              "genus": {
                "type": "keyword",
                "fields": {
                  "analyzed": {
                    "type": "text"
                  },
                  "ignoreCase": {
                    "type": "text",
                    "analyzer": "case_insensitive_analyzer"
                  },
                  "contains": {
                    "type": "text",
                    "analyzer": "contains_analyzer"
                  }
                }
              },
              "subgenus": {
                "type": "keyword",
                "fields": {
                  "analyzed": {
                    "type": "text"
                  },
                  "ignoreCase": {
                    "type": "text",
                    "analyzer": "case_insensitive_analyzer"
                  },
                  "contains": {
                    "type": "text",
                    "analyzer": "contains_analyzer"
                  }
                }
              },
              "specificEpithet": {
                "type": "keyword",
                "fields": {
                  "analyzed": {
                    "type": "text"
                  },
                  "ignoreCase": {
                    "type": "text",
                    "analyzer": "case_insensitive_analyzer"
                  },
                  "contains": {
                    "type": "text",
                    "analyzer": "contains_analyzer"
                  }
                }
              },
              "infraspecificRank": {
                "type": "keyword",
                "fields": {
                  "analyzed": {
                    "type": "text"
                  },
                  "ignoreCase": {
                    "type": "text",
                    "analyzer": "case_insensitive_analyzer"
                  },
                  "contains": {
                    "type": "text",
                    "analyzer": "contains_analyzer"
                  }
                }
              },
              "infraspecificEpithet": {
                "type": "keyword",
                "fields": {
                  "analyzed": {
                    "type": "text"
                  },
                  "ignoreCase": {
                    "type": "text",
                    "analyzer": "case_insensitive_analyzer"
                  },
                  "contains": {
                    "type": "text",
                    "analyzer": "contains_analyzer"
                  }
                }
              }
            }
          },
          "identificationQualifiers": {
            "type": "keyword",
            "fields": {
              "analyzed": {
                "type": "text"
              },
              "ignoreCase": {
                "type": "text",
                "analyzer": "case_insensitive_analyzer"
              }
            }
          },
          "identifiers": {
            "type": "nested",
            "properties": {
              "agentText": {
                "type": "keyword",
                "fields": {
                  "analyzed": {
                    "type": "text"
                  },
                  "ignoreCase": {
                    "type": "text",
                    "analyzer": "case_insensitive_analyzer"
                  }
                }
              }
            }
          },
          "scientificName": {
            "properties": {
              "author": {
                "type": "keyword",
                "fields": {
                  "analyzed": {
                    "type": "text"
                  },
                  "ignoreCase": {
                    "type": "text",
                    "analyzer": "case_insensitive_analyzer"
                  },
                  "contains": {
                    "type": "text",
                    "analyzer": "contains_analyzer"
                  }
                }
              },
              "authorshipVerbatim": {
                "type": "keyword",
                "fields": {
                  "analyzed": {
                    "type": "text"
                  },
                  "ignoreCase": {
                    "type": "text",
                    "analyzer": "case_insensitive_analyzer"
                  },
                  "contains": {
                    "type": "text",
                    "analyzer": "contains_analyzer"
                  }
                }
              },
              "experts": {
                "type": "nested",
                "properties": {
                  "agentText": {
                    "type": "keyword",
                    "fields": {
                      "analyzed": {
                        "type": "text"
                      },
                      "ignoreCase": {
                        "type": "text",
                        "analyzer": "case_insensitive_analyzer"
                      }
                    }
                  },
                  "fullName": {
                    "type": "keyword",
                    "fields": {
                      "analyzed": {
                        "type": "text"
                      },
                      "ignoreCase": {
                        "type": "text",
                        "analyzer": "case_insensitive_analyzer"
                      },
                      "contains": {
                        "type": "text",
                        "analyzer": "contains_analyzer"
                      }
                    }
                  },
                  "organization": {
                    "properties": {
                      "agentText": {
                        "type": "keyword",
                        "fields": {
                          "analyzed": {
                            "type": "text"
                          },
                          "ignoreCase": {
                            "type": "text",
                            "analyzer": "case_insensitive_analyzer"
                          }
                        }
                      },
                      "name": {
                        "type": "keyword",
                        "fields": {
                          "analyzed": {
                            "type": "text"
                          },
                          "ignoreCase": {
                            "type": "text",
                            "analyzer": "case_insensitive_analyzer"
                          },
                          "contains": {
                            "type": "text",
                            "analyzer": "contains_analyzer"
                          }
                        }
                      }
                    }
                  }
                }
              },
              "fullScientificName": {
                "type": "keyword",
                "fields": {
                  "analyzed": {
                    "type": "text"
                  },
                  "ignoreCase": {
                    "type": "text",
                    "analyzer": "case_insensitive_analyzer"
                  },
                  "contains": {
                    "type": "text",
                    "analyzer": "contains_analyzer"
                  }
                }
              },
              "genusOrMonomial": {
                "type": "keyword",
                "fields": {
                  "analyzed": {
                    "type": "text"
                  },
                  "ignoreCase": {
                    "type": "text",
                    "analyzer": "case_insensitive_analyzer"
                  },
                  "contains": {
                    "type": "text",
                    "analyzer": "contains_analyzer"
                  }
                }
              },
              "infraspecificEpithet": {
                "type": "keyword",
                "fields": {
                  "analyzed": {
                    "type": "text"
                  },
                  "ignoreCase": {
                    "type": "text",
                    "analyzer": "case_insensitive_analyzer"
                  },
                  "contains": {
                    "type": "text",
                    "analyzer": "contains_analyzer"
                  }
                }
              },
              "infraspecificMarker": {
                "type": "keyword",
                "fields": {
                  "analyzed": {
                    "type": "text"
                  },
                  "ignoreCase": {
                    "type": "text",
                    "analyzer": "case_insensitive_analyzer"
                  }
                }
              },
              "nameAddendum": {
                "type": "keyword",
                "fields": {
                  "analyzed": {
                    "type": "text"
                  },
                  "ignoreCase": {
                    "type": "text",
                    "analyzer": "case_insensitive_analyzer"
                  }
                }
              },
              "references": {
                "type": "nested",
                "properties": {
                  "author": {
                    "properties": {
                      "agentText": {
                        "type": "keyword",
                        "fields": {
                          "analyzed": {
                            "type": "text"
                          },
                          "ignoreCase": {
                            "type": "text",
                            "analyzer": "case_insensitive_analyzer"
                          }
                        }
                      },
                      "fullName": {
                        "type": "keyword",
                        "fields": {
                          "analyzed": {
                            "type": "text"
                          },
                          "ignoreCase": {
                            "type": "text",
                            "analyzer": "case_insensitive_analyzer"
                          },
                          "contains": {
                            "type": "text",
                            "analyzer": "contains_analyzer"
                          }
                        }
                      },
                      "organization": {
                        "properties": {
                          "agentText": {
                            "type": "keyword",
                            "fields": {
                              "analyzed": {
                                "type": "text"
                              },
                              "ignoreCase": {
                                "type": "text",
                                "analyzer": "case_insensitive_analyzer"
                              }
                            }
                          },
                          "name": {
                            "type": "keyword",
                            "fields": {
                              "analyzed": {
                                "type": "text"
                              },
                              "ignoreCase": {
                                "type": "text",
                                "analyzer": "case_insensitive_analyzer"
                              },
                              "contains": {
                                "type": "text",
                                "analyzer": "contains_analyzer"
                              }
                            }
                          }
                        }
                      }
                    }
                  },
                  "citationDetail": {
                    "type": "keyword",
                    "fields": {
                      "analyzed": {
                        "type": "text"
                      },
                      "ignoreCase": {
                        "type": "text",
                        "analyzer": "case_insensitive_analyzer"
                      }
                    }
                  },
                  "publicationDate": {
                    "type": "date",
                    "format": "yyyy-MM-dd'T'HH:mm:ssZ||basic_date_time||strict_date_hour_minute_second"
                  },
                  "titleCitation": {
                    "type": "keyword",
                    "fields": {
                      "analyzed": {
                        "type": "text"
                      },
                      "ignoreCase": {
                        "type": "text",
                        "analyzer": "case_insensitive_analyzer"
                      }
                    }
                  },
                  "uri": {
                    "type": "keyword",
                    "fields": {
                      "analyzed": {
                        "type": "text"
                      },
                      "ignoreCase": {
                        "type": "text",
                        "analyzer": "case_insensitive_analyzer"
                      }
                    }
                  }
                }
              },
              "scientificNameGroup": {
                "type": "keyword",
                "fields": {
                  "analyzed": {
                    "type": "text"
                  },
                  "ignoreCase": {
                    "type": "text",
                    "analyzer": "case_insensitive_analyzer"
                  },
                  "contains": {
                    "type": "text",
                    "analyzer": "contains_analyzer"
                  }
                }
              },
              "specificEpithet": {
                "type": "keyword",
                "fields": {
                  "analyzed": {
                    "type": "text"
                  },
                  "ignoreCase": {
                    "type": "text",
                    "analyzer": "case_insensitive_analyzer"
                  },
                  "contains": {
                    "type": "text",
                    "analyzer": "contains_analyzer"
                  }
                }
              },
              "subgenus": {
                "type": "keyword",
                "fields": {
                  "analyzed": {
                    "type": "text"
                  },
                  "ignoreCase": {
                    "type": "text",
                    "analyzer": "case_insensitive_analyzer"
                  },
                  "contains": {
                    "type": "text",
                    "analyzer": "contains_analyzer"
                  }
                }
              },
              "taxonomicStatus": {
                "type": "keyword",
                "fields": {
                  "analyzed": {
                    "type": "text"
                  },
                  "ignoreCase": {
                    "type": "text",
                    "analyzer": "case_insensitive_analyzer"
                  }
                }
              },
              "year": {
                "type": "keyword",
                "fields": {
                  "analyzed": {
                    "type": "text"
                  },
                  "ignoreCase": {
                    "type": "text",
                    "analyzer": "case_insensitive_analyzer"
                  }
                }
              }
            }
          },
          "systemClassification": {
            "type": "nested",
            "properties": {
              "name": {
                "type": "keyword",
                "fields": {
                  "analyzed": {
                    "type": "text"
                  },
                  "ignoreCase": {
                    "type": "text",
                    "analyzer": "case_insensitive_analyzer"
                  },
                  "contains": {
                    "type": "text",
                    "analyzer": "contains_analyzer"
                  }
                }
              },
              "rank": {
                "type": "keyword",
                "fields": {
                  "analyzed": {
                    "type": "text"
                  },
                  "ignoreCase": {
                    "type": "text",
                    "analyzer": "case_insensitive_analyzer"
                  }
                }
              }
            }
          },
          "taxonRank": {
            "type": "keyword",
            "fields": {
              "analyzed": {
                "type": "text"
              },
              "ignoreCase": {
                "type": "text",
                "analyzer": "case_insensitive_analyzer"
              }
            }
          },
          "taxonomicEnrichments": {
            "type": "nested",
            "properties": {
              "defaultClassification": {
                "properties": {
                  "className": {
                    "type": "keyword",
                    "fields": {
                      "analyzed": {
                        "type": "text"
                      },
                      "ignoreCase": {
                        "type": "text",
                        "analyzer": "case_insensitive_analyzer"
                      },
                      "contains": {
                        "type": "text",
                        "analyzer": "contains_analyzer"
                      }
                    }
                  },
                  "family": {
                    "type": "keyword",
                    "fields": {
                      "analyzed": {
                        "type": "text"
                      },
                      "ignoreCase": {
                        "type": "text",
                        "analyzer": "case_insensitive_analyzer"
                      },
                      "contains": {
                        "type": "text",
                        "analyzer": "contains_analyzer"
                      }
                    }
                  },
                  "genus": {
                    "type": "keyword",
                    "fields": {
                      "analyzed": {
                        "type": "text"
                      },
                      "ignoreCase": {
                        "type": "text",
                        "analyzer": "case_insensitive_analyzer"
                      },
                      "contains": {
                        "type": "text",
                        "analyzer": "contains_analyzer"
                      }
                    }
                  },
                  "infraspecificEpithet": {
                    "type": "keyword",
                    "fields": {
                      "analyzed": {
                        "type": "text"
                      },
                      "ignoreCase": {
                        "type": "text",
                        "analyzer": "case_insensitive_analyzer"
                      },
                      "contains": {
                        "type": "text",
                        "analyzer": "contains_analyzer"
                      }
                    }
                  },
                  "infraspecificRank": {
                    "type": "keyword",
                    "fields": {
                      "analyzed": {
                        "type": "text"
                      },
                      "ignoreCase": {
                        "type": "text",
                        "analyzer": "case_insensitive_analyzer"
                      },
                      "contains": {
                        "type": "text",
                        "analyzer": "contains_analyzer"
                      }
                    }
                  },
                  "kingdom": {
                    "type": "keyword",
                    "fields": {
                      "analyzed": {
                        "type": "text"
                      },
                      "ignoreCase": {
                        "type": "text",
                        "analyzer": "case_insensitive_analyzer"
                      },
                      "contains": {
                        "type": "text",
                        "analyzer": "contains_analyzer"
                      }
                    }
                  },
                  "order": {
                    "type": "keyword",
                    "fields": {
                      "analyzed": {
                        "type": "text"
                      },
                      "ignoreCase": {
                        "type": "text",
                        "analyzer": "case_insensitive_analyzer"
                      },
                      "contains": {
                        "type": "text",
                        "analyzer": "contains_analyzer"
                      }
                    }
                  },
                  "phylum": {
                    "type": "keyword",
                    "fields": {
                      "analyzed": {
                        "type": "text"
                      },
                      "ignoreCase": {
                        "type": "text",
                        "analyzer": "case_insensitive_analyzer"
                      },
                      "contains": {
                        "type": "text",
                        "analyzer": "contains_analyzer"
                      }
                    }
                  },
                  "specificEpithet": {
                    "type": "keyword",
                    "fields": {
                      "analyzed": {
                        "type": "text"
                      },
                      "ignoreCase": {
                        "type": "text",
                        "analyzer": "case_insensitive_analyzer"
                      },
                      "contains": {
                        "type": "text",
                        "analyzer": "contains_analyzer"
                      }
                    }
                  },
                  "subgenus": {
                    "type": "keyword",
                    "fields": {
                      "analyzed": {
                        "type": "text"
                      },
                      "ignoreCase": {
                        "type": "text",
                        "analyzer": "case_insensitive_analyzer"
                      },
                      "contains": {
                        "type": "text",
                        "analyzer": "contains_analyzer"
                      }
                    }
                  },
                  "superFamily": {
                    "type": "keyword",
                    "fields": {
                      "analyzed": {
                        "type": "text"
                      },
                      "ignoreCase": {
                        "type": "text",
                        "analyzer": "case_insensitive_analyzer"
                      },
                      "contains": {
                        "type": "text",
                        "analyzer": "contains_analyzer"
                      }
                    }
                  }
                }
              },
              "sourceSystem": {
                "properties": {
                  "code": {
                    "type": "keyword",
                    "fields": {
                      "analyzed": {
                        "type": "text"
                      },
                      "ignoreCase": {
                        "type": "text",
                        "analyzer": "case_insensitive_analyzer"
                      }
                    }
                  }
                }
              },
              "synonyms": {
                "type": "nested",
                "properties": {
                  "authorshipVerbatim": {
                    "type": "keyword",
                    "fields": {
                      "analyzed": {
                        "type": "text"
                      },
                      "ignoreCase": {
                        "type": "text",
                        "analyzer": "case_insensitive_analyzer"
                      },
                      "contains": {
                        "type": "text",
                        "analyzer": "contains_analyzer"
                      }
                    }
                  },
                  "fullScientificName": {
                    "type": "keyword",
                    "fields": {
                      "analyzed": {
                        "type": "text"
                      },
                      "ignoreCase": {
                        "type": "text",
                        "analyzer": "case_insensitive_analyzer"
                      },
                      "contains": {
                        "type": "text",
                        "analyzer": "contains_analyzer"
                      }
                    }
                  },
                  "genusOrMonomial": {
                    "type": "keyword",
                    "fields": {
                      "analyzed": {
                        "type": "text"
                      },
                      "ignoreCase": {
                        "type": "text",
                        "analyzer": "case_insensitive_analyzer"
                      },
                      "contains": {
                        "type": "text",
                        "analyzer": "contains_analyzer"
                      }
                    }
                  },
                  "infraspecificEpithet": {
                    "type": "keyword",
                    "fields": {
                      "analyzed": {
                        "type": "text"
                      },
                      "ignoreCase": {
                        "type": "text",
                        "analyzer": "case_insensitive_analyzer"
                      },
                      "contains": {
                        "type": "text",
                        "analyzer": "contains_analyzer"
                      }
                    }
                  },
                  "specificEpithet": {
                    "type": "keyword",
                    "fields": {
                      "analyzed": {
                        "type": "text"
                      },
                      "ignoreCase": {
                        "type": "text",
                        "analyzer": "case_insensitive_analyzer"
                      },
                      "contains": {
                        "type": "text",
                        "analyzer": "contains_analyzer"
                      }
                    }
                  },
                  "subgenus": {
                    "type": "keyword",
                    "fields": {
                      "analyzed": {
                        "type": "text"
                      },
                      "ignoreCase": {
                        "type": "text",
                        "analyzer": "case_insensitive_analyzer"
                      },
                      "contains": {
                        "type": "text",
                        "analyzer": "contains_analyzer"
                      }
                    }
                  },
                  "taxonomicStatus": {
                    "type": "keyword",
                    "fields": {
                      "analyzed": {
                        "type": "text"
                      },
                      "ignoreCase": {
                        "type": "text",
                        "analyzer": "case_insensitive_analyzer"
                      }
                    }
                  }
                }
              },
              "taxonId": {
                "type": "keyword",
                "index": false
              },
              "vernacularNames": {
                "type": "nested",
                "properties": {
                  "language": {
                    "type": "keyword",
                    "fields": {
                      "analyzed": {
                        "type": "text"
                      },
                      "ignoreCase": {
                        "type": "text",
                        "analyzer": "case_insensitive_analyzer"
                      }
                    }
                  },
                  "name": {
                    "type": "keyword",
                    "fields": {
                      "analyzed": {
                        "type": "text"
                      },
                      "ignoreCase": {
                        "type": "text",
                        "analyzer": "case_insensitive_analyzer"
                      },
                      "contains": {
                        "type": "text",
                        "analyzer": "contains_analyzer"
                      }
                    }
                  }
                }
              }
            }
          },
          "typeStatus": {
            "type": "keyword",
            "fields": {
              "analyzed": {
                "type": "text"
              },
              "ignoreCase": {
                "type": "text",
                "analyzer": "case_insensitive_analyzer"
              }
            }
          },
          "vernacularNames": {
            "type": "nested",
            "properties": {
              "experts": {
                "type": "nested",
                "properties": {
                  "agentText": {
                    "type": "keyword",
                    "fields": {
                      "analyzed": {
                        "type": "text"
                      },
                      "ignoreCase": {
                        "type": "text",
                        "analyzer": "case_insensitive_analyzer"
                      }
                    }
                  },
                  "fullName": {
                    "type": "keyword",
                    "fields": {
                      "analyzed": {
                        "type": "text"
                      },
                      "ignoreCase": {
                        "type": "text",
                        "analyzer": "case_insensitive_analyzer"
                      },
                      "contains": {
                        "type": "text",
                        "analyzer": "contains_analyzer"
                      }
                    }
                  },
                  "organization": {
                    "properties": {
                      "agentText": {
                        "type": "keyword",
                        "fields": {
                          "analyzed": {
                            "type": "text"
                          },
                          "ignoreCase": {
                            "type": "text",
                            "analyzer": "case_insensitive_analyzer"
                          }
                        }
                      },
                      "name": {
                        "type": "keyword",
                        "fields": {
                          "analyzed": {
                            "type": "text"
                          },
                          "ignoreCase": {
                            "type": "text",
                            "analyzer": "case_insensitive_analyzer"
                          },
                          "contains": {
                            "type": "text",
                            "analyzer": "contains_analyzer"
                          }
                        }
                      }
                    }
                  }
                }
              },
              "language": {
                "type": "keyword",
                "fields": {
                  "analyzed": {
                    "type": "text"
                  },
                  "ignoreCase": {
                    "type": "text",
                    "analyzer": "case_insensitive_analyzer"
                  }
                }
              },
              "name": {
                "type": "keyword",
                "fields": {
                  "analyzed": {
                    "type": "text"
                  },
                  "ignoreCase": {
                    "type": "text",
                    "analyzer": "case_insensitive_analyzer"
                  },
                  "contains": {
                    "type": "text",
                    "analyzer": "contains_analyzer"
                  }
                }
              },
              "preferred": {
                "type": "boolean"
              },
              "references": {
                "type": "nested",
                "properties": {
                  "author": {
                    "properties": {
                      "agentText": {
                        "type": "keyword",
                        "fields": {
                          "analyzed": {
                            "type": "text"
                          },
                          "ignoreCase": {
                            "type": "text",
                            "analyzer": "case_insensitive_analyzer"
                          }
                        }
                      },
                      "fullName": {
                        "type": "keyword",
                        "fields": {
                          "analyzed": {
                            "type": "text"
                          },
                          "ignoreCase": {
                            "type": "text",
                            "analyzer": "case_insensitive_analyzer"
                          },
                          "contains": {
                            "type": "text",
                            "analyzer": "contains_analyzer"
                          }
                        }
                      },
                      "organization": {
                        "properties": {
                          "agentText": {
                            "type": "keyword",
                            "fields": {
                              "analyzed": {
                                "type": "text"
                              },
                              "ignoreCase": {
                                "type": "text",
                                "analyzer": "case_insensitive_analyzer"
                              }
                            }
                          },
                          "name": {
                            "type": "keyword",
                            "fields": {
                              "analyzed": {
                                "type": "text"
                              },
                              "ignoreCase": {
                                "type": "text",
                                "analyzer": "case_insensitive_analyzer"
                              },
                              "contains": {
                                "type": "text",
                                "analyzer": "contains_analyzer"
                              }
                            }
                          }
                        }
                      }
                    }
                  },
                  "citationDetail": {
                    "type": "keyword",
                    "fields": {
                      "analyzed": {
                        "type": "text"
                      },
                      "ignoreCase": {
                        "type": "text",
                        "analyzer": "case_insensitive_analyzer"
                      }
                    }
                  },
                  "publicationDate": {
                    "type": "date",
                    "format": "yyyy-MM-dd'T'HH:mm:ssZ||basic_date_time||strict_date_hour_minute_second"
                  },
                  "titleCitation": {
                    "type": "keyword",
                    "fields": {
                      "analyzed": {
                        "type": "text"
                      },
                      "ignoreCase": {
                        "type": "text",
                        "analyzer": "case_insensitive_analyzer"
                      }
                    }
                  },
                  "uri": {
                    "type": "keyword",
                    "fields": {
                      "analyzed": {
                        "type": "text"
                      },
                      "ignoreCase": {
                        "type": "text",
                        "analyzer": "case_insensitive_analyzer"
                      }
                    }
                  }
                }
              }
            }
          }
        }
      },
      "informationWithheld": {
        "type": "keyword",
        "fields": {
          "analyzed": {
            "type": "text"
          },
          "ignoreCase": {
            "type": "text",
            "analyzer": "case_insensitive_analyzer"
          }
        }
      },
      "license": {
        "type": "keyword",
        "fields": {
          "analyzed": {
            "type": "text"
          },
          "ignoreCase": {
            "type": "text",
            "analyzer": "case_insensitive_analyzer"
          }
        }
      },
      "licenseType": {
        "type": "keyword",
        "fields": {
          "analyzed": {
            "type": "text"
          },
          "ignoreCase": {
            "type": "text",
            "analyzer": "case_insensitive_analyzer"
          }
        }
      },
      "modified": {
        "type": "date",
        "format": "yyyy-MM-dd'T'HH:mm:ssZ||basic_date_time||strict_date_hour_minute_second"
      },
      "multiMediaPublic": {
        "type": "boolean"
      },
      "owner": {
        "type": "keyword",
        "fields": {
          "analyzed": {
            "type": "text"
          },
          "ignoreCase": {
            "type": "text",
            "analyzer": "case_insensitive_analyzer"
          },
          "contains": {
            "type": "text",
            "analyzer": "contains_analyzer"
          }
        }
      },
      "phasesOrStages": {
        "type": "keyword",
        "fields": {
          "analyzed": {
            "type": "text"
          },
          "ignoreCase": {
            "type": "text",
            "analyzer": "case_insensitive_analyzer"
          }
        }
      },
      "previousSourceID": {
        "type": "keyword",
        "fields": {
          "analyzed": {
            "type": "text"
          },
          "ignoreCase": {
            "type": "text",
            "analyzer": "case_insensitive_analyzer"
          }
        }
      },
      "previousUnitsText": {
        "type": "keyword",
        "fields": {
          "analyzed": {
            "type": "text"
          },
          "ignoreCase": {
            "type": "text",
            "analyzer": "case_insensitive_analyzer"
          }
        }
      },
      "rating": {
        "type": "byte"
      },
      "recordURI": {
        "type": "keyword",
        "fields": {
          "analyzed": {
            "type": "text"
          },
          "ignoreCase": {
            "type": "text",
            "analyzer": "case_insensitive_analyzer"
          }
        }
      },
      "resourceCreationTechnique": {
        "type": "keyword",
        "fields": {
          "analyzed": {
            "type": "text"
          },
          "ignoreCase": {
            "type": "text",
            "analyzer": "case_insensitive_analyzer"
          }
        }
      },
      "serviceAccessPoints": {
        "type": "nested",
        "properties": {
          "accessUri": {
            "type": "keyword",
            "index": false
          },
          "format": {
            "type": "keyword"
          },
          "variant": {
            "type": "keyword"
          }
        }
      },
      "sexes": {
        "type": "keyword",
        "fields": {
          "analyzed": {
            "type": "text"
          },
          "ignoreCase": {
            "type": "text",
            "analyzer": "case_insensitive_analyzer"
          }
        }
      },
      "sourceID": {
        "type": "keyword",
        "fields": {
          "analyzed": {
            "type": "text"
          },
          "ignoreCase": {
            "type": "text",
            "analyzer": "case_insensitive_analyzer"
          }
        }
      },
      "sourceInstitutionID": {
        "type": "keyword",
        "fields": {
          "analyzed": {
            "type": "text"
          },
          "ignoreCase": {
            "type": "text",
            "analyzer": "case_insensitive_analyzer"
          }
        }
      },
      "sourceSystem": {
        "properties": {
          "code": {
            "type": "keyword",
            "fields": {
              "analyzed": {
                "type": "text"
              },
              "ignoreCase": {
                "type": "text",
                "analyzer": "case_insensitive_analyzer"
              }
            }
          },
          "name": {
            "type": "keyword",
            "fields": {
              "analyzed": {
                "type": "text"
              },
              "ignoreCase": {
                "type": "text",
                "analyzer": "case_insensitive_analyzer"
              }
            }
          }
        }
      },
      "sourceSystemId": {
        "type": "keyword",
        "fields": {
          "analyzed": {
            "type": "text"
          },
          "ignoreCase": {
            "type": "text",
            "analyzer": "case_insensitive_analyzer"
          }
        }
      },
      "subjectOrientations": {
        "type": "keyword",
        "fields": {
          "analyzed": {
            "type": "text"
          },
          "ignoreCase": {
            "type": "text",
            "analyzer": "case_insensitive_analyzer"
          }
        }
      },
      "subjectParts": {
        "type": "keyword",
        "fields": {
          "analyzed": {
            "type": "text"
          },
          "ignoreCase": {
            "type": "text",
            "analyzer": "case_insensitive_analyzer"
          }
        }
      },
      "taxonCount": {
        "type": "integer"
      },
      "theme": {
        "type": "keyword",
        "fields": {
          "analyzed": {
            "type": "text"
          },
          "ignoreCase": {
            "type": "text",
            "analyzer": "case_insensitive_analyzer"
          }
        }
      },
      "title": {
        "type": "keyword",
        "fields": {
          "analyzed": {
            "type": "text"
          },
          "ignoreCase": {
            "type": "text",
            "analyzer": "case_insensitive_analyzer"
          },
          "contains": {
            "type": "text",
            "analyzer": "contains_analyzer"
          }
        }
      },
      "type": {
        "type": "keyword",
        "fields": {
          "analyzed": {
            "type": "text"
          },
          "ignoreCase": {
            "type": "text",
            "analyzer": "case_insensitive_analyzer"
          }
        }
      },
      "unitID": {
        "type": "keyword",
        "fields": {
          "analyzed": {
            "type": "text"
          },
          "ignoreCase": {
            "type": "text",
            "analyzer": "case_insensitive_analyzer"
          },
          "contains": {
            "type": "text",
            "analyzer": "contains_analyzer"
          }
        }
      }
    }
  }
}