{
  "analysis": {
    "analyzer": {
      "case_insensitive_analyzer": {
        "tokenizer": "keyword",
        "filter": "lowercase"
      },
      "contains_analyzer": {
        "tokenizer": "contains_tokenizer",
        "filter": "lowercase"
      }
    },
    "tokenizer": {
      "contains_tokenizer": {
        "type": "ngram",
        "min_gram": 3,
        "max_gram": 15,
        "token_chars": []
      }
    }
  },
  "index": {
    "max_ngram_diff": "12",
    "mapping": {
      "nested_fields": {
        "limit": 75
      }
    },
    "refresh_interval": -1,
    "max_result_window": 50000
  }
}