{
  "properties": {
    "theme" : {
      "type": "array",
      "items": {
          "type": "string"
       }
    },
    "identifications": {
      "items": {
        "properties": {
          "taxonomicEnrichments" : {
            "type": "array",
            "items": {
                "type": "object"
             }
          },
          "scientificName" : {
            "properties": {
              "scientificNameGroup": {
                "type": "string"
              }
            }
          }
        }
      }
    }
  }
}
