{
  "settings": {
    "index": {
      "mapping": {
        "nested_fields": {
          "limit": 75
        }
      },
      "number_of_replicas": 0,
      "number_of_shards": 12,
      "refresh_interval": -1,
      "max_result_window": 50000,
      "analysis": {
        "analyzer": {
          "case_insensitive_analyzer": {
            "filter": "lowercase",
            "tokenizer": "keyword"
          },
          "contains_analyzer": {
            "filter": "lowercase",
            "tokenizer": "contains_tokenizer"
          }
        },
        "tokenizer": {
          "contains_tokenizer": {
            "min_gram": 3,
            "max_gram": 15,
            "token_chars": [],
            "type": "ngram"
          }
        }
      },
      "max_ngram_diff": 12
    }
  },
  "mappings": {
    "dynamic": "strict",
    "properties": {
      "acceptedName": {
        "properties": {
          "author": {
            "fields": {
              "analyzed": {
                "type": "text"
              },
              "ignoreCase": {
                "analyzer": "case_insensitive_analyzer",
                "type": "text"
              },
              "contains": {
                "analyzer": "contains_analyzer",
                "type": "text"
              }
            },
            "type": "keyword"
          },
          "authorshipVerbatim": {
            "fields": {
              "analyzed": {
                "type": "text"
              },
              "ignoreCase": {
                "analyzer": "case_insensitive_analyzer",
                "type": "text"
              },
              "contains": {
                "analyzer": "contains_analyzer",
                "type": "text"
              }
            },
            "type": "keyword"
          },
          "experts": {
            "properties": {
              "agentText": {
                "fields": {
                  "analyzed": {
                    "type": "text"
                  },
                  "ignoreCase": {
                    "analyzer": "case_insensitive_analyzer",
                    "type": "text"
                  }
                },
                "type": "keyword"
              },
              "fullName": {
                "fields": {
                  "analyzed": {
                    "type": "text"
                  },
                  "ignoreCase": {
                    "analyzer": "case_insensitive_analyzer",
                    "type": "text"
                  },
                  "contains": {
                    "analyzer": "contains_analyzer",
                    "type": "text"
                  }
                },
                "type": "keyword"
              },
              "organization": {
                "properties": {
                  "agentText": {
                    "fields": {
                      "analyzed": {
                        "type": "text"
                      },
                      "ignoreCase": {
                        "analyzer": "case_insensitive_analyzer",
                        "type": "text"
                      }
                    },
                    "type": "keyword"
                  },
                  "name": {
                    "fields": {
                      "analyzed": {
                        "type": "text"
                      },
                      "ignoreCase": {
                        "analyzer": "case_insensitive_analyzer",
                        "type": "text"
                      },
                      "contains": {
                        "analyzer": "contains_analyzer",
                        "type": "text"
                      }
                    },
                    "type": "keyword"
                  }
                }
              }
            },
            "type": "nested"
          },
          "fullScientificName": {
            "fields": {
              "analyzed": {
                "type": "text"
              },
              "ignoreCase": {
                "analyzer": "case_insensitive_analyzer",
                "type": "text"
              },
              "contains": {
                "analyzer": "contains_analyzer",
                "type": "text"
              }
            },
            "type": "keyword"
          },
          "genusOrMonomial": {
            "fields": {
              "analyzed": {
                "type": "text"
              },
              "ignoreCase": {
                "analyzer": "case_insensitive_analyzer",
                "type": "text"
              },
              "contains": {
                "analyzer": "contains_analyzer",
                "type": "text"
              }
            },
            "type": "keyword"
          },
          "infraspecificEpithet": {
            "fields": {
              "analyzed": {
                "type": "text"
              },
              "ignoreCase": {
                "analyzer": "case_insensitive_analyzer",
                "type": "text"
              },
              "contains": {
                "analyzer": "contains_analyzer",
                "type": "text"
              }
            },
            "type": "keyword"
          },
          "infraspecificMarker": {
            "fields": {
              "analyzed": {
                "type": "text"
              },
              "ignoreCase": {
                "analyzer": "case_insensitive_analyzer",
                "type": "text"
              }
            },
            "type": "keyword"
          },
          "nameAddendum": {
            "fields": {
              "analyzed": {
                "type": "text"
              },
              "ignoreCase": {
                "analyzer": "case_insensitive_analyzer",
                "type": "text"
              }
            },
            "type": "keyword"
          },
          "references": {
            "properties": {
              "author": {
                "properties": {
                  "agentText": {
                    "fields": {
                      "analyzed": {
                        "type": "text"
                      },
                      "ignoreCase": {
                        "analyzer": "case_insensitive_analyzer",
                        "type": "text"
                      }
                    },
                    "type": "keyword"
                  },
                  "fullName": {
                    "fields": {
                      "analyzed": {
                        "type": "text"
                      },
                      "ignoreCase": {
                        "analyzer": "case_insensitive_analyzer",
                        "type": "text"
                      },
                      "contains": {
                        "analyzer": "contains_analyzer",
                        "type": "text"
                      }
                    },
                    "type": "keyword"
                  },
                  "organization": {
                    "properties": {
                      "agentText": {
                        "fields": {
                          "analyzed": {
                            "type": "text"
                          },
                          "ignoreCase": {
                            "analyzer": "case_insensitive_analyzer",
                            "type": "text"
                          }
                        },
                        "type": "keyword"
                      },
                      "name": {
                        "fields": {
                          "analyzed": {
                            "type": "text"
                          },
                          "ignoreCase": {
                            "analyzer": "case_insensitive_analyzer",
                            "type": "text"
                          },
                          "contains": {
                            "analyzer": "contains_analyzer",
                            "type": "text"
                          }
                        },
                        "type": "keyword"
                      }
                    }
                  }
                }
              },
              "citationDetail": {
                "fields": {
                  "analyzed": {
                    "type": "text"
                  },
                  "ignoreCase": {
                    "analyzer": "case_insensitive_analyzer",
                    "type": "text"
                  }
                },
                "type": "keyword"
              },
              "publicationDate": {
                "format": "yyyy-MM-dd'T'HH:mm:ssZ||basic_date_time||strict_date_hour_minute_second",
                "type": "date"
              },
              "titleCitation": {
                "fields": {
                  "analyzed": {
                    "type": "text"
                  },
                  "ignoreCase": {
                    "analyzer": "case_insensitive_analyzer",
                    "type": "text"
                  }
                },
                "type": "keyword"
              },
              "uri": {
                "fields": {
                  "analyzed": {
                    "type": "text"
                  },
                  "ignoreCase": {
                    "analyzer": "case_insensitive_analyzer",
                    "type": "text"
                  }
                },
                "type": "keyword"
              }
            },
            "type": "nested"
          },
          "scientificNameGroup": {
            "fields": {
              "analyzed": {
                "type": "text"
              },
              "ignoreCase": {
                "analyzer": "case_insensitive_analyzer",
                "type": "text"
              },
              "contains": {
                "analyzer": "contains_analyzer",
                "type": "text"
              }
            },
            "type": "keyword"
          },
          "specificEpithet": {
            "fields": {
              "analyzed": {
                "type": "text"
              },
              "ignoreCase": {
                "analyzer": "case_insensitive_analyzer",
                "type": "text"
              },
              "contains": {
                "analyzer": "contains_analyzer",
                "type": "text"
              }
            },
            "type": "keyword"
          },
          "subgenus": {
            "fields": {
              "analyzed": {
                "type": "text"
              },
              "ignoreCase": {
                "analyzer": "case_insensitive_analyzer",
                "type": "text"
              },
              "contains": {
                "analyzer": "contains_analyzer",
                "type": "text"
              }
            },
            "type": "keyword"
          },
          "taxonomicStatus": {
            "fields": {
              "analyzed": {
                "type": "text"
              },
              "ignoreCase": {
                "analyzer": "case_insensitive_analyzer",
                "type": "text"
              }
            },
            "type": "keyword"
          },
          "year": {
            "fields": {
              "analyzed": {
                "type": "text"
              },
              "ignoreCase": {
                "analyzer": "case_insensitive_analyzer",
                "type": "text"
              }
            },
            "type": "keyword"
          }
        }
      },
      "defaultClassification": {
        "properties": {
          "className": {
            "fields": {
              "analyzed": {
                "type": "text"
              },
              "ignoreCase": {
                "analyzer": "case_insensitive_analyzer",
                "type": "text"
              },
              "contains": {
                "analyzer": "contains_analyzer",
                "type": "text"
              }
            },
            "type": "keyword"
          },
          "family": {
            "fields": {
              "analyzed": {
                "type": "text"
              },
              "ignoreCase": {
                "analyzer": "case_insensitive_analyzer",
                "type": "text"
              },
              "contains": {
                "analyzer": "contains_analyzer",
                "type": "text"
              }
            },
            "type": "keyword"
          },
          "genus": {
            "fields": {
              "analyzed": {
                "type": "text"
              },
              "ignoreCase": {
                "analyzer": "case_insensitive_analyzer",
                "type": "text"
              },
              "contains": {
                "analyzer": "contains_analyzer",
                "type": "text"
              }
            },
            "type": "keyword"
          },
          "infraspecificEpithet": {
            "fields": {
              "analyzed": {
                "type": "text"
              },
              "ignoreCase": {
                "analyzer": "case_insensitive_analyzer",
                "type": "text"
              },
              "contains": {
                "analyzer": "contains_analyzer",
                "type": "text"
              }
            },
            "type": "keyword"
          },
          "infraspecificRank": {
            "fields": {
              "analyzed": {
                "type": "text"
              },
              "ignoreCase": {
                "analyzer": "case_insensitive_analyzer",
                "type": "text"
              },
              "contains": {
                "analyzer": "contains_analyzer",
                "type": "text"
              }
            },
            "type": "keyword"
          },
          "kingdom": {
            "fields": {
              "analyzed": {
                "type": "text"
              },
              "ignoreCase": {
                "analyzer": "case_insensitive_analyzer",
                "type": "text"
              },
              "contains": {
                "analyzer": "contains_analyzer",
                "type": "text"
              }
            },
            "type": "keyword"
          },
          "order": {
            "fields": {
              "analyzed": {
                "type": "text"
              },
              "ignoreCase": {
                "analyzer": "case_insensitive_analyzer",
                "type": "text"
              },
              "contains": {
                "analyzer": "contains_analyzer",
                "type": "text"
              }
            },
            "type": "keyword"
          },
          "phylum": {
            "fields": {
              "analyzed": {
                "type": "text"
              },
              "ignoreCase": {
                "analyzer": "case_insensitive_analyzer",
                "type": "text"
              },
              "contains": {
                "analyzer": "contains_analyzer",
                "type": "text"
              }
            },
            "type": "keyword"
          },
          "specificEpithet": {
            "fields": {
              "analyzed": {
                "type": "text"
              },
              "ignoreCase": {
                "analyzer": "case_insensitive_analyzer",
                "type": "text"
              },
              "contains": {
                "analyzer": "contains_analyzer",
                "type": "text"
              }
            },
            "type": "keyword"
          },
          "subgenus": {
            "fields": {
              "analyzed": {
                "type": "text"
              },
              "ignoreCase": {
                "analyzer": "case_insensitive_analyzer",
                "type": "text"
              },
              "contains": {
                "analyzer": "contains_analyzer",
                "type": "text"
              }
            },
            "type": "keyword"
          },
          "superFamily": {
            "fields": {
              "analyzed": {
                "type": "text"
              },
              "ignoreCase": {
                "analyzer": "case_insensitive_analyzer",
                "type": "text"
              },
              "contains": {
                "analyzer": "contains_analyzer",
                "type": "text"
              }
            },
            "type": "keyword"
          }
        }
      },
      "descriptions": {
        "properties": {
          "author": {
            "fields": {
              "analyzed": {
                "type": "text"
              },
              "ignoreCase": {
                "analyzer": "case_insensitive_analyzer",
                "type": "text"
              }
            },
            "type": "keyword"
          },
          "category": {
            "fields": {
              "analyzed": {
                "type": "text"
              },
              "ignoreCase": {
                "analyzer": "case_insensitive_analyzer",
                "type": "text"
              }
            },
            "type": "keyword"
          },
          "description": {
            "fields": {
              "analyzed": {
                "type": "text"
              },
              "ignoreCase": {
                "analyzer": "case_insensitive_analyzer",
                "type": "text"
              },
              "contains": {
                "analyzer": "contains_analyzer",
                "type": "text"
              }
            },
            "type": "keyword"
          },
          "language": {
            "fields": {
              "analyzed": {
                "type": "text"
              },
              "ignoreCase": {
                "analyzer": "case_insensitive_analyzer",
                "type": "text"
              }
            },
            "type": "keyword"
          },
          "license": {
            "fields": {
              "analyzed": {
                "type": "text"
              },
              "ignoreCase": {
                "analyzer": "case_insensitive_analyzer",
                "type": "text"
              }
            },
            "type": "keyword"
          },
          "publicationDate": {
            "format": "yyyy-MM-dd'T'HH:mm:ssZ||basic_date_time||strict_date_hour_minute_second",
            "type": "date"
          }
        },
        "type": "nested"
      },
      "experts": {
        "properties": {
          "agentText": {
            "fields": {
              "analyzed": {
                "type": "text"
              },
              "ignoreCase": {
                "analyzer": "case_insensitive_analyzer",
                "type": "text"
              }
            },
            "type": "keyword"
          },
          "fullName": {
            "fields": {
              "analyzed": {
                "type": "text"
              },
              "ignoreCase": {
                "analyzer": "case_insensitive_analyzer",
                "type": "text"
              },
              "contains": {
                "analyzer": "contains_analyzer",
                "type": "text"
              }
            },
            "type": "keyword"
          },
          "organization": {
            "properties": {
              "agentText": {
                "fields": {
                  "analyzed": {
                    "type": "text"
                  },
                  "ignoreCase": {
                    "analyzer": "case_insensitive_analyzer",
                    "type": "text"
                  }
                },
                "type": "keyword"
              },
              "name": {
                "fields": {
                  "analyzed": {
                    "type": "text"
                  },
                  "ignoreCase": {
                    "analyzer": "case_insensitive_analyzer",
                    "type": "text"
                  },
                  "contains": {
                    "analyzer": "contains_analyzer",
                    "type": "text"
                  }
                },
                "type": "keyword"
              }
            }
          }
        },
        "type": "nested"
      },
      "occurrenceStatusVerbatim": {
        "fields": {
          "analyzed": {
            "type": "text"
          },
          "ignoreCase": {
            "analyzer": "case_insensitive_analyzer",
            "type": "text"
          }
        },
        "type": "keyword"
      },
      "recordURI": {
        "fields": {
          "analyzed": {
            "type": "text"
          },
          "ignoreCase": {
            "analyzer": "case_insensitive_analyzer",
            "type": "text"
          }
        },
        "type": "keyword"
      },
      "references": {
        "properties": {
          "author": {
            "properties": {
              "agentText": {
                "fields": {
                  "analyzed": {
                    "type": "text"
                  },
                  "ignoreCase": {
                    "analyzer": "case_insensitive_analyzer",
                    "type": "text"
                  }
                },
                "type": "keyword"
              },
              "fullName": {
                "fields": {
                  "analyzed": {
                    "type": "text"
                  },
                  "ignoreCase": {
                    "analyzer": "case_insensitive_analyzer",
                    "type": "text"
                  },
                  "contains": {
                    "analyzer": "contains_analyzer",
                    "type": "text"
                  }
                },
                "type": "keyword"
              },
              "organization": {
                "properties": {
                  "agentText": {
                    "fields": {
                      "analyzed": {
                        "type": "text"
                      },
                      "ignoreCase": {
                        "analyzer": "case_insensitive_analyzer",
                        "type": "text"
                      }
                    },
                    "type": "keyword"
                  },
                  "name": {
                    "fields": {
                      "analyzed": {
                        "type": "text"
                      },
                      "ignoreCase": {
                        "analyzer": "case_insensitive_analyzer",
                        "type": "text"
                      },
                      "contains": {
                        "analyzer": "contains_analyzer",
                        "type": "text"
                      }
                    },
                    "type": "keyword"
                  }
                }
              }
            }
          },
          "citationDetail": {
            "fields": {
              "analyzed": {
                "type": "text"
              },
              "ignoreCase": {
                "analyzer": "case_insensitive_analyzer",
                "type": "text"
              }
            },
            "type": "keyword"
          },
          "publicationDate": {
            "format": "yyyy-MM-dd'T'HH:mm:ssZ||basic_date_time||strict_date_hour_minute_second",
            "type": "date"
          },
          "titleCitation": {
            "fields": {
              "analyzed": {
                "type": "text"
              },
              "ignoreCase": {
                "analyzer": "case_insensitive_analyzer",
                "type": "text"
              }
            },
            "type": "keyword"
          },
          "uri": {
            "fields": {
              "analyzed": {
                "type": "text"
              },
              "ignoreCase": {
                "analyzer": "case_insensitive_analyzer",
                "type": "text"
              }
            },
            "type": "keyword"
          }
        },
        "type": "nested"
      },
      "sourceSystem": {
        "properties": {
          "code": {
            "fields": {
              "analyzed": {
                "type": "text"
              },
              "ignoreCase": {
                "analyzer": "case_insensitive_analyzer",
                "type": "text"
              }
            },
            "type": "keyword"
          },
          "name": {
            "fields": {
              "analyzed": {
                "type": "text"
              },
              "ignoreCase": {
                "analyzer": "case_insensitive_analyzer",
                "type": "text"
              }
            },
            "type": "keyword"
          }
        }
      },
      "sourceSystemId": {
        "fields": {
          "analyzed": {
            "type": "text"
          },
          "ignoreCase": {
            "analyzer": "case_insensitive_analyzer",
            "type": "text"
          }
        },
        "type": "keyword"
      },
      "sourceSystemParentId": {
        "fields": {
          "analyzed": {
            "type": "text"
          },
          "ignoreCase": {
            "analyzer": "case_insensitive_analyzer",
            "type": "text"
          }
        },
        "type": "keyword"
      },
      "synonyms": {
        "properties": {
          "author": {
            "fields": {
              "analyzed": {
                "type": "text"
              },
              "ignoreCase": {
                "analyzer": "case_insensitive_analyzer",
                "type": "text"
              },
              "contains": {
                "analyzer": "contains_analyzer",
                "type": "text"
              }
            },
            "type": "keyword"
          },
          "authorshipVerbatim": {
            "fields": {
              "analyzed": {
                "type": "text"
              },
              "ignoreCase": {
                "analyzer": "case_insensitive_analyzer",
                "type": "text"
              },
              "contains": {
                "analyzer": "contains_analyzer",
                "type": "text"
              }
            },
            "type": "keyword"
          },
          "experts": {
            "properties": {
              "agentText": {
                "fields": {
                  "analyzed": {
                    "type": "text"
                  },
                  "ignoreCase": {
                    "analyzer": "case_insensitive_analyzer",
                    "type": "text"
                  }
                },
                "type": "keyword"
              },
              "fullName": {
                "fields": {
                  "analyzed": {
                    "type": "text"
                  },
                  "ignoreCase": {
                    "analyzer": "case_insensitive_analyzer",
                    "type": "text"
                  },
                  "contains": {
                    "analyzer": "contains_analyzer",
                    "type": "text"
                  }
                },
                "type": "keyword"
              },
              "organization": {
                "properties": {
                  "agentText": {
                    "fields": {
                      "analyzed": {
                        "type": "text"
                      },
                      "ignoreCase": {
                        "analyzer": "case_insensitive_analyzer",
                        "type": "text"
                      }
                    },
                    "type": "keyword"
                  },
                  "name": {
                    "fields": {
                      "analyzed": {
                        "type": "text"
                      },
                      "ignoreCase": {
                        "analyzer": "case_insensitive_analyzer",
                        "type": "text"
                      },
                      "contains": {
                        "analyzer": "contains_analyzer",
                        "type": "text"
                      }
                    },
                    "type": "keyword"
                  }
                }
              }
            },
            "type": "nested"
          },
          "fullScientificName": {
            "fields": {
              "analyzed": {
                "type": "text"
              },
              "ignoreCase": {
                "analyzer": "case_insensitive_analyzer",
                "type": "text"
              },
              "contains": {
                "analyzer": "contains_analyzer",
                "type": "text"
              }
            },
            "type": "keyword"
          },
          "genusOrMonomial": {
            "fields": {
              "analyzed": {
                "type": "text"
              },
              "ignoreCase": {
                "analyzer": "case_insensitive_analyzer",
                "type": "text"
              },
              "contains": {
                "analyzer": "contains_analyzer",
                "type": "text"
              }
            },
            "type": "keyword"
          },
          "infraspecificEpithet": {
            "fields": {
              "analyzed": {
                "type": "text"
              },
              "ignoreCase": {
                "analyzer": "case_insensitive_analyzer",
                "type": "text"
              },
              "contains": {
                "analyzer": "contains_analyzer",
                "type": "text"
              }
            },
            "type": "keyword"
          },
          "infraspecificMarker": {
            "fields": {
              "analyzed": {
                "type": "text"
              },
              "ignoreCase": {
                "analyzer": "case_insensitive_analyzer",
                "type": "text"
              }
            },
            "type": "keyword"
          },
          "nameAddendum": {
            "fields": {
              "analyzed": {
                "type": "text"
              },
              "ignoreCase": {
                "analyzer": "case_insensitive_analyzer",
                "type": "text"
              }
            },
            "type": "keyword"
          },
          "references": {
            "properties": {
              "author": {
                "properties": {
                  "agentText": {
                    "fields": {
                      "analyzed": {
                        "type": "text"
                      },
                      "ignoreCase": {
                        "analyzer": "case_insensitive_analyzer",
                        "type": "text"
                      }
                    },
                    "type": "keyword"
                  },
                  "fullName": {
                    "fields": {
                      "analyzed": {
                        "type": "text"
                      },
                      "ignoreCase": {
                        "analyzer": "case_insensitive_analyzer",
                        "type": "text"
                      },
                      "contains": {
                        "analyzer": "contains_analyzer",
                        "type": "text"
                      }
                    },
                    "type": "keyword"
                  },
                  "organization": {
                    "properties": {
                      "agentText": {
                        "fields": {
                          "analyzed": {
                            "type": "text"
                          },
                          "ignoreCase": {
                            "analyzer": "case_insensitive_analyzer",
                            "type": "text"
                          }
                        },
                        "type": "keyword"
                      },
                      "name": {
                        "fields": {
                          "analyzed": {
                            "type": "text"
                          },
                          "ignoreCase": {
                            "analyzer": "case_insensitive_analyzer",
                            "type": "text"
                          },
                          "contains": {
                            "analyzer": "contains_analyzer",
                            "type": "text"
                          }
                        },
                        "type": "keyword"
                      }
                    }
                  }
                }
              },
              "citationDetail": {
                "fields": {
                  "analyzed": {
                    "type": "text"
                  },
                  "ignoreCase": {
                    "analyzer": "case_insensitive_analyzer",
                    "type": "text"
                  }
                },
                "type": "keyword"
              },
              "publicationDate": {
                "format": "yyyy-MM-dd'T'HH:mm:ssZ||basic_date_time||strict_date_hour_minute_second",
                "type": "date"
              },
              "titleCitation": {
                "fields": {
                  "analyzed": {
                    "type": "text"
                  },
                  "ignoreCase": {
                    "analyzer": "case_insensitive_analyzer",
                    "type": "text"
                  }
                },
                "type": "keyword"
              },
              "uri": {
                "fields": {
                  "analyzed": {
                    "type": "text"
                  },
                  "ignoreCase": {
                    "analyzer": "case_insensitive_analyzer",
                    "type": "text"
                  }
                },
                "type": "keyword"
              }
            },
            "type": "nested"
          },
          "scientificNameGroup": {
            "fields": {
              "analyzed": {
                "type": "text"
              },
              "ignoreCase": {
                "analyzer": "case_insensitive_analyzer",
                "type": "text"
              },
              "contains": {
                "analyzer": "contains_analyzer",
                "type": "text"
              }
            },
            "type": "keyword"
          },
          "specificEpithet": {
            "fields": {
              "analyzed": {
                "type": "text"
              },
              "ignoreCase": {
                "analyzer": "case_insensitive_analyzer",
                "type": "text"
              },
              "contains": {
                "analyzer": "contains_analyzer",
                "type": "text"
              }
            },
            "type": "keyword"
          },
          "subgenus": {
            "fields": {
              "analyzed": {
                "type": "text"
              },
              "ignoreCase": {
                "analyzer": "case_insensitive_analyzer",
                "type": "text"
              },
              "contains": {
                "analyzer": "contains_analyzer",
                "type": "text"
              }
            },
            "type": "keyword"
          },
          "taxonomicStatus": {
            "fields": {
              "analyzed": {
                "type": "text"
              },
              "ignoreCase": {
                "analyzer": "case_insensitive_analyzer",
                "type": "text"
              }
            },
            "type": "keyword"
          },
          "year": {
            "fields": {
              "analyzed": {
                "type": "text"
              },
              "ignoreCase": {
                "analyzer": "case_insensitive_analyzer",
                "type": "text"
              }
            },
            "type": "keyword"
          }
        },
        "type": "nested"
      },
      "systemClassification": {
        "properties": {
          "name": {
            "fields": {
              "analyzed": {
                "type": "text"
              },
              "ignoreCase": {
                "analyzer": "case_insensitive_analyzer",
                "type": "text"
              },
              "contains": {
                "analyzer": "contains_analyzer",
                "type": "text"
              }
            },
            "type": "keyword"
          },
          "rank": {
            "fields": {
              "analyzed": {
                "type": "text"
              },
              "ignoreCase": {
                "analyzer": "case_insensitive_analyzer",
                "type": "text"
              }
            },
            "type": "keyword"
          }
        },
        "type": "nested"
      },
      "taxonRank": {
        "fields": {
          "analyzed": {
            "type": "text"
          },
          "ignoreCase": {
            "analyzer": "case_insensitive_analyzer",
            "type": "text"
          }
        },
        "type": "keyword"
      },
      "taxonRemarks": {
        "fields": {
          "analyzed": {
            "type": "text"
          },
          "ignoreCase": {
            "analyzer": "case_insensitive_analyzer",
            "type": "text"
          },
          "contains": {
            "analyzer": "contains_analyzer",
            "type": "text"
          }
        },
        "type": "keyword"
      },
      "vernacularNames": {
        "properties": {
          "experts": {
            "properties": {
              "agentText": {
                "fields": {
                  "analyzed": {
                    "type": "text"
                  },
                  "ignoreCase": {
                    "analyzer": "case_insensitive_analyzer",
                    "type": "text"
                  }
                },
                "type": "keyword"
              },
              "fullName": {
                "fields": {
                  "analyzed": {
                    "type": "text"
                  },
                  "ignoreCase": {
                    "analyzer": "case_insensitive_analyzer",
                    "type": "text"
                  },
                  "contains": {
                    "analyzer": "contains_analyzer",
                    "type": "text"
                  }
                },
                "type": "keyword"
              },
              "organization": {
                "properties": {
                  "agentText": {
                    "fields": {
                      "analyzed": {
                        "type": "text"
                      },
                      "ignoreCase": {
                        "analyzer": "case_insensitive_analyzer",
                        "type": "text"
                      }
                    },
                    "type": "keyword"
                  },
                  "name": {
                    "fields": {
                      "analyzed": {
                        "type": "text"
                      },
                      "ignoreCase": {
                        "analyzer": "case_insensitive_analyzer",
                        "type": "text"
                      },
                      "contains": {
                        "analyzer": "contains_analyzer",
                        "type": "text"
                      }
                    },
                    "type": "keyword"
                  }
                }
              }
            },
            "type": "nested"
          },
          "language": {
            "fields": {
              "analyzed": {
                "type": "text"
              },
              "ignoreCase": {
                "analyzer": "case_insensitive_analyzer",
                "type": "text"
              }
            },
            "type": "keyword"
          },
          "name": {
            "fields": {
              "analyzed": {
                "type": "text"
              },
              "ignoreCase": {
                "analyzer": "case_insensitive_analyzer",
                "type": "text"
              },
              "contains": {
                "analyzer": "contains_analyzer",
                "type": "text"
              }
            },
            "type": "keyword"
          },
          "preferred": {
            "type": "boolean"
          },
          "references": {
            "properties": {
              "author": {
                "properties": {
                  "agentText": {
                    "fields": {
                      "analyzed": {
                        "type": "text"
                      },
                      "ignoreCase": {
                        "analyzer": "case_insensitive_analyzer",
                        "type": "text"
                      }
                    },
                    "type": "keyword"
                  },
                  "fullName": {
                    "fields": {
                      "analyzed": {
                        "type": "text"
                      },
                      "ignoreCase": {
                        "analyzer": "case_insensitive_analyzer",
                        "type": "text"
                      },
                      "contains": {
                        "analyzer": "contains_analyzer",
                        "type": "text"
                      }
                    },
                    "type": "keyword"
                  },
                  "organization": {
                    "properties": {
                      "agentText": {
                        "fields": {
                          "analyzed": {
                            "type": "text"
                          },
                          "ignoreCase": {
                            "analyzer": "case_insensitive_analyzer",
                            "type": "text"
                          }
                        },
                        "type": "keyword"
                      },
                      "name": {
                        "fields": {
                          "analyzed": {
                            "type": "text"
                          },
                          "ignoreCase": {
                            "analyzer": "case_insensitive_analyzer",
                            "type": "text"
                          },
                          "contains": {
                            "analyzer": "contains_analyzer",
                            "type": "text"
                          }
                        },
                        "type": "keyword"
                      }
                    }
                  }
                }
              },
              "citationDetail": {
                "fields": {
                  "analyzed": {
                    "type": "text"
                  },
                  "ignoreCase": {
                    "analyzer": "case_insensitive_analyzer",
                    "type": "text"
                  }
                },
                "type": "keyword"
              },
              "publicationDate": {
                "format": "yyyy-MM-dd'T'HH:mm:ssZ||basic_date_time||strict_date_hour_minute_second",
                "type": "date"
              },
              "titleCitation": {
                "fields": {
                  "analyzed": {
                    "type": "text"
                  },
                  "ignoreCase": {
                    "analyzer": "case_insensitive_analyzer",
                    "type": "text"
                  }
                },
                "type": "keyword"
              },
              "uri": {
                "fields": {
                  "analyzed": {
                    "type": "text"
                  },
                  "ignoreCase": {
                    "analyzer": "case_insensitive_analyzer",
                    "type": "text"
                  }
                },
                "type": "keyword"
              }
            },
            "type": "nested"
          }
        },
        "type": "nested"
      }
    }
  }
}