{
  "annotations": {
    "list": [
      {
        "builtIn": 1,
        "datasource": {
          "type": "grafana",
          "uid": "-- Grafana --"
        },
        "enable": true,
        "hide": true,
        "iconColor": "rgba(0, 211, 255, 1)",
        "name": "Annotations & Alerts",
        "target": {
          "limit": 100,
          "matchAny": false,
          "tags": [],
          "type": "dashboard"
        },
        "type": "dashboard"
      }
    ]
  },
  "editable": true,
  "fiscalYearStartMonth": 0,
  "graphTooltip": 0,
  "id": 3,
  "links": [],
  "liveNow": false,
  "panels": [
    {
      "collapsed": false,
      "gridPos": {
        "h": 1,
        "w": 24,
        "x": 0,
        "y": 0
      },
      "id": 15,
      "panels": [],
      "title": "Explore",
      "type": "row"
    },
    {
      "datasource": {
        "type": "postgres",
        "uid": "P44368ADAD746BC27"
      },
      "fieldConfig": {
        "defaults": {
          "color": {
            "mode": "palette-classic"
          },
          "custom": {
            "axisCenteredZero": false,
            "axisColorMode": "text",
            "axisLabel": "",
            "axisPlacement": "auto",
            "barAlignment": 0,
            "drawStyle": "line",
            "fillOpacity": 20,
            "gradientMode": "none",
            "hideFrom": {
              "legend": false,
              "tooltip": false,
              "viz": false
            },
            "lineInterpolation": "smooth",
            "lineWidth": 2,
            "pointSize": 5,
            "scaleDistribution": {
              "log": 2,
              "type": "log"
            },
            "showPoints": "auto",
            "spanNulls": false,
            "stacking": {
              "group": "A",
              "mode": "none"
            },
            "thresholdsStyle": {
              "mode": "off"
            }
          },
          "mappings": [],
          "thresholds": {
            "mode": "absolute",
            "steps": [
              {
                "color": "green",
                "value": null
              },
              {
                "color": "red",
                "value": 80
              }
            ]
          }
        },
        "overrides": []
      },
      "gridPos": {
        "h": 10,
        "w": 8,
        "x": 0,
        "y": 1
      },
      "id": 7,
      "options": {
        "legend": {
          "calcs": [],
          "displayMode": "list",
          "placement": "bottom",
          "showLegend": true
        },
        "tooltip": {
          "mode": "single",
          "sort": "none"
        }
      },
      "targets": [
        {
          "datasource": {
            "type": "postgres",
            "uid": "P44368ADAD746BC27"
          },
          "editorMode": "code",
          "format": "table",
          "hide": false,
          "rawQuery": true,
          "rawSql": "WITH a AS (\nSELECT *, h3_cell_to_lat_lng(h3_2::h3index) AS location, make_date(year::int,1,1) AS time FROM gbif_aggregated\n), b as (\nSELECT *, ST_X(location::geometry) AS longitude, ST_Y(location::geometry) AS latitude FROM a\n)\nSELECT make_date(year::int,1,1) AS time, hll_cardinality(hll_union_agg(hll_scientificname)) AS cardinality, \nhll_cardinality(hll_union_agg(hll_gbifid)) AS count\n--(topn(topn_union_agg(topn_scientificname), 1)).*\nFROM b\nWHERE latitude >= ${minLat}\nAND latitude <= ${maxLat}\nAND longitude >= ${minLon}\nAND longitude <= ${maxLon}\nAND $__timeFilter(time)\nGROUP BY 1",
          "refId": "A",
          "sql": {
            "columns": [
              {
                "parameters": [],
                "type": "function"
              }
            ],
            "groupBy": [
              {
                "property": {
                  "type": "string"
                },
                "type": "groupBy"
              }
            ],
            "limit": 50
          }
        },
        {
          "datasource": {
            "type": "postgres",
            "uid": "P44368ADAD746BC27"
          },
          "editorMode": "code",
          "format": "table",
          "hide": true,
          "rawQuery": true,
          "rawSql": "SELECT make_date(year::int,1,1) AS time,\n       (topn(topn_union_agg(topn_scientificname), 3)).*\nFROM gbif_aggregated13\n--WHERE review_date >= '2000-01-01' AND review_date < '2001-01-01'\nGROUP BY 1 --HAVING hll_cardinality(hll_union_agg(hll_scientificname)) > 40000\nORDER BY 1",
          "refId": "B",
          "sql": {
            "columns": [
              {
                "parameters": [],
                "type": "function"
              }
            ],
            "groupBy": [
              {
                "property": {
                  "type": "string"
                },
                "type": "groupBy"
              }
            ],
            "limit": 50
          }
        },
        {
          "datasource": {
            "type": "postgres",
            "uid": "P44368ADAD746BC27"
          },
          "editorMode": "code",
          "format": "table",
          "hide": true,
          "rawQuery": true,
          "rawSql": "SELECT make_date(year::int,1,1) AS time, hll_cardinality(hll_union_agg(hll_scientificname)) AS cardinality, \nhll_cardinality(hll_union_agg(hll_gbifid)) AS count\n--(topn(topn_union_agg(topn_scientificname), 1)).*\nFROM gbif_aggregated17\nWHERE $__timeFilter(eventdate)\nGROUP BY 1",
          "refId": "C",
          "sql": {
            "columns": [
              {
                "parameters": [],
                "type": "function"
              }
            ],
            "groupBy": [
              {
                "property": {
                  "type": "string"
                },
                "type": "groupBy"
              }
            ],
            "limit": 50
          }
        }
      ],
      "title": "Panel Title",
      "type": "timeseries"
    },
    {
      "datasource": {
        "type": "postgres",
        "uid": "P44368ADAD746BC27"
      },
      "gridPos": {
        "h": 10,
        "w": 8,
        "x": 8,
        "y": 1
      },
      "id": 11,
      "options": {
        "ant": {
          "color": "rgba(0, 100, 255, 1)",
          "colorOverridesByLabel": [],
          "delay": 400,
          "labelName": "",
          "paused": false,
          "pulseColor": "rgba(0, 100, 255, 0.2)",
          "reverse": false,
          "weight": 5
        },
        "coordinates": {
          "customLatitudeColumnName": "",
          "customLongitudeColumnName": ""
        },
        "discardZeroOrNull": true,
        "heat": {
          "fitBoundsOnLoad": false,
          "fitBoundsOnUpdate": false
        },
        "hex": {
          "colorRangeFrom": "#f7fbff",
          "colorRangeTo": "#ff0000",
          "opacity": 0.6,
          "radiusRangeFrom": 5,
          "radiusRangeTo": 12
        },
        "map": {
          "centerLatitude": 56.17203,
          "centerLongitude": 5,
          "tileAttribution": "&copy <a href=\"http://osm.org/copyright\">OpenStreetMap</a> contributors",
          "tileUrlSchema": "https://{s}.tile.openstreetmap.org/{z}/{x}/{y}.png",
          "useBoundsInQuery": true,
          "useCenterFromFirstPos": false,
          "useCenterFromLastPos": false,
          "zoom": 5,
          "zoomToDataBounds": false
        },
        "marker": {
          "alwaysShowTooltips": false,
          "defaultHtml": "<?xml version=\"1.0\" encoding=\"UTF-8\"?><svg xmlns=\"http://www.w3.org/2000/svg\" xmlns:xlink=\"http://www.w3.org/1999/xlink\" width=\"25px\" height=\"25px\" viewBox=\"0 0 25 25\" version=\"1.1\"><g id=\"surface1\"><path style=\" stroke:none;fill-rule:nonzero;fill:rgb(100%,50%,50%);fill-opacity:0.8;\" d=\"M 12.515625 0 L 12.480469 0 C 8.164062 0 4.652344 3.511719 4.652344 7.828125 C 4.652344 10.65625 5.941406 14.386719 8.480469 18.921875 C 10.363281 22.285156 12.273438 24.859375 12.292969 24.882812 C 12.347656 24.957031 12.429688 24.996094 12.519531 24.996094 C 12.523438 24.996094 12.523438 24.996094 12.527344 24.996094 C 12.617188 24.996094 12.703125 24.949219 12.753906 24.871094 C 12.773438 24.84375 14.667969 21.980469 16.539062 18.476562 C 19.066406 13.75 20.347656 10.164062 20.347656 7.828125 C 20.347656 3.511719 16.832031 0 12.515625 0 Z M 16.128906 8.019531 C 16.128906 10.019531 14.5 11.648438 12.5 11.648438 C 10.496094 11.648438 8.867188 10.019531 8.867188 8.019531 C 8.867188 6.015625 10.496094 4.386719 12.5 4.386719 C 14.5 4.386719 16.128906 6.015625 16.128906 8.019531 Z M 16.128906 8.019531 \"/></g></svg>",
          "iconOffset": "",
          "labelName": "",
          "markerHtmlByLabel": [],
          "popupOffset": "",
          "showOnlyLastMarker": false,
          "size": 25,
          "sizeLast": 25,
          "tooltipOffset": "",
          "useHTMLForMarkers": false,
          "useSecondaryIconForAllMarkers": false,
          "useSecondaryIconForLastMarker": false
        },
        "viewType": "marker"
      },
      "targets": [
        {
          "datasource": {
            "type": "postgres",
            "uid": "P44368ADAD746BC27"
          },
          "editorMode": "code",
          "format": "table",
          "rawQuery": true,
          "rawSql": "WITH a AS (\nSELECT *, h3_cell_to_lat_lng(h3_2::h3index) AS location, make_date(year::int,1,1) AS time FROM gbif_aggregated\n), b as (\nSELECT *, ST_X(location::geometry) AS longitude, ST_Y(location::geometry) AS latitude FROM a\n), c AS (\nSELECT (topn(topn_union_agg(topn_h3_2), 500)).* FROM b\nWHERE latitude >= ${minLat}\nAND latitude <= ${maxLat}\nAND longitude >= ${minLon}\nAND longitude <= ${maxLon}\nAND $__timeFilter(time)\n), d AS (\nSELECT h3_cell_to_lat_lng(item::h3index) AS location, frequency FROM c\n)\nSELECT ST_X(location::geometry) AS longitude, ST_Y(location::geometry) AS latitude, frequency AS desc FROM d",
          "refId": "A",
          "sql": {
            "columns": [
              {
                "parameters": [],
                "type": "function"
              }
            ],
            "groupBy": [
              {
                "property": {
                  "type": "string"
                },
                "type": "groupBy"
              }
            ],
            "limit": 50
          }
        }
      ],
      "title": "Panel Title",
      "type": "alexandra-trackmap-panel"
    },
    {
      "datasource": {
        "type": "postgres",
        "uid": "P44368ADAD746BC27"
      },
      "fieldConfig": {
        "defaults": {
          "color": {
            "mode": "thresholds"
          },
          "custom": {
            "hideFrom": {
              "legend": false,
              "tooltip": false,
              "viz": false
            }
          },
          "mappings": [],
          "thresholds": {
            "mode": "percentage",
            "steps": [
              {
                "color": "green",
                "value": null
              },
              {
                "color": "#EF843C",
                "value": 20
              },
              {
                "color": "#6ED0E0",
                "value": 40
              },
              {
                "color": "#EAB839",
                "value": 60
              },
              {
                "color": "red",
                "value": 80
              }
            ]
          }
        },
        "overrides": []
      },
      "gridPos": {
        "h": 10,
        "w": 8,
        "x": 16,
        "y": 1
      },
      "id": 9,
      "options": {
        "basemap": {
          "config": {},
          "name": "Layer 0",
          "type": "osm-standard"
        },
        "controls": {
          "mouseWheelZoom": true,
          "showAttribution": true,
          "showDebug": false,
          "showMeasure": false,
          "showScale": false,
          "showZoom": true
        },
        "layers": [
          {
            "config": {
              "showLegend": false,
              "style": {
                "color": {
                  "field": "frequency",
                  "fixed": "dark-green"
                },
                "opacity": 0.5,
                "rotation": {
                  "field": "frequency",
                  "fixed": 0,
                  "max": 360,
                  "min": -360,
                  "mode": "mod"
                },
                "size": {
                  "fixed": 5,
                  "max": 15,
                  "min": 5
                },
                "symbol": {
                  "fixed": "img/icons/marker/circle.svg",
                  "mode": "fixed"
                },
                "textConfig": {
                  "fontSize": 12,
                  "offsetX": 0,
                  "offsetY": 0,
                  "textAlign": "center",
                  "textBaseline": "middle"
                }
              }
            },
            "location": {
              "mode": "auto"
            },
            "name": "Layer 1",
            "tooltip": true,
            "type": "markers"
          },
          {
            "config": {
              "rules": [],
              "src": "public/maps/h3_2.geojson",
              "style": {
                "color": {
                  "fixed": "dark-green"
                },
                "opacity": 0.4,
                "rotation": {
                  "fixed": 0,
                  "max": 360,
                  "min": -360,
                  "mode": "mod"
                },
                "size": {
                  "fixed": 5,
                  "max": 15,
                  "min": 2
                },
                "symbol": {
                  "fixed": "img/icons/marker/circle.svg",
                  "mode": "fixed"
                },
                "textConfig": {
                  "fontSize": 12,
                  "offsetX": 0,
                  "offsetY": 0,
                  "textAlign": "center",
                  "textBaseline": "middle"
                }
              }
            },
            "name": "Layer 2",
            "tooltip": true,
            "type": "geojson"
          }
        ],
        "tooltip": {
          "mode": "details"
        },
        "view": {
          "allLayers": true,
          "id": "fit",
          "lat": 0,
          "lon": 0,
          "zoom": 15
        }
      },
      "pluginVersion": "10.0.2",
      "targets": [
        {
          "datasource": {
            "type": "postgres",
            "uid": "P44368ADAD746BC27"
          },
          "editorMode": "code",
          "format": "table",
          "hide": false,
          "rawQuery": true,
          "rawSql": "WITH a AS (\nSELECT *, h3_cell_to_lat_lng(h3_2::h3index) AS location, make_date(year::int,1,1) AS time FROM gbif_aggregated\n), b as (\nSELECT *, ST_X(location::geometry) AS longitude, ST_Y(location::geometry) AS latitude FROM a\n), c AS (\nSELECT (topn(topn_union_agg(topn_h3_2), 500)).* FROM b\nWHERE latitude >= ${minLat}\nAND latitude <= ${maxLat}\nAND longitude >= ${minLon}\nAND longitude <= ${maxLon}\nAND $__timeFilter(time)\n), d AS (\nSELECT h3_cell_to_lat_lng(item::h3index) AS location, frequency FROM c\n)\nSELECT ST_X(location::geometry) AS longitude, ST_Y(location::geometry) AS latitude, frequency FROM d",
          "refId": "B",
          "sql": {
            "columns": [
              {
                "parameters": [],
                "type": "function"
              }
            ],
            "groupBy": [
              {
                "property": {
                  "type": "string"
                },
                "type": "groupBy"
              }
            ],
            "limit": 50
          }
        },
        {
          "datasource": {
            "type": "postgres",
            "uid": "P44368ADAD746BC27"
          },
          "editorMode": "code",
          "format": "table",
          "hide": true,
          "rawQuery": true,
          "rawSql": "WITH a AS (\nSELECT *, h3_cell_to_lat_lng(h3_2::h3index) AS location FROM gbif_aggregated17\n), b as (\nSELECT *, ST_X(location::geometry) AS longitude, ST_Y(location::geometry) AS latitude FROM a\n), c AS (\nSELECT (topn(topn_union_agg(topn_h3_2), 100)).* FROM b\nWHERE latitude >= ${minLat}\nAND latitude <= ${maxLat}\nAND longitude >= ${minLon}\nAND longitude <= ${maxLon}\nAND $__timeFilter(eventdate)\n), d AS (\nSELECT h3_cell_to_lat_lng(item::h3index) AS location, frequency FROM c\n)\nSELECT ST_X(location::geometry) AS longitude, ST_Y(location::geometry) AS latitude, frequency FROM d",
          "refId": "B",
          "sql": {
            "columns": [
              {
                "parameters": [],
                "type": "function"
              }
            ],
            "groupBy": [
              {
                "property": {
                  "type": "string"
                },
                "type": "groupBy"
              }
            ],
            "limit": 50
          }
        }
      ],
      "title": "Geomap",
      "type": "geomap"
    },
    {
      "datasource": {
        "type": "postgres",
        "uid": "P44368ADAD746BC27"
      },
      "fieldConfig": {
        "defaults": {
          "color": {
            "mode": "thresholds"
          },
          "custom": {
            "axisCenteredZero": false,
            "axisColorMode": "text",
            "axisLabel": "",
            "axisPlacement": "auto",
            "fillOpacity": 80,
            "gradientMode": "none",
            "hideFrom": {
              "legend": false,
              "tooltip": false,
              "viz": false
            },
            "lineWidth": 1,
            "scaleDistribution": {
              "type": "linear"
            },
            "thresholdsStyle": {
              "mode": "off"
            }
          },
          "mappings": [],
          "thresholds": {
            "mode": "absolute",
            "steps": [
              {
                "color": "green",
                "value": null
              },
              {
                "color": "red",
                "value": 80
              }
            ]
          }
        },
        "overrides": []
      },
      "gridPos": {
        "h": 7,
        "w": 7,
        "x": 0,
        "y": 11
      },
      "id": 12,
      "options": {
        "barRadius": 0,
        "barWidth": 0.97,
        "fullHighlight": false,
        "groupWidth": 0.7,
        "legend": {
          "calcs": [],
          "displayMode": "list",
          "placement": "bottom",
          "showLegend": true
        },
        "orientation": "auto",
        "showValue": "auto",
        "stacking": "none",
        "tooltip": {
          "mode": "single",
          "sort": "none"
        },
        "xTickLabelRotation": 0,
        "xTickLabelSpacing": 0
      },
      "pluginVersion": "9.4.3",
      "targets": [
        {
          "datasource": {
            "type": "postgres",
            "uid": "P44368ADAD746BC27"
          },
          "editorMode": "code",
          "format": "table",
          "rawQuery": true,
          "rawSql": "WITH a AS (\nSELECT *, h3_cell_to_lat_lng(h3_2::h3index) AS location, make_date(year::int,1,1) AS time FROM gbif_aggregated\n), b as (\nSELECT *, ST_X(location::geometry) AS longitude, ST_Y(location::geometry) AS latitude FROM a\n)\nSELECT countrycode, hll_cardinality(hll_union_agg(hll_scientificname))\nFROM b\nWHERE latitude >= ${minLat}\nAND latitude <= ${maxLat}\nAND longitude >= ${minLon}\nAND longitude <= ${maxLon}\nAND $__timeFilter(time)\nGROUP BY 1 ORDER BY 2 DESC LIMIT 10",
          "refId": "A",
          "sql": {
            "columns": [
              {
                "parameters": [],
                "type": "function"
              }
            ],
            "groupBy": [
              {
                "property": {
                  "type": "string"
                },
                "type": "groupBy"
              }
            ],
            "limit": 50
          }
        }
      ],
      "title": "Top 10 countries scientificname cardinality",
      "type": "barchart"
    },
    {
      "datasource": {
        "type": "postgres",
        "uid": "P44368ADAD746BC27"
      },
      "fieldConfig": {
        "defaults": {
          "color": {
            "mode": "thresholds"
          },
          "custom": {
            "axisCenteredZero": false,
            "axisColorMode": "text",
            "axisLabel": "",
            "axisPlacement": "auto",
            "fillOpacity": 80,
            "gradientMode": "none",
            "hideFrom": {
              "legend": false,
              "tooltip": false,
              "viz": false
            },
            "lineWidth": 1,
            "scaleDistribution": {
              "type": "linear"
            },
            "thresholdsStyle": {
              "mode": "off"
            }
          },
          "mappings": [],
          "thresholds": {
            "mode": "absolute",
            "steps": [
              {
                "color": "green",
                "value": null
              },
              {
                "color": "red",
                "value": 80
              }
            ]
          }
        },
        "overrides": []
      },
      "gridPos": {
        "h": 7,
        "w": 7,
        "x": 7,
        "y": 11
      },
      "id": 13,
      "options": {
        "barRadius": 0,
        "barWidth": 0.97,
        "fullHighlight": false,
        "groupWidth": 0.7,
        "legend": {
          "calcs": [],
          "displayMode": "list",
          "placement": "bottom",
          "showLegend": true
        },
        "orientation": "auto",
        "showValue": "auto",
        "stacking": "none",
        "tooltip": {
          "mode": "single",
          "sort": "none"
        },
        "xTickLabelRotation": 0,
        "xTickLabelSpacing": 0
      },
      "pluginVersion": "9.4.3",
      "targets": [
        {
          "datasource": {
            "type": "postgres",
            "uid": "P44368ADAD746BC27"
          },
          "editorMode": "code",
          "format": "table",
          "rawQuery": true,
          "rawSql": "WITH a AS (\nSELECT *, h3_cell_to_lat_lng(h3_2::h3index) AS location, make_date(year::int,1,1) AS time FROM gbif_aggregated\n), b as (\nSELECT *, ST_X(location::geometry) AS longitude, ST_Y(location::geometry) AS latitude FROM a\n)\nSELECT countrycode, hll_cardinality(hll_union_agg(hll_recordedby))\nFROM b\nWHERE latitude >= ${minLat}\nAND latitude <= ${maxLat}\nAND longitude >= ${minLon}\nAND longitude <= ${maxLon}\nAND $__timeFilter(time)\nGROUP BY 1 ORDER BY 2 DESC LIMIT 10",
          "refId": "A",
          "sql": {
            "columns": [
              {
                "parameters": [],
                "type": "function"
              }
            ],
            "groupBy": [
              {
                "property": {
                  "type": "string"
                },
                "type": "groupBy"
              }
            ],
            "limit": 50
          }
        }
      ],
      "title": "Top 10 countries recordedby cardinality",
      "type": "barchart"
    },
    {
      "datasource": {
        "type": "postgres",
        "uid": "P44368ADAD746BC27"
      },
      "fieldConfig": {
        "defaults": {
          "color": {
            "mode": "thresholds"
          },
          "custom": {
            "axisCenteredZero": false,
            "axisColorMode": "text",
            "axisLabel": "",
            "axisPlacement": "auto",
            "fillOpacity": 80,
            "gradientMode": "none",
            "hideFrom": {
              "legend": false,
              "tooltip": false,
              "viz": false
            },
            "lineWidth": 1,
            "scaleDistribution": {
              "type": "linear"
            },
            "thresholdsStyle": {
              "mode": "off"
            }
          },
          "mappings": [],
          "thresholds": {
            "mode": "absolute",
            "steps": [
              {
                "color": "green",
                "value": null
              },
              {
                "color": "red",
                "value": 80
              }
            ]
          }
        },
        "overrides": []
      },
      "gridPos": {
        "h": 7,
        "w": 10,
        "x": 14,
        "y": 11
      },
      "id": 3,
      "options": {
        "barRadius": 0,
        "barWidth": 0.97,
        "fullHighlight": false,
        "groupWidth": 0.7,
        "legend": {
          "calcs": [],
          "displayMode": "list",
          "placement": "bottom",
          "showLegend": true
        },
        "orientation": "horizontal",
        "showValue": "auto",
        "stacking": "none",
        "tooltip": {
          "mode": "single",
          "sort": "none"
        },
        "xTickLabelRotation": 0,
        "xTickLabelSpacing": 0
      },
      "pluginVersion": "9.4.3",
      "targets": [
        {
          "datasource": {
            "type": "postgres",
            "uid": "P44368ADAD746BC27"
          },
          "editorMode": "code",
          "format": "table",
          "rawQuery": true,
          "rawSql": "WITH a AS (\nSELECT *, h3_cell_to_lat_lng(h3_2::h3index) AS location, make_date(year::int,1,1) AS time FROM gbif_aggregated\n), b as (\nSELECT *, ST_X(location::geometry) AS longitude, ST_Y(location::geometry) AS latitude FROM a\n)\nSELECT (topn(topn_union_agg(topn_scientificname), 10)).*\nFROM b\nWHERE latitude >= ${minLat}\nAND latitude <= ${maxLat}\nAND longitude >= ${minLon}\nAND longitude <= ${maxLon}\nAND $__timeFilter(time)",
          "refId": "A",
          "sql": {
            "columns": [
              {
                "parameters": [],
                "type": "function"
              }
            ],
            "groupBy": [
              {
                "property": {
                  "type": "string"
                },
                "type": "groupBy"
              }
            ],
            "limit": 50
          }
        }
      ],
      "title": "Top 10 scientificname",
      "type": "barchart"
    },
    {
      "datasource": {
        "type": "postgres",
        "uid": "P44368ADAD746BC27"
      },
      "fieldConfig": {
        "defaults": {
          "color": {
            "mode": "thresholds"
          },
          "custom": {
            "axisCenteredZero": false,
            "axisColorMode": "text",
            "axisLabel": "",
            "axisPlacement": "auto",
            "fillOpacity": 80,
            "gradientMode": "none",
            "hideFrom": {
              "legend": false,
              "tooltip": false,
              "viz": false
            },
            "lineWidth": 1,
            "scaleDistribution": {
              "type": "linear"
            },
            "thresholdsStyle": {
              "mode": "off"
            }
          },
          "mappings": [],
          "thresholds": {
            "mode": "absolute",
            "steps": [
              {
                "color": "green",
                "value": null
              },
              {
                "color": "red",
                "value": 80
              }
            ]
          }
        },
        "overrides": []
      },
      "gridPos": {
        "h": 7,
        "w": 7,
        "x": 0,
        "y": 18
      },
      "id": 2,
      "options": {
        "barRadius": 0,
        "barWidth": 0.97,
        "fullHighlight": false,
        "groupWidth": 0.7,
        "legend": {
          "calcs": [],
          "displayMode": "list",
          "placement": "bottom",
          "showLegend": true
        },
        "orientation": "auto",
        "showValue": "auto",
        "stacking": "none",
        "tooltip": {
          "mode": "single",
          "sort": "none"
        },
        "xTickLabelRotation": 0,
        "xTickLabelSpacing": 0
      },
      "pluginVersion": "9.4.3",
      "targets": [
        {
          "datasource": {
            "type": "postgres",
            "uid": "P44368ADAD746BC27"
          },
          "editorMode": "code",
          "format": "table",
          "rawQuery": true,
          "rawSql": "WITH a AS (\nSELECT *, h3_cell_to_lat_lng(h3_2::h3index) AS location, make_date(year::int,1,1) AS time FROM gbif_aggregated\n), b as (\nSELECT *, ST_X(location::geometry) AS longitude, ST_Y(location::geometry) AS latitude FROM a\n)\nSELECT (topn(topn_union_agg(topn_countrycode), 10)).*\nFROM b\nWHERE latitude >= ${minLat}\nAND latitude <= ${maxLat}\nAND longitude >= ${minLon}\nAND longitude <= ${maxLon}\nAND $__timeFilter(time)",
          "refId": "A",
          "sql": {
            "columns": [
              {
                "parameters": [],
                "type": "function"
              }
            ],
            "groupBy": [
              {
                "property": {
                  "type": "string"
                },
                "type": "groupBy"
              }
            ],
            "limit": 50
          }
        }
      ],
      "title": "Top 10 countries count",
      "type": "barchart"
    },
    {
      "datasource": {
        "type": "postgres",
        "uid": "P44368ADAD746BC27"
      },
      "fieldConfig": {
        "defaults": {
          "color": {
            "mode": "thresholds"
          },
          "custom": {
            "axisCenteredZero": false,
            "axisColorMode": "text",
            "axisLabel": "",
            "axisPlacement": "auto",
            "fillOpacity": 80,
            "gradientMode": "none",
            "hideFrom": {
              "legend": false,
              "tooltip": false,
              "viz": false
            },
            "lineWidth": 1,
            "scaleDistribution": {
              "type": "linear"
            },
            "thresholdsStyle": {
              "mode": "off"
            }
          },
          "mappings": [],
          "thresholds": {
            "mode": "absolute",
            "steps": [
              {
                "color": "green",
                "value": null
              },
              {
                "color": "red",
                "value": 80
              }
            ]
          }
        },
        "overrides": []
      },
      "gridPos": {
        "h": 7,
        "w": 7,
        "x": 7,
        "y": 18
      },
      "id": 4,
      "options": {
        "barRadius": 0,
        "barWidth": 0.97,
        "fullHighlight": false,
        "groupWidth": 0.7,
        "legend": {
          "calcs": [],
          "displayMode": "list",
          "placement": "bottom",
          "showLegend": true
        },
        "orientation": "horizontal",
        "showValue": "auto",
        "stacking": "none",
        "tooltip": {
          "mode": "single",
          "sort": "none"
        },
        "xTickLabelRotation": 0,
        "xTickLabelSpacing": 0
      },
      "pluginVersion": "9.4.3",
      "targets": [
        {
          "datasource": {
            "type": "postgres",
            "uid": "P44368ADAD746BC27"
          },
          "editorMode": "code",
          "format": "table",
          "rawQuery": true,
          "rawSql": "WITH a AS (\nSELECT *, h3_cell_to_lat_lng(h3_2::h3index) AS location, make_date(year::int,1,1) AS time FROM gbif_aggregated\n), b as (\nSELECT *, ST_X(location::geometry) AS longitude, ST_Y(location::geometry) AS latitude FROM a\n)\nSELECT (topn(topn_union_agg(topn_h3_2), 10)).*\nFROM b\nWHERE latitude >= ${minLat}\nAND latitude <= ${maxLat}\nAND longitude >= ${minLon}\nAND longitude <= ${maxLon}\nAND $__timeFilter(time)",
          "refId": "A",
          "sql": {
            "columns": [
              {
                "parameters": [],
                "type": "function"
              }
            ],
            "groupBy": [
              {
                "property": {
                  "type": "string"
                },
                "type": "groupBy"
              }
            ],
            "limit": 50
          }
        }
      ],
      "title": "Top 10 h3_2",
      "type": "barchart"
    },
    {
      "datasource": {
        "type": "postgres",
        "uid": "P44368ADAD746BC27"
      },
      "fieldConfig": {
        "defaults": {
          "color": {
            "mode": "thresholds"
          },
          "custom": {
            "axisCenteredZero": false,
            "axisColorMode": "text",
            "axisLabel": "",
            "axisPlacement": "auto",
            "fillOpacity": 80,
            "gradientMode": "none",
            "hideFrom": {
              "legend": false,
              "tooltip": false,
              "viz": false
            },
            "lineWidth": 1,
            "scaleDistribution": {
              "type": "linear"
            },
            "thresholdsStyle": {
              "mode": "off"
            }
          },
          "mappings": [],
          "thresholds": {
            "mode": "absolute",
            "steps": [
              {
                "color": "green",
                "value": null
              },
              {
                "color": "red",
                "value": 80
              }
            ]
          }
        },
        "overrides": []
      },
      "gridPos": {
        "h": 7,
        "w": 10,
        "x": 14,
        "y": 18
      },
      "id": 5,
      "options": {
        "barRadius": 0,
        "barWidth": 0.97,
        "fullHighlight": false,
        "groupWidth": 0.7,
        "legend": {
          "calcs": [],
          "displayMode": "list",
          "placement": "bottom",
          "showLegend": true
        },
        "orientation": "horizontal",
        "showValue": "auto",
        "stacking": "none",
        "tooltip": {
          "mode": "single",
          "sort": "none"
        },
        "xTickLabelRotation": 0,
        "xTickLabelSpacing": 0
      },
      "pluginVersion": "9.4.3",
      "targets": [
        {
          "datasource": {
            "type": "postgres",
            "uid": "P44368ADAD746BC27"
          },
          "editorMode": "code",
          "format": "table",
          "rawQuery": true,
          "rawSql": "WITH a AS (\nSELECT *, h3_cell_to_lat_lng(h3_2::h3index) AS location, make_date(year::int,1,1) AS time FROM gbif_aggregated\n), b as (\nSELECT *, ST_X(location::geometry) AS longitude, ST_Y(location::geometry) AS latitude FROM a\n)\nSELECT (topn(topn_union_agg(topn_recordedby), 10)).*\nFROM b\nWHERE latitude >= ${minLat}\nAND latitude <= ${maxLat}\nAND longitude >= ${minLon}\nAND longitude <= ${maxLon}\nAND $__timeFilter(time)",
          "refId": "A",
          "sql": {
            "columns": [
              {
                "parameters": [],
                "type": "function"
              }
            ],
            "groupBy": [
              {
                "property": {
                  "type": "string"
                },
                "type": "groupBy"
              }
            ],
            "limit": 50
          }
        }
      ],
      "title": "Top 10 recordedby",
      "type": "barchart"
    },
    {
      "collapsed": false,
      "gridPos": {
        "h": 1,
        "w": 24,
        "x": 0,
        "y": 25
      },
      "id": 17,
      "panels": [],
      "title": "Search",
      "type": "row"
    }
  ],
  "refresh": "",
  "revision": 1,
  "schemaVersion": 38,
  "style": "dark",
  "tags": [],
  "templating": {
    "list": [
      {
        "description": "",
        "hide": 2,
        "name": "minLat",
        "query": "${VAR_MINLAT}",
        "skipUrlSync": false,
        "type": "constant"
      },
      {
        "description": "",
        "hide": 2,
        "name": "maxLat",
        "query": "${VAR_MAXLAT}",
        "skipUrlSync": false,
        "type": "constant"
      },
      {
        "description": "",
        "hide": 2,
        "name": "minLon",
        "query": "${VAR_MINLON}",
        "skipUrlSync": false,
        "type": "constant"
      },
      {
        "description": "",
        "hide": 2,
        "name": "maxLon",
        "query": "${VAR_MAXLON}",
        "skipUrlSync": false,
        "type": "constant"
      }
    ]
  },
  "time": {
    "from": "1500-01-01T00:00:00.000Z",
    "to": "2024-01-01T00:00:00.000Z"
  },
  "timepicker": {},
  "timezone": "",
  "title": "Postgres aggregated",
  "uid": "6LsZx1C4k",
  "version": 3,
  "weekStart": ""
}
