<!-- Generated by IcoMoon.io -->
<svg version="1.1" xmlns="http://www.w3.org/2000/svg" width="16" height="16" viewBox="0 0 16 16">
<title>trash</title>
<path fill="#444" d="M2.667 14.222c0 0.978 0.8 1.778 1.778 1.778h7.111c0.978 0 1.778-0.8 1.778-1.778v-8.889c0-0.978-0.8-1.778-1.778-1.778h-7.111c-0.978 0-1.778 0.8-1.778 1.778v8.889zM13.333 0.889h-2.222l-0.631-0.631c-0.16-0.16-0.391-0.258-0.622-0.258h-3.716c-0.231 0-0.462 0.098-0.622 0.258l-0.631 0.631h-2.222c-0.489 0-0.889 0.4-0.889 0.889s0.4 0.889 0.889 0.889h10.667c0.489 0 0.889-0.4 0.889-0.889s-0.4-0.889-0.889-0.889z"></path>
</svg>
