<!-- Generated by IcoMoon.io -->
<svg version="1.1" xmlns="http://www.w3.org/2000/svg" width="16" height="16" viewBox="0 0 16 16">
<title>level0</title>
<path fill="#444" d="M10.5 2.2h-4.95c-0.45 0-0.85-0.4-0.85-0.85s0.35-0.85 0.85-0.85h4.95c0.45 0 0.85 0.4 0.85 0.85s-0.4 0.85-0.85 0.85zM5.55 1c-0.050 0-0.050-0.050 0 0-0.25 0-0.4 0.15-0.4 0.35s0.15 0.35 0.35 0.35c0 0 0.050 0 0.050 0h4.95c0 0 0.050 0 0.050 0 0.2 0 0.35-0.15 0.35-0.35s-0.15-0.4-0.4-0.4c0 0-0.050 0-0.050 0l-4.9 0.050z"></path>
<path fill="#444" d="M10.5 4.85h-4.95c-0.5 0-0.9-0.35-0.9-0.85s0.4-0.85 0.85-0.85h5c0.45 0 0.85 0.4 0.85 0.85s-0.4 0.85-0.85 0.85zM5.55 3.65c-0.050 0-0.050 0 0 0-0.25 0-0.4 0.15-0.4 0.35s0.15 0.35 0.35 0.35c0 0 0.050 0 0.050 0h4.95c0 0 0.050 0 0.050 0 0.2 0 0.35-0.15 0.35-0.35s-0.15-0.35-0.35-0.35c0 0-0.050 0-0.050 0h-4.95z"></path>
<path fill="#444" d="M10.5 7.5h-4.95c-0.45 0-0.85-0.4-0.85-0.85s0.4-0.85 0.85-0.85h4.95c0.45 0 0.85 0.4 0.85 0.85s-0.4 0.85-0.85 0.85zM5.55 6.3c-0.050 0-0.050 0 0 0-0.25 0-0.4 0.15-0.4 0.35s0.15 0.35 0.35 0.35c0 0 0.050 0 0.050 0h4.95c0 0 0.050 0 0.050 0 0.2 0 0.35-0.15 0.35-0.35s-0.15-0.35-0.35-0.35c0 0-0.050 0-0.050 0h-4.95z"></path>
<path fill="#444" d="M10.5 10.2h-4.95c-0.45 0-0.85-0.4-0.85-0.85s0.4-0.85 0.85-0.85h4.95c0.45 0 0.85 0.4 0.85 0.85s-0.4 0.85-0.85 0.85zM5.55 8.95c-0.050 0-0.050 0 0 0-0.25 0-0.4 0.15-0.4 0.35s0.15 0.35 0.35 0.35c0 0 0.050 0 0.050 0h4.95c0 0 0.050 0 0.050 0 0.2 0 0.35-0.15 0.35-0.35s-0.15-0.35-0.35-0.35c0 0-0.050 0-0.050 0h-4.95z"></path>
<path fill="#444" d="M10.5 12.85h-4.95c-0.45 0-0.85-0.4-0.85-0.85s0.4-0.85 0.85-0.85h4.95c0.45 0 0.85 0.4 0.85 0.85s-0.4 0.85-0.85 0.85zM5.55 11.6c-0.050 0-0.050 0 0 0-0.25 0-0.4 0.15-0.4 0.35s0.15 0.35 0.35 0.35c0 0 0.050 0 0.050 0h4.95c0 0 0.050 0 0.050 0 0.2 0 0.35-0.15 0.35-0.35s-0.15-0.35-0.35-0.35c0 0-0.050 0-0.050 0h-4.95z"></path>
<path fill="#444" d="M10.5 15.5h-4.95c-0.45 0-0.85-0.4-0.85-0.85s0.4-0.85 0.85-0.85h4.95c0.45 0 0.85 0.4 0.85 0.85s-0.4 0.85-0.85 0.85zM5.55 14.25c-0.050 0-0.050 0 0 0-0.25 0-0.4 0.15-0.4 0.35s0.1 0.4 0.35 0.4c0 0 0.050 0 0.050 0h4.95c0 0 0.050 0 0.050 0 0.2 0 0.35-0.15 0.35-0.35s-0.15-0.35-0.35-0.35c0 0-0.050 0-0.050 0l-4.95-0.050z"></path>
</svg>
