<!-- Generated by IcoMoon.io -->
<svg version="1.1" xmlns="http://www.w3.org/2000/svg" width="16" height="16" viewBox="0 0 16 16">
<title>sample</title>
<path fill="#444" d="M10.347 0h-4.747c-0.8 0-1.387 0.587-1.387 1.387 0 0.693 0.533 1.333 1.333 1.387v10.773c0 1.387 1.12 2.453 2.453 2.453s2.453-1.12 2.453-2.453v-10.827c0.747-0.053 1.333-0.64 1.333-1.333-0.053-0.747-0.693-1.387-1.44-1.387v0zM9.547 11.68h-3.147v-1.707h0.96c0.213 0 0.427-0.213 0.427-0.427s-0.213-0.427-0.427-0.427h-0.96v-1.6h0.96c0.213 0 0.427-0.213 0.427-0.427s-0.213-0.427-0.427-0.427h-0.96v-1.6h0.96c0.213 0 0.427-0.213 0.427-0.427s-0.213-0.427-0.427-0.427h-0.96v-1.547h3.147v9.013zM10.347 1.813h-4.747c-0.213 0-0.427-0.213-0.427-0.427s0.213-0.427 0.427-0.427h4.747c0.213 0 0.427 0.213 0.427 0.427s-0.213 0.427-0.427 0.427z"></path>
</svg>
