<!-- Generated by IcoMoon.io -->
<svg version="1.1" xmlns="http://www.w3.org/2000/svg" width="16" height="16" viewBox="0 0 16 16">
<title>emplacement</title>
<path fill="#444" d="M13.36 0h-10.773c-0.373 0-0.64 0.267-0.64 0.64v14.72c0 0.373 0.267 0.64 0.64 0.64h10.827c0.373 0 0.64-0.267 0.64-0.64v-14.72c-0.053-0.373-0.32-0.64-0.693-0.64zM13.573 0.64v3.36h-3.68v-3.573h3.467c0.16 0 0.213 0.107 0.213 0.213zM9.84 4.107v3.733h-3.68v-3.733h3.68zM6.107 4v-3.573h3.68v3.573h-3.68zM9.467 11.467h-2.987v-3.093h2.987v3.093zM6 7.84h-3.627v-3.733h3.68v3.733zM6 7.947v3.893h-3.627v-3.893h3.627zM9.84 11.947v3.627h-3.68v-3.627h3.68zM9.947 7.947h3.68v3.893h-3.68v-3.893zM9.947 7.84v-3.733h3.68v3.733h-3.68zM2.587 0.427h3.467v3.573h-3.68v-3.36c0-0.107 0.053-0.213 0.213-0.213zM2.373 15.36v-3.413h3.68v3.627h-3.467c-0.16 0-0.213-0.107-0.213-0.213zM13.36 15.573h-3.467v-3.627h3.68v3.413c0 0.107-0.053 0.213-0.213 0.213z"></path>
<path fill="#444" d="M5.253 13.92c0-0.64-0.48-1.547-1.067-1.547-0.267 0-0.587 0.213-0.8 0.587v0c-0.16 0.32-0.267 0.64-0.32 1.013v0c0 0 0 0 0 0 0 0.32 0.107 0.587 0.32 0.8v0c0.213 0.213 0.48 0.32 0.747 0.32v0 0c0.32 0 0.587-0.16 0.747-0.32 0.267-0.213 0.373-0.48 0.373-0.853 0 0.053 0 0.053 0 0zM4.933 13.973c0 0.213-0.107 0.48-0.213 0.64v0c-0.16 0.16-0.32 0.267-0.533 0.267v0c-0.213 0-0.427-0.107-0.533-0.267-0.16-0.16-0.213-0.373-0.213-0.64 0 0 0 0 0 0v0c0-0.32 0.107-0.587 0.267-0.853s0.373-0.427 0.533-0.427c0.32-0.053 0.747 0.693 0.693 1.28 0 0 0 0 0 0z"></path>
<path fill="#444" d="M4.933 14.773v0 0z"></path>
<path fill="#444" d="M4.933 13.92v0 0z"></path>
<path fill="#444" d="M4.933 10.88v0.053z"></path>
<path fill="#444" d="M3.067 10.080c0 0.64 0.48 1.173 1.067 1.173 0.32 0 0.587-0.16 0.747-0.32 0.213-0.213 0.32-0.48 0.32-0.8 0 0 0 0 0 0v0c0-0.373-0.107-0.693-0.32-1.013-0.16-0.427-0.427-0.587-0.747-0.587-0.267 0-0.533 0.213-0.8 0.587v0c-0.107 0.267-0.213 0.587-0.267 0.96zM3.6 9.227c0.16-0.267 0.373-0.427 0.533-0.427 0.213 0 0.373 0.16 0.533 0.427v0c0.16 0.267 0.267 0.533 0.267 0.853v0c0 0 0 0 0 0 0 0.213-0.107 0.48-0.213 0.64v0c-0.16 0.16-0.32 0.267-0.533 0.267-0.427 0-0.8-0.373-0.8-0.907v0c0-0.32 0.107-0.587 0.213-0.853z"></path>
<path fill="#444" d="M4.187 11.253v0 0z"></path>
<path fill="#444" d="M3.067 6.293c0 0.32 0.107 0.587 0.32 0.8v0c0.213 0.213 0.48 0.373 0.8 0.373v0 0c0.32 0 0.587-0.16 0.747-0.373 0.213-0.213 0.32-0.48 0.32-0.8 0 0 0 0 0 0v0c0-0.373-0.107-0.693-0.32-1.013-0.213-0.373-0.48-0.587-0.8-0.587-0.267 0-0.533 0.213-0.8 0.587v0c-0.107 0.267-0.213 0.64-0.267 1.013v0c0 0 0 0 0 0zM3.333 6.293v0c0-0.32 0.107-0.64 0.267-0.853 0.16-0.267 0.373-0.427 0.533-0.427v0c0.213 0 0.373 0.16 0.533 0.427v0c0.16 0.267 0.213 0.533 0.267 0.853v0c0 0 0 0 0 0 0 0.213-0.107 0.48-0.213 0.64v0c-0.16 0.16-0.32 0.267-0.533 0.267v0c-0.213 0-0.427-0.107-0.533-0.267-0.213-0.16-0.32-0.427-0.32-0.64 0 0 0 0 0 0z"></path>
<path fill="#444" d="M4.933 7.093v0 0z"></path>
<path fill="#444" d="M6.96 13.973c0 0.32 0.107 0.587 0.32 0.8v0c0.213 0.213 0.48 0.32 0.747 0.32 0.587 0 1.067-0.533 1.067-1.173v0c0-0.427-0.16-0.8-0.373-1.12-0.213-0.267-0.427-0.427-0.693-0.427s-0.587 0.213-0.8 0.587v0c-0.16 0.267-0.267 0.587-0.267 1.013v0c0-0.053 0 0 0 0zM7.227 13.92v0c0-0.32 0.107-0.64 0.267-0.853 0.16-0.267 0.373-0.427 0.533-0.427v0c0.16 0 0.32 0.107 0.48 0.32v0c0.213 0.267 0.32 0.587 0.32 0.96 0 0.48-0.373 0.907-0.8 0.907v0c-0.213 0-0.427-0.107-0.533-0.267-0.16-0.16-0.267-0.373-0.267-0.64 0 0.053 0 0 0 0z"></path>
<path fill="#444" d="M8.027 15.093v0 0z"></path>
<path fill="#444" d="M8.027 11.253v0 0z"></path>
<path fill="#444" d="M7.28 10.88c0.213 0.213 0.48 0.32 0.747 0.32 0.587 0 1.067-0.533 1.067-1.173v0c0-0.427-0.16-0.8-0.373-1.12-0.213-0.267-0.427-0.427-0.693-0.427s-0.587 0.213-0.8 0.587v0c-0.16 0.32-0.267 0.64-0.32 1.013v0c0 0 0 0 0 0 0.053 0.32 0.16 0.587 0.373 0.8v0zM7.227 10.080v0c0-0.32 0.107-0.64 0.267-0.853 0.16-0.267 0.373-0.427 0.533-0.427v0c0.16 0 0.32 0.107 0.48 0.32v0c0.213 0.267 0.32 0.587 0.32 0.96 0 0.48-0.373 0.907-0.8 0.907v0c-0.213 0-0.427-0.107-0.533-0.267-0.16-0.16-0.267-0.373-0.267-0.64 0 0 0 0 0 0z"></path>
<path fill="#444" d="M6.96 6.293c0 0.32 0.107 0.587 0.32 0.8v0c0.213 0.213 0.48 0.32 0.747 0.32v0c0.587 0 1.067-0.533 1.067-1.173v0c0-0.427-0.16-0.8-0.373-1.12-0.213-0.267-0.427-0.427-0.693-0.427s-0.587 0.213-0.8 0.587v0c-0.16 0.267-0.267 0.64-0.267 1.013v0c0 0 0 0 0 0zM7.227 6.293v0c0-0.32 0.107-0.64 0.267-0.853 0.16-0.267 0.373-0.427 0.533-0.427v0c0.16 0 0.32 0.107 0.48 0.32v0c0.213 0.267 0.32 0.587 0.32 0.96 0 0.48-0.373 0.907-0.8 0.907v0c-0.213 0-0.427-0.107-0.533-0.267-0.16-0.16-0.267-0.427-0.267-0.64 0 0 0 0 0 0z"></path>
<path fill="#444" d="M12.667 14.773v0 0z"></path>
<path fill="#444" d="M12.987 13.92v0c0-0.373-0.107-0.693-0.32-1.013-0.213-0.373-0.48-0.587-0.8-0.587-0.267 0-0.587 0.213-0.8 0.587v0c-0.16 0.32-0.267 0.64-0.32 1.013v0c0 0 0 0 0 0 0 0.32 0.107 0.587 0.32 0.8v0c0.213 0.213 0.48 0.32 0.747 0.32v0 0c0.32 0 0.587-0.16 0.747-0.32 0.267-0.16 0.427-0.48 0.427-0.8 0 0 0 0 0 0zM12.453 14.56v0c-0.16 0.16-0.32 0.267-0.533 0.267v0c-0.213 0-0.427-0.107-0.533-0.267-0.16-0.16-0.267-0.373-0.267-0.64 0 0 0 0 0 0v0c0-0.32 0.107-0.587 0.267-0.853s0.373-0.427 0.533-0.427v0c0.16 0 0.373 0.16 0.533 0.427v0c0.16 0.267 0.267 0.533 0.267 0.853v0c0 0 0 0 0 0-0.053 0.267-0.107 0.48-0.267 0.64z"></path>
<path fill="#444" d="M12.987 10.080c0-0.373-0.107-0.693-0.32-1.013-0.213-0.373-0.48-0.587-0.8-0.587-0.267 0-0.587 0.213-0.8 0.587v0c-0.16 0.32-0.267 0.64-0.32 1.013 0 0.64 0.48 1.173 1.067 1.173v0c0.693 0 1.173-0.533 1.173-1.173v0zM11.867 10.987c-0.427 0-0.8-0.373-0.8-0.907v0c0-0.32 0.107-0.587 0.267-0.853s0.373-0.427 0.533-0.427v0c0.16 0 0.373 0.16 0.533 0.427v0c0.16 0.267 0.267 0.533 0.267 0.853 0 0.48-0.32 0.907-0.8 0.907z"></path>
<path fill="#444" d="M12.987 6.24c0-0.373-0.107-0.693-0.32-1.013-0.213-0.373-0.48-0.587-0.8-0.587-0.267 0-0.587 0.213-0.8 0.587v0c-0.16 0.32-0.267 0.64-0.32 1.013 0 0.64 0.48 1.173 1.067 1.173v0c0.693 0 1.173-0.48 1.173-1.173v0zM11.867 7.147c-0.427 0-0.8-0.373-0.8-0.907v0c0-0.32 0.107-0.587 0.267-0.853s0.373-0.427 0.533-0.427c0.16 0 0.373 0.16 0.533 0.427v0c0.16 0.267 0.267 0.533 0.267 0.853 0 0.533-0.32 0.907-0.8 0.907z"></path>
<path fill="#444" d="M4.933 2.507v0 0z"></path>
<path fill="#444" d="M3.387 3.36c0.213 0.213 0.48 0.32 0.747 0.32v0 0c0.32 0 0.587-0.16 0.747-0.32 0.213-0.213 0.32-0.48 0.32-0.8 0 0 0 0 0 0 0-0.64-0.48-1.547-1.067-1.547-0.267 0-0.533 0.213-0.8 0.587v0c-0.107 0.213-0.267 0.533-0.267 0.907v0c0 0 0 0 0 0 0 0.32 0.107 0.64 0.32 0.853v0zM3.333 2.507v0c0-0.32 0.107-0.64 0.267-0.853 0.16-0.267 0.373-0.427 0.533-0.427v0c0.427 0 0.8 0.747 0.8 1.28 0 0 0 0 0 0 0 0.213-0.107 0.48-0.213 0.64v0c-0.16 0.16-0.32 0.267-0.533 0.267v0c-0.213 0-0.427-0.107-0.533-0.267-0.213-0.16-0.32-0.373-0.32-0.64 0 0 0 0 0 0z"></path>
<path fill="#444" d="M4.933 3.36v0 0z"></path>
<path fill="#444" d="M9.093 2.507c0-0.427-0.16-0.8-0.373-1.12s-0.427-0.427-0.693-0.427c-0.267 0-0.587 0.213-0.8 0.587v0c-0.16 0.32-0.267 0.64-0.32 1.013v0c0 0 0 0 0 0 0 0.32 0.107 0.587 0.32 0.8v0c0.213 0.213 0.48 0.32 0.747 0.32v0c0.64 0 1.12-0.533 1.12-1.173v0zM8.027 3.413v0c-0.213 0-0.427-0.107-0.533-0.267-0.16-0.16-0.267-0.373-0.267-0.64 0 0 0 0 0 0v0c0-0.32 0.107-0.587 0.267-0.853s0.373-0.427 0.533-0.427v0c0.16 0 0.32 0.107 0.48 0.32v0c0.213 0.267 0.32 0.587 0.32 0.96 0 0.48-0.373 0.907-0.8 0.907z"></path>
<path fill="#444" d="M12.667 3.307v0 0z"></path>
<path fill="#444" d="M10.8 2.507c0 0.32 0.107 0.587 0.32 0.8v0c0.213 0.213 0.48 0.32 0.747 0.32v0 0c0.32 0 0.587-0.16 0.747-0.32 0.213-0.213 0.32-0.48 0.32-0.8 0 0 0 0 0 0 0-0.64-0.48-1.547-1.067-1.547s-1.067 0.907-1.067 1.547v0c0 0 0 0 0 0zM11.067 2.507c0-0.533 0.427-1.28 0.8-1.28s0.8 0.747 0.8 1.28v0c0 0 0 0 0 0 0 0.267-0.107 0.48-0.267 0.64v0c-0.16 0.16-0.32 0.267-0.587 0.267-0.213 0-0.427-0.107-0.587-0.267-0.053-0.16-0.16-0.373-0.16-0.64 0 0 0 0 0 0z"></path>
</svg>
