<!-- Generated by IcoMoon.io -->
<svg version="1.1" xmlns="http://www.w3.org/2000/svg" width="16" height="16" viewBox="0 0 16 16">
<title>pot1</title>
<path fill="#444" d="M13.79 5.28c-0.213-0.32-0.48-0.587-0.747-0.853-0.213-0.213-0.32-0.48-0.373-0.747 0-0.107 0-0.107 0.107-0.16 0.373-0.053 0.587-0.267 0.587-0.64 0-0.693 0-1.28 0-1.813s-0.32-0.853-0.853-0.96c-0.747-0.107-1.547-0.107-2.24-0.107h-0.16c-1.28 0-2.667 0-4.373 0-0.853 0-1.493 0.053-2.133 0.107s-1.013 0.373-1.067 0.96c-0.053 0.64-0.053 1.227 0 1.867v0.053c0 0.32 0.213 0.533 0.587 0.587 0.053 0 0.107 0 0.107 0v0c0 0 0 0 0 0s0 0 0 0c0 0.267-0.107 0.533-0.267 0.747s-0.32 0.427-0.533 0.64c-0.587 0.64-0.853 1.387-0.8 2.187 0 1.547 0 3.093 0 4.64 0 0.587 0 1.12 0 1.707 0 0.213 0 0.427 0 0.693 0 0.107 0 0.16 0 0.267 0.053 0.587 0.32 1.067 0.96 1.333 0.373 0.16 0.747 0.213 1.28 0.213 0.907 0 1.867 0 2.773 0 0.427 0 0.853 0 1.333 0s0.853 0 1.28 0c0.907 0 1.867 0 2.827 0 0 0 0.053 0 0.107 0 0.533 0 0.96-0.107 1.333-0.32 0.427-0.267 0.693-0.587 0.747-1.013 0.053-0.373 0.107-0.747 0.107-1.067 0-0.64 0-1.227 0-1.867 0-1.547 0-3.093 0-4.693 0-0.64-0.213-1.227-0.587-1.76v0zM12.67 1.067c0 0.427 0 0.8 0 1.227v0.587c0 0.053 0 0.053-0.053 0.053-0.16 0.053-0.32 0.053-0.48 0.053v-2.133c0.107 0 0.16 0 0.267 0.053 0.16-0.053 0.267 0 0.267 0.16v0zM11.923 0.747v2.187h-0.587v-2.187c0.16 0 0.32 0 0.48 0 0.053 0 0.053 0 0.107 0v0zM10.537 2.933v-2.24c0.213 0 0.427 0 0.587 0v2.187l-0.587 0.053zM10.27 0.693v2.24h-0.587v-2.24c0.213 0 0.427 0 0.587 0zM9.47 0.693v2.24h-0.587v-2.24c0 0 0 0 0 0 0.16 0 0.373 0 0.587 0zM8.617 0.693v2.24h-0.587v-2.24c0.213 0 0.373 0 0.587 0zM7.817 0.693v2.24h-0.587v-2.24c0.107 0 0.213 0 0.32 0 0.053 0 0.16 0 0.267 0v0zM6.377 0.693c0.213 0 0.427 0 0.587 0v2.24h-0.587c0 0 0-2.24 0-2.24zM6.163 0.693v2.24h-0.587v-2.24c0.16 0 0.373 0 0.587 0zM5.31 0.693v2.187h-0.587v-2.133h0.107c0.16-0.053 0.32-0.053 0.48-0.053v0zM3.923 0.747c0.213 0 0.373 0 0.587-0.053v2.187h-0.587c0 0 0-2.133 0-2.133zM3.283 2.827c0-0.16 0-0.373 0-0.587 0-0.373 0-0.747 0-1.12 0-0.267 0.053-0.32 0.267-0.32 0.053 0 0.107 0 0.107 0v2.133c-0.107 0-0.267 0-0.373-0.053 0 0 0 0 0-0.053v0zM13.523 14.613c-0.053 0.213-0.213 0.32-0.373 0.427-0.267 0.16-0.587 0.267-1.013 0.267-0.96 0-1.973 0-2.933 0-0.267 0-0.533 0-0.747 0-0.64 0-1.227 0-1.867 0-0.48 0-0.907 0-1.387 0-0.427 0-0.907 0-1.333-0.053-0.427 0-0.747-0.053-1.013-0.213-0.32-0.16-0.427-0.373-0.48-0.64 0-0.107 0-0.16 0-0.267 0-0.16-0.053-0.373-0.053-0.587 0-0.587 0-1.173 0-1.76 0-1.547 0-3.147 0-4.693 0-0.587 0.16-1.067 0.533-1.547 0.213-0.267 0.427-0.48 0.587-0.64 0.32-0.32 0.48-0.747 0.533-1.173 0-0.107 0-0.107 0.107-0.107 2.56 0 5.173 0 7.733 0 0.107 0 0.107 0 0.107 0.107 0.053 0.48 0.213 0.853 0.587 1.227 0.267 0.267 0.587 0.587 0.8 0.96 0.267 0.427 0.32 1.067 0.32 1.067 0 2.56-0.053 7.413-0.107 7.627v0z"></path>
</svg>
