<!-- Generated by IcoMoon.io -->
<svg version="1.1" xmlns="http://www.w3.org/2000/svg" width="16" height="16" viewBox="0 0 16 16">
<title>management</title>
<path fill="#444" d="M11.266 0h-4.398c-0.088 0-0.16 0.072-0.16 0.16v1.237c0 0.088 0.072 0.16 0.16 0.16v0h0.458v7.304c-0.002 0.029-0.003 0.062-0.003 0.096 0 0.963 0.781 1.743 1.743 1.743s1.743-0.781 1.743-1.743c0-0.034-0.001-0.068-0.003-0.101l0 0.005v-7.299h0.459c0 0 0 0 0 0 0.089 0 0.162-0.071 0.165-0.16v-1.242c-0.003-0.089-0.076-0.16-0.165-0.16-0 0-0 0-0 0v0zM10.488 8.861c0 0.783-0.635 1.418-1.418 1.418s-1.418-0.635-1.418-1.418v0 0-7.299h2.836zM11.106 1.237h-4.078v-0.912h4.078z"></path>
<path fill="#444" d="M10.077 6.739c-0.017 0.102-0.105 0.18-0.211 0.18s-0.194-0.077-0.21-0.178l-0-0.001c-0.002-0.010-0.003-0.022-0.003-0.034 0-0.118 0.095-0.213 0.213-0.213s0.213 0.095 0.213 0.213c0 0.012-0.001 0.024-0.003 0.035l0-0.001z"></path>
<path fill="#444" d="M9.954 8.791c0 0.147-0.119 0.267-0.267 0.267s-0.267-0.119-0.267-0.267v0c0-0.147 0.119-0.267 0.267-0.267s0.267 0.119 0.267 0.267v0z"></path>
<path fill="#444" d="M8.584 2.826v0c0.085 0 0.155-0.069 0.155-0.155s-0.069-0.155-0.155-0.155v0c-0.002-0-0.003-0-0.005-0-0.082 0-0.149 0.067-0.149 0.149 0 0 0 0 0 0v0c-0 0.002-0 0.003-0 0.005 0 0.081 0.064 0.146 0.144 0.149h0z"></path>
<path fill="#444" d="M8.35 5.753v0c0.091-0.016 0.16-0.095 0.16-0.189s-0.069-0.173-0.159-0.189l-0.001-0c-0 0-0 0-0 0-0.104 0-0.189 0.083-0.192 0.186v0c0 0 0 0 0 0 0 0.104 0.083 0.189 0.186 0.192h0z"></path>
<path fill="#444" d="M8.76 9.437c0 0.109-0.088 0.197-0.197 0.197v0c-0.010 0.002-0.021 0.003-0.033 0.003-0.112 0-0.203-0.091-0.203-0.203s0.091-0.203 0.203-0.203c0.012 0 0.023 0.001 0.034 0.003l-0.001-0c0 0 0 0 0 0 0.109 0 0.197 0.088 0.197 0.197 0 0.002-0 0.004-0 0.006v-0z"></path>
<path fill="#444" d="M9.197 7.603v-1.066h-0.032v-0.416c-0.002-0.030-0.018-0.055-0.042-0.069l-0-0c0-0.059 0-0.133 0-0.208v0 0c-0-0.001-0-0.002-0-0.003 0-0.069 0.018-0.134 0.049-0.191l-0.001 0.002 0.064-0.101c0-0.037 0.048-0.075 0.069-0.117v0c0.034-0.080 0.057-0.172 0.064-0.269l0-0.003v-0.043c-0.001-0.089-0.021-0.173-0.055-0.249l0.002 0.004c-0.023-0.047-0.050-0.087-0.081-0.124l0.001 0.001-0.085-0.096c-0.101-0.117-0.165-0.269-0.171-0.436l-0-0.001v-0.053c-0.004-0.032-0.006-0.069-0.006-0.107s0.002-0.075 0.006-0.111l-0 0.004c0.007-0.047 0.016-0.088 0.028-0.128l-0.002 0.006c0.016-0.038 0.032-0.069 0.050-0.099l-0.002 0.003c0.064-0.155 0.16-0.304 0.213-0.469 0.043-0.127 0.069-0.274 0.069-0.426v-0.107c-0.016-0.197-0.050-0.378-0.101-0.552l0.005 0.019c0.035 0.158 0.058 0.341 0.064 0.529l0 0.004v0.032c0 0.002 0 0.004 0 0.007 0 0.169-0.033 0.329-0.094 0.476l0.003-0.008c-0.064 0.16-0.16 0.299-0.235 0.458 0 0.043-0.037 0.085-0.053 0.123s0 0.080-0.037 0.123v0c-0.023 0.080-0.036 0.171-0.037 0.266v0.001c-0 0.002-0 0.005-0 0.008 0 0.093 0.018 0.182 0.050 0.263l-0.002-0.005c0.028 0.091 0.068 0.171 0.119 0.242l-0.002-0.003 0.069 0.085c0.023 0.027 0.041 0.059 0.053 0.094l0.001 0.002c0.017 0.049 0.027 0.106 0.027 0.165v0c0.001 0.009 0.002 0.019 0.002 0.029s-0.001 0.021-0.002 0.030l0-0.001c-0.004 0.083-0.027 0.159-0.065 0.226l0.001-0.002c-0.019 0.037-0.039 0.068-0.060 0.098l0.002-0.002c0 0.037-0.053 0.075-0.075 0.112-0.027 0.040-0.047 0.086-0.058 0.136l-0.001 0.003c-0.003 0.022-0.004 0.048-0.004 0.075s0.002 0.052 0.004 0.078l-0-0.003v0.069c0 0.053 0 0.107 0 0.16v0c-0.017 0.014-0.029 0.035-0.032 0.058l-0 0v0.416h-0.027v1.066c0.057 0.21 0.121 0.387 0.196 0.558l-0.010-0.025v-0.032c0.053-0.121 0.107-0.273 0.153-0.429l0.007-0.029v-0.032z"></path>
<path fill="#444" d="M13.926 12.044c-0.144-0.25-0.41-0.416-0.714-0.416-0 0-0 0-0 0h0c-0.029-0.003-0.062-0.004-0.096-0.004s-0.067 0.002-0.1 0.004l0.004-0-2.335 0.704c-0.162-0.18-0.396-0.293-0.656-0.293-0.002 0-0.004 0-0.006 0h-1.514c-1.074-0.778-2.412-1.253-3.86-1.274l-0.005-0v-0.533c0-0.112-0.091-0.203-0.203-0.203v0h-2.287c-0.112 0-0.203 0.091-0.203 0.203v0 5.23c0 0.112 0.091 0.203 0.203 0.203v0h2.287c0.111-0.003 0.2-0.092 0.203-0.202v-0.693l4.121 1.226h0.059c0.015 0.004 0.033 0.006 0.051 0.006s0.035-0.002 0.052-0.006l-0.002 0 4.628-2.666c0.239-0.121 0.416-0.334 0.489-0.59l0.002-0.007c0.003-0.028 0.004-0.060 0.004-0.093s-0.002-0.065-0.005-0.097l0 0.004c-0.001-0.18-0.053-0.347-0.141-0.489l0.002 0.004zM4.239 15.242h-1.861v-4.798h1.861zM13.649 12.625c-0.046 0.148-0.15 0.266-0.285 0.329l-0.003 0.001-4.553 2.618-4.158-1.226v-3.151c1.378 0.025 2.644 0.481 3.675 1.239l-0.018-0.012c0.032 0.030 0.075 0.048 0.123 0.048 0.002 0 0.004-0 0.005-0h1.599c0.248 0.027 0.439 0.235 0.439 0.488s-0.191 0.461-0.437 0.488l-0.002 0h-2.602c-0.112 0-0.203 0.091-0.203 0.203s0.091 0.203 0.203 0.203v0h2.575c0 0 0 0 0 0 0.493 0 0.893-0.398 0.896-0.89v-0c-0.002-0.084-0.015-0.165-0.039-0.241l0.002 0.006 2.239-0.656h0.107c0 0 0.001 0 0.001 0 0.148 0 0.277 0.078 0.35 0.196l0.001 0.002c0.047 0.078 0.075 0.172 0.075 0.272v0c0.001 0.015 0.002 0.033 0.002 0.051s-0.001 0.036-0.002 0.053l0-0.002z"></path>
</svg>
