<!-- Generated by IcoMoon.io -->
<svg version="1.1" xmlns="http://www.w3.org/2000/svg" width="16" height="16" viewBox="0 0 16 16">
<title>checkbox-full</title>
<path fill="#444" d="M14.613 8.107c-0.053 3.627-2.987 6.56-6.613 6.56-3.68-0.053-6.613-2.987-6.613-6.667s2.933-6.613 6.613-6.613c0.96 0 1.867 0.213 2.667 0.587h-0.053l1.067-1.067c-1.067-0.587-2.347-0.907-3.68-0.907-4.427 0-8 3.573-8 8s3.573 8 8 8 8-3.573 8-8c0 0 0 0 0 0v0c0-0.427-0.053-0.853-0.107-1.28v0.053l-1.28 1.333z"></path>
<path fill="#444" d="M7.147 11.733l-3.413-3.413 1.173-1.173 2.24 2.24 6.827-6.827 1.013 1.333-7.84 7.84z"></path>
</svg>
