<!-- Generated by IcoMoon.io -->
<svg version="1.1" xmlns="http://www.w3.org/2000/svg" width="16" height="16" viewBox="0 0 16 16">
<title>sites</title>
<path fill="#444" d="M7.76 0.16l-6.827 6.347v9.493h4.64v-6.293h5.013v6.293h4.48v-9.6l-6.453-6.24c-0.267-0.213-0.587-0.213-0.853 0zM9.947 7.467h-3.787v-3.040h3.787v3.040z"></path>
</svg>
