<!-- Generated by IcoMoon.io -->
<svg version="1.1" xmlns="http://www.w3.org/2000/svg" width="16" height="16" viewBox="0 0 16 16">
<title>satellite</title>
<path fill="#444" d="M11.5 6.825c-0.25 0-0.5-0.2-0.5-0.5 0-1.5-1.25-2.75-2.75-2.75-0.25 0-0.5-0.2-0.5-0.5s0.2-0.5 0.5-0.5c2.1 0 3.8 1.7 3.8 3.8-0.1 0.25-0.3 0.45-0.55 0.45v0zM13.5 6.825c-0.25 0-0.5-0.2-0.5-0.5 0-2.6-2.15-4.8-4.7-4.8-0.25 0-0.5-0.2-0.5-0.5s0.2-0.5 0.5-0.5c3.1-0.050 5.7 2.5 5.7 5.7-0.050 0.4-0.25 0.6-0.5 0.6v0zM10.35 6.875c-0.2 0.35-0.45 0.6-0.85 0.8 0.7 1.2 1 2.25 0.45 2.75-0.7 0.7-2.55 0-4.2-1.65s-2.35-3.45-1.65-4.2c0.5-0.5 1.55-0.25 2.75 0.45 0.2-0.35 0.45-0.65 0.8-0.85-1.65-1.1-3.3-1.4-4.15-0.6-2 2-2 5.35 0 7.4s5.35 2.050 7.4 0c0.85-0.75 0.55-2.45-0.55-4.1v0zM9.95 5.925c0-0.7-0.6-1.3-1.3-1.3-0.5 0-1.050 0.35-1.25 0.85l-1.95 0.4c-0.25 0.050-0.45 0.35-0.4 0.6s0.35 0.45 0.6 0.4l1.75-0.35c0.15 0.25 0.35 0.5 0.65 0.65l-0.35 1.7c-0.050 0.25 0.15 0.5 0.4 0.6h0.050c0.25 0 0.45-0.15 0.45-0.4l0.4-1.85c0.6-0.25 0.95-0.7 0.95-1.3v0zM8.7 13.325c-0.45 0.15-0.9 0.2-1.45 0.2-1.050 0-2.050-0.25-2.9-0.7-0.85 0.55-1.35 1.55-1.35 2.65h6.55c0-0.85-0.35-1.55-0.85-2.15v0z"></path>
</svg>
