<!-- Generated by IcoMoon.io -->
<svg version="1.1" xmlns="http://www.w3.org/2000/svg" width="16" height="16" viewBox="0 0 16 16">
<title>4</title>
<path fill="#444" d="M13.865 0v0h-11.731c-1.175 0-2.135 0.96-2.135 2.135v11.731c0 1.175 0.96 2.135 2.135 2.135h11.731c1.175 0 2.135-0.96 2.135-2.135v-11.731c0-1.175-0.96-2.135-2.135-2.135zM13.873 14.928h-11.738c-0.587 0-1.062-0.485-1.062-1.062v-11.731c0-0.587 0.485-1.062 1.062-1.062h11.731c0.587 0 1.062 0.485 1.062 1.062v11.731h0.008c0.002 0.587-0.482 1.062-1.062 1.062z"></path>
<path fill="#444" d="M9.621 8.651c-0.095-0.043-0.22-0.065-0.377-0.065h-0.13v-2.362c0-0.355-0.155-0.53-0.465-0.53-0.095 0-0.177 0.032-0.245 0.095-0.067 0.065-0.155 0.167-0.26 0.31l-1.617 2.162c-0.045 0.060-0.082 0.11-0.112 0.15s-0.060 0.082-0.087 0.127c-0.027 0.045-0.050 0.085-0.065 0.125s-0.022 0.080-0.022 0.117c0 0.15 0.048 0.27 0.145 0.357s0.242 0.13 0.435 0.13h1.532v0.567c0 0.152 0.035 0.267 0.105 0.347 0.070 0.077 0.162 0.117 0.275 0.117 0.115 0 0.207-0.037 0.277-0.115s0.105-0.192 0.105-0.35v-0.567h0.185c0.155 0 0.27-0.027 0.347-0.080 0.077-0.055 0.115-0.14 0.115-0.257 0.002-0.142-0.045-0.237-0.14-0.28zM8.349 8.589h-1.312l1.312-1.772v1.772z"></path>
</svg>
