<!-- Generated by IcoMoon.io -->
<svg version="1.1" xmlns="http://www.w3.org/2000/svg" width="16" height="16" viewBox="0 0 16 16">
<title>wifi-off</title>
<path fill="#444" d="M10.854 7.973c0.526 0.257 0.999 0.571 1.376 0.898 0.279 0.241 0.699 0.211 0.941-0.068s0.211-0.699-0.068-0.941c-0.469-0.406-1.039-0.783-1.664-1.089-0.331-0.161-0.73-0.024-0.891 0.307s-0.024 0.73 0.307 0.891zM7.193 4.031c2.68-0.216 5.197 0.645 7.131 2.225 0.097 0.080 0.193 0.161 0.288 0.245 0.276 0.243 0.697 0.217 0.941-0.059s0.217-0.697-0.059-0.941c-0.107-0.094-0.216-0.187-0.326-0.277-2.189-1.789-5.044-2.766-8.081-2.521-0.367 0.029-0.64 0.35-0.611 0.717s0.351 0.641 0.718 0.611zM6.073 11.283c0.66-0.469 1.431-0.663 2.183-0.604 0.594 0.047 1.177 0.252 1.682 0.606 0.155 0.109 0.341 0.142 0.513 0.108l4.411 4.411c0.261 0.261 0.683 0.261 0.943 0s0.261-0.683 0-0.943l-8.5-8.5c-0.033-0.042-0.071-0.080-0.113-0.113l-6.054-6.054c-0.261-0.261-0.683-0.261-0.943 0s-0.261 0.683 0 0.943l2.725 2.725c-0.838 0.419-1.66 0.969-2.415 1.637-0.276 0.244-0.302 0.665-0.058 0.941s0.665 0.302 0.941 0.058c0.794-0.702 1.666-1.251 2.535-1.634l1.549 1.549c-0.905 0.305-1.781 0.785-2.566 1.441-0.283 0.236-0.32 0.657-0.084 0.939s0.657 0.32 0.939 0.084c0.847-0.708 1.816-1.167 2.792-1.383l1.859 1.859c-0.017-0.001-0.035-0.003-0.052-0.005-1.053-0.083-2.136 0.19-3.060 0.846-0.3 0.213-0.371 0.629-0.157 0.929s0.629 0.371 0.929 0.157zM8 14c0.368 0 0.667-0.299 0.667-0.667s-0.299-0.667-0.667-0.667-0.667 0.299-0.667 0.667 0.299 0.667 0.667 0.667z"></path>
</svg>
