<!-- Generated by IcoMoon.io -->
<svg version="1.1" xmlns="http://www.w3.org/2000/svg" width="16" height="16" viewBox="0 0 16 16">
<title>tortoise</title>
<path fill="#444" d="M13.7 6.2c-0.15 0.050-0.3 0.1-0.45 0.2-0.15 0.050-0.25 0.15-0.35 0.25-0.15 0.1-0.25 0.2-0.4 0.25-0.050 0.050-0.1 0-0.1-0.050s-0.050-0.1-0.050-0.15c-0.050-0.050-0.1-0.1-0.15-0.1-0.2-0.1-0.3-0.1-0.35-0.2-0.050-0.050-0.050-0.1-0.1-0.15 0 0 0-0.050 0-0.050-0.25-0.2-0.25-0.5-0.4-0.7-0.15-0.3-0.3-0.55-0.5-0.85-0.15-0.25-0.35-0.45-0.55-0.65-0.1-0.1-0.2-0.15-0.35-0.2-0.1-0.050-0.25-0.1-0.35-0.15 0 0-0.050 0-0.050 0-0.15-0.15-0.35-0.2-0.5-0.35-0.2-0.15-0.4-0.25-0.6-0.35-0.3-0.15-0.6-0.3-0.9-0.35-0.1 0-0.2-0.050-0.25-0.1-0.1-0.050-0.2 0-0.25-0.050-0.1-0.050-0.8-0.1-0.9-0.050s-0.2 0.050-0.3 0c-0.1-0.050-0.2 0.050-0.3-0.050-0.1 0-0.15 0-0.25 0-0.15 0.050-0.3 0.050-0.45 0.15 0 0-0.050 0-0.050 0-0.1 0.1-0.25 0.15-0.35 0.25-0.3 0.2-0.55 0.4-0.8 0.6-0.2 0.15-0.35 0.3-0.55 0.45-0.050 0.1-0.15 0.15-0.25 0.2-0.15 0.2-0.25 0.4-0.4 0.6-0.1 0.1-0.2 0.25-0.25 0.4s-0.15 0.3-0.2 0.45c-0.050 0.2-0.050 0.4-0.15 0.6 0 0.050 0 0.1 0 0.15s0 0.1-0.050 0.15-0.050 0.2-0.1 0.25c-0.050 0.25-0.15 0.5-0.2 0.75 0 0.050 0.1 0.050 0 0.050-0.15 0.050-0.8-0.45-0.95-0.35-0.35 0.3 0.6 0.95 0.65 1 0 0.1-0.050 0.2 0.050 0.25 0 0.15 0.050 0.25 0.050 0.4 0 0.1 0.1 0.15 0.050 0.2 0 0.050-0.050 0.15-0.050 0.2 0 0.1-0.050 0.2-0.1 0.35-0.050 0.2-0.2 0.4-0.2 0.65 0 0.15 0 0.25 0 0.35s-0.050 0.15-0.050 0.25c0 0.050-0.050 0.1-0.050 0.1 0.050 0.050 0 0.050 0 0.1 0 0.1 0.050 0.25 0.15 0.3 0.050 0.050 0.1 0.1 0.15 0.15s0.1 0.050 0.1 0.050c0.050-0.050 0.15 0 0.2-0.050 0.1-0.050 0.1 0 0.2 0 0.050 0 0.1 0.1 0.15-0.050 0 0 0.1 0 0.1-0.050 0.1-0.050 0.2-0.050 0.25 0s0.1 0.050 0.1 0c0.1-0.1 0.2-0.1 0.3-0.050 0.050 0 0.050 0.050 0.1 0 0.050 0 0.1-0.050 0.1-0.050 0-0.1 0.050-0.25 0.050-0.35s-0.050-0.2-0.1-0.3c-0.050-0.1-0.15-0.2-0.15-0.35-0.050-0.15 0-0.2 0.050-0.35 0 0 0-0.050 0.050 0s0.050 0.050 0.1 0.050c0.1 0.1 0.2 0.2 0.35 0.3s0.25 0.2 0.4 0.3c0.2 0.15 0.4 0.25 0.65 0.3 0.15 0.050 0.3 0.1 0.5 0.1 0.050 0 0.15 0.050 0.2 0.050s0.15 0 0.2 0.050c0 0 0.050 0 0.050 0 0.25-0.050 0.55 0.050 0.8 0.050s0.55 0 0.8 0c0.15 0 0.3-0.050 0.45-0.050 0.1 0 0.1 0.050 0.1 0.1-0.050 0.2 0 0.4-0.050 0.6 0 0.1 0 0.25-0.050 0.35 0 0.050-0.050 0.15-0.050 0.2s0.050 0.15-0.050 0.2c0 0.25-0.050 0.5 0.15 0.7 0.050 0.050 0.1 0.1 0.15 0.15 0.25 0.15 0.55 0.25 0.8 0.35 0.1 0.050 0.2 0.050 0.3 0.050 0.050 0 0.1 0 0.050-0.050 0-0.050 0-0.050 0-0.1s0.050-0.050 0.050-0.050 0.1 0 0.15 0.050 0.2 0.050 0.3 0.050c0.1 0 0.1 0 0.050-0.1 0-0.050 0-0.050 0.050-0.050 0.050 0.050 0.1 0.050 0.15 0 0.050 0 0.1 0.050 0.15 0.050s0.1 0 0.1-0.1c0-0.050-0.050-0.1 0-0.15 0 0 0-0.050 0-0.050-0.050-0.15-0.2-0.2-0.3-0.3s-0.25-0.2-0.4-0.25c-0.15-0.050-0.1-0.15-0.1-0.3 0.050-0.15 0.15-0.3 0.15-0.45 0-0.1 0.050-0.15 0.1-0.25s0.050-0.2 0.050-0.25c0.050-0.15 0.1-0.25 0.1-0.4 0 0 0.050-0.050 0.050-0.050 0-0.1 0-0.1 0.1-0.15 0.25-0.050 0.45-0.15 0.7-0.2 0.1-0.050 0.2-0.050 0.3-0.050 0.25-0.050 0.45-0.1 0.65-0.3 0.050-0.050 0.1-0.1 0.2-0.1 0.050 0 0.1 0 0.1 0s0.050 0 0.050 0.050c0 0.1 0 0.25 0.050 0.35 0.050 0.3 0 0.6 0.050 0.9 0 0.15 0.050 0.25 0.15 0.35s0.2 0.25 0.35 0.3c0.1 0.050 0.25 0.1 0.35 0.2 0.1 0.050 0.2 0.050 0.3 0.050 0 0 0.050 0 0.050 0 0.050 0 0-0.15 0.1-0.1 0.050 0 0.1 0 0.1 0.050 0.1 0.050 0.25 0.050 0.35 0.050s0.050-0.050 0-0.050c0-0.050 0-0.050 0.050-0.050 0.1 0 0.2 0 0.3 0 0.050 0 0.1 0 0.050-0.050 0-0.050 0.050-0.050 0.050-0.050s0.050 0 0.050-0.050c-0.1-0.15-0.15-0.3-0.25-0.45-0.050-0.1-0.15-0.15-0.25-0.25-0.050-0.050-0.15-0.050-0.15-0.15 0-0.050-0.1-0.15 0-0.2 0-0.25 0.1-0.45 0.15-0.7 0.050-0.2 0-0.4 0-0.65 0-0.1-0.050-0.2-0.1-0.3-0.050-0.15-0.1-0.3-0.25-0.4-0.050-0.050-0.050-0.1 0-0.15 0.1-0.1 0.25-0.2 0.35-0.3 0.050-0.050 0.1-0.050 0.1-0.1 0.1-0.15 0.3-0.2 0.45-0.2 0.050 0 0.1 0.050 0.15 0.050 0.2 0.050 0.35 0.15 0.55 0.2 0.1 0 0.2 0.050 0.3 0s0.2-0.050 0.25-0.1c0 0 0.050-0.050 0.1-0.050 0.1-0.1 0.1-0.15 0-0.25-0.050-0.1-0.15-0.2-0.2-0.3 0-0.050-0.050-0.050-0.050-0.1 0.050 0 0.1 0 0.15 0s0.1 0.050 0.15 0.050 0.2-0.050 0.2-0.1c0-0.050 0-0.1 0.050-0.15s0-0.1 0.050-0.15c0.050-0.050 0-0.1 0.050-0.15 0 0 0-0.1-0.050-0.15s-0.1-0.15-0.1-0.25c0-0.050-0.050-0.15-0.1-0.2-0.1-0.050-0.15-0.15-0.25-0.15-0.15-0.1-0.35-0.15-0.55-0.2-0.050 0-0.15 0-0.2 0-0.2-0.15-0.35-0.050-0.5 0v0z"></path>
</svg>
