<!-- Generated by IcoMoon.io -->
<svg version="1.1" xmlns="http://www.w3.org/2000/svg" width="16" height="16" viewBox="0 0 16 16">
<title>unknown</title>
<path fill="#444" d="M2.656 0.609c2.031-0.374 3.634-0.695 6.092-0.588 3.26 0 4.649 2.138 4.649 4.275v1.603c0 2.939-1.657 4.275-4.917 4.008v1.87h-2.458v-4.222h2.458c1.069-0.053 1.87-0.481 1.87-1.764v-1.176c0-1.229-0.748-1.817-2.405-1.817h-5.344v-2.191h0.053zM5.862 13.595c0-0.321 0.214-0.588 0.481-0.588h1.87c0.374 0 0.481 0.214 0.481 0.588v1.924c0 0.374-0.214 0.481-0.481 0.481h-1.87c-0.321 0-0.481-0.214-0.481-0.481v-1.924z"></path>
</svg>
