<!-- Generated by IcoMoon.io -->
<svg version="1.1" xmlns="http://www.w3.org/2000/svg" width="16" height="16" viewBox="0 0 16 16">
<title>historic</title>
<path fill="#444" d="M6.96 3.573v4.907l4.32 2.56 0.64-1.013-3.68-2.187v-4.267h-1.28z"></path>
<path fill="#444" d="M15.387 5.173l-1.493 0.533c0.267 0.693 0.427 1.493 0.427 2.347 0 3.52-2.827 6.347-6.347 6.347s-6.347-2.827-6.347-6.347c0-3.52 2.827-6.347 6.347-6.347 1.013 0 1.973 0.267 2.827 0.693h-0.053l-1.067 1.227 4.053 0.213-0.747-3.84-1.067 1.173c-1.12-0.64-2.507-1.067-3.947-1.067-4.373 0-7.893 3.573-7.893 7.947s3.52 7.947 7.893 7.947c4.373 0 7.947-3.573 7.947-7.947 0-1.013-0.213-2.027-0.587-2.933l0.053 0.053z"></path>
</svg>
