<!-- Generated by IcoMoon.io -->
<svg version="1.1" xmlns="http://www.w3.org/2000/svg" width="16" height="16" viewBox="0 0 16 16">
<title>categorie</title>
<path fill="#444" d="M15.307 0.107l-0.693 0.693h-6.4c-0.107 0-0.213 0.053-0.267 0.107v0l-1.067 1.067c-1.387 0.32-6.027 1.547-6.027 1.6-0.32 0.053-0.587 0.267-0.693 0.48v0c-0.107 0.16-0.16 0.32-0.16 0.533 0 0.107 0 0.213 0.053 0.32v0l0.8 3.093-0.48 0.48c-0.213 0.16-0.373 0.48-0.373 0.747s0.107 0.533 0.32 0.747v0 0c0 0 5.707 5.707 5.653 5.653 0.213 0.213 0.48 0.373 0.747 0.373 0.32 0 0.587-0.107 0.747-0.32v0l7.52-7.627c0.053-0.053 0.107-0.16 0.107-0.267v-4.48c0 0 0 0 0-0.053 0-0.213-0.16-0.427-0.427-0.427s-0.427 0.16-0.427 0.427c0 0 0 0 0 0.053v0 4.32c-0.107 0.107-7.413 7.467-7.467 7.467-0.053 0.053-0.107 0.053-0.16 0.053 0 0 0 0 0 0v0c0 0 0 0 0 0-0.053 0-0.107-0.053-0.16-0.053v0c0.107 0-5.547-5.707-5.6-5.707-0.053-0.053-0.053-0.107-0.053-0.16v0c0 0 0 0 0 0 0-0.053 0.053-0.107 0.053-0.16v0c0.053-0.053 7.36-7.307 7.467-7.467h5.387l-0.96 0.96c-0.16-0.053-0.32-0.107-0.533-0.107 0 0 0 0 0 0v0c-0.693 0-1.227 0.533-1.227 1.227s0.533 1.227 1.227 1.227 1.227-0.533 1.227-1.227v0c0 0 0 0 0 0 0-0.213-0.053-0.373-0.107-0.533v0l2.453-2.453c0.16-0.053 0.213-0.16 0.213-0.267 0-0.213-0.213-0.427-0.427-0.427-0.107 0-0.213 0.053-0.267 0.107v0 0zM1.493 7.307c-0.267-1.013-0.693-2.667-0.693-2.667s0-0.053 0-0.053 0-0.053 0-0.107v0c0.053-0.053 0.107-0.107 0.16-0.107v0c0.053 0 2.827-0.747 4.747-1.28l-4.213 4.213zM12.693 3.68c0 0.213-0.16 0.427-0.427 0.427s-0.427-0.16-0.427-0.427c0-0.213 0.16-0.427 0.427-0.427v0c0 0 0 0 0 0 0.267 0.053 0.427 0.213 0.427 0.427 0 0 0 0 0 0v0 0z"></path>
</svg>
