<!-- Generated by IcoMoon.io -->
<svg version="1.1" xmlns="http://www.w3.org/2000/svg" width="16" height="16" viewBox="0 0 16 16">
<title>sample_transfer</title>
<path fill="#444" d="M5.91 0.356h-4.538c-0.72 0.006-1.309 0.559-1.37 1.264l-0 0.005c-0 0.012-0.001 0.027-0.001 0.041 0 0.716 0.553 1.302 1.255 1.356l0.005 0v10.368c0.062 1.259 1.097 2.256 2.365 2.256s2.304-0.997 2.365-2.25l0-0.005v-10.442c0.701-0.029 1.259-0.605 1.259-1.311 0-0.010-0-0.019-0-0.029l0 0.001c-0.002-0.694-0.564-1.256-1.259-1.256-0.028 0-0.056 0.001-0.084 0.003l0.004-0zM5.104 11.556h-3.040v-1.6h0.971c0.001 0 0.002 0 0.002 0 0.2 0 0.365-0.151 0.387-0.345l0-0.002c0.003-0.019 0.005-0.042 0.005-0.065 0-0.212-0.172-0.384-0.384-0.384-0.008 0-0.015 0-0.022 0.001l0.001-0h-0.96l-0.080-1.52h0.971c0.202-0.002 0.367-0.154 0.389-0.35l0-0.002c0.003-0.019 0.005-0.042 0.005-0.064 0-0.215-0.174-0.389-0.389-0.389-0.006 0-0.011 0-0.017 0l0.001-0h-0.96l0.080-1.445h0.971c0.202-0.002 0.367-0.154 0.389-0.35l0-0.002c0.003-0.019 0.005-0.042 0.005-0.065 0-0.212-0.172-0.384-0.384-0.384-0.008 0-0.015 0-0.022 0.001l0.001-0h-0.96v-1.435h3.040v8.416zM5.915 2.116h-4.656c-0.2-0.001-0.365-0.151-0.389-0.345l-0-0.002c-0.004-0.021-0.007-0.045-0.007-0.070 0-0.209 0.17-0.379 0.379-0.379 0.010 0 0.020 0 0.029 0.001l-0.001-0h4.666c0.209 0 0.379 0.17 0.379 0.379v0 0 0c0.085 0.176-0.16 0.416-0.4 0.416z"></path>
<path fill="#444" d="M10.475 6.666v-1.733l3.291 3.125-3.291 2.912v-2.005c-1.472 0-2.341 0.197-3.445 2.213 0 0 0.128-4.512 3.445-4.512z"></path>
<path fill="#444" d="M16 8.057l-3.12 2.747v-1.275l1.781-1.472-1.781-1.707v-1.237l3.12 2.944z"></path>
</svg>
