<!-- Generated by IcoMoon.io -->
<svg version="1.1" xmlns="http://www.w3.org/2000/svg" width="16" height="16" viewBox="0 0 16 16">
<title>tree</title>
<path fill="#444" d="M13.893 9.44h-5.067v-2.933h5.067c0.533 0 0.853-0.427 0.853-0.853s-0.427-0.853-0.853-0.853h-10.827v-3.84c0-0.533-0.427-0.96-0.853-0.96s-0.96 0.373-0.96 0.96v9.227c0 0.533 0.427 0.96 0.853 0.96s0.853-0.427 0.853-0.96v-3.573h4v8.427c0 0.533 0.427 0.96 0.853 0.96h6.027c0.533 0 0.853-0.427 0.853-0.853s-0.427-0.853-0.853-0.853h-5.067v-2.933h5.067c0.533 0 0.853-0.427 0.853-0.853s-0.32-1.067-0.8-1.067v0z"></path>
</svg>
