<!-- Generated by IcoMoon.io -->
<svg version="1.1" xmlns="http://www.w3.org/2000/svg" width="16" height="16" viewBox="0 0 16 16">
<title>csv_format</title>
<path fill="#444" d="M13.661 3.136l-2.924-2.977c-0.106-0.106-0.213-0.159-0.372-0.159h-7.92c-0.213 0-0.372 0.159-0.372 0.372v15.256c0 0.213 0.159 0.372 0.372 0.372h11.11c0.213 0 0.372-0.159 0.372-0.372v-12.173c-0.053-0.106-0.159-0.266-0.266-0.319v0zM11.003 1.169l1.754 1.754h-1.754c0 0 0-1.754 0-1.754zM13.342 15.468h-10.738v-14.99h7.814v2.658c0 0.159 0.106 0.266 0.266 0.266h2.605v0.053l0.053 12.013z"></path>
<path fill="#444" d="M11.322 5.369h-6.698c-0.266 0-0.425 0.213-0.425 0.425v5.050c0 0.266 0.213 0.425 0.425 0.425h6.804c0.266 0 0.425-0.213 0.425-0.425v-5.050c0-0.266-0.266-0.425-0.532-0.425v0zM9.302 5.741h1.914c0.106 0 0.159 0.053 0.159 0.159v0.904h-2.073v-1.063zM9.302 7.176h2.073v1.010h-2.073v-1.010zM9.302 8.611h2.073v0.957h-2.073v-0.957zM6.538 10.897h-1.807c-0.106 0-0.159-0.053-0.159-0.159v-0.797h1.967v0.957zM6.538 9.568h-1.967v-0.957h1.967v0.957zM6.538 8.239h-1.967v-1.010h1.967v1.010zM6.538 6.804h-1.967v-0.904c0-0.106 0.053-0.159 0.159-0.159h1.807v1.063zM8.93 10.897h-1.914v-0.957h1.914v0.957zM8.93 9.568h-1.914v-0.957h1.914v0.957zM8.93 8.239h-1.914v-1.010h1.914v1.010zM8.93 6.804h-1.914v-1.010h1.914v1.010zM9.302 10.897v-0.957h2.073v0.797c0 0.106-0.053 0.159-0.159 0.159h-1.914z"></path>
</svg>
