<!-- Generated by IcoMoon.io -->
<svg version="1.1" xmlns="http://www.w3.org/2000/svg" width="16" height="16" viewBox="0 0 16 16">
<title>grid</title>
<path fill="#444" d="M14.4 0h-12.8c-0.88 0-1.6 0.72-1.6 1.6v12.8c0 0.88 0.72 1.6 1.6 1.6h12.8c0.88 0 1.6-0.72 1.6-1.6v-12.8c0-0.88-0.72-1.6-1.6-1.6zM4.8 14.4h-3.2v-3.2h3.2v3.2zM4.8 9.6h-3.2v-3.2h3.2v3.2zM4.8 4.8h-3.2v-3.2h3.2v3.2zM9.6 14.4h-3.2v-3.2h3.2v3.2zM9.6 9.6h-3.2v-3.2h3.2v3.2zM9.6 4.8h-3.2v-3.2h3.2v3.2zM14.4 14.4h-3.2v-3.2h3.2v3.2zM14.4 9.6h-3.2v-3.2h3.2v3.2zM14.4 4.8h-3.2v-3.2h3.2v3.2z"></path>
</svg>
