<!-- Generated by IcoMoon.io -->
<svg version="1.1" xmlns="http://www.w3.org/2000/svg" width="16" height="16" viewBox="0 0 16 16">
<title>list</title>
<path fill="#444" d="M0.889 8.889c0.489 0 0.889-0.4 0.889-0.889s-0.4-0.889-0.889-0.889c-0.489 0-0.889 0.4-0.889 0.889s0.4 0.889 0.889 0.889zM0.889 12.444c0.489 0 0.889-0.4 0.889-0.889s-0.4-0.889-0.889-0.889c-0.489 0-0.889 0.4-0.889 0.889s0.4 0.889 0.889 0.889zM0.889 5.333c0.489 0 0.889-0.4 0.889-0.889s-0.4-0.889-0.889-0.889c-0.489 0-0.889 0.4-0.889 0.889s0.4 0.889 0.889 0.889zM4.444 8.889h10.667c0.489 0 0.889-0.4 0.889-0.889s-0.4-0.889-0.889-0.889h-10.667c-0.489 0-0.889 0.4-0.889 0.889s0.4 0.889 0.889 0.889zM4.444 12.444h10.667c0.489 0 0.889-0.4 0.889-0.889s-0.4-0.889-0.889-0.889h-10.667c-0.489 0-0.889 0.4-0.889 0.889s0.4 0.889 0.889 0.889zM3.556 4.444c0 0.489 0.4 0.889 0.889 0.889h10.667c0.489 0 0.889-0.4 0.889-0.889s-0.4-0.889-0.889-0.889h-10.667c-0.489 0-0.889 0.4-0.889 0.889zM0.889 8.889c0.489 0 0.889-0.4 0.889-0.889s-0.4-0.889-0.889-0.889c-0.489 0-0.889 0.4-0.889 0.889s0.4 0.889 0.889 0.889zM0.889 12.444c0.489 0 0.889-0.4 0.889-0.889s-0.4-0.889-0.889-0.889c-0.489 0-0.889 0.4-0.889 0.889s0.4 0.889 0.889 0.889zM0.889 5.333c0.489 0 0.889-0.4 0.889-0.889s-0.4-0.889-0.889-0.889c-0.489 0-0.889 0.4-0.889 0.889s0.4 0.889 0.889 0.889zM4.444 8.889h10.667c0.489 0 0.889-0.4 0.889-0.889s-0.4-0.889-0.889-0.889h-10.667c-0.489 0-0.889 0.4-0.889 0.889s0.4 0.889 0.889 0.889zM4.444 12.444h10.667c0.489 0 0.889-0.4 0.889-0.889s-0.4-0.889-0.889-0.889h-10.667c-0.489 0-0.889 0.4-0.889 0.889s0.4 0.889 0.889 0.889zM3.556 4.444c0 0.489 0.4 0.889 0.889 0.889h10.667c0.489 0 0.889-0.4 0.889-0.889s-0.4-0.889-0.889-0.889h-10.667c-0.489 0-0.889 0.4-0.889 0.889z"></path>
</svg>
