<!-- Generated by IcoMoon.io -->
<svg version="1.1" xmlns="http://www.w3.org/2000/svg" width="16" height="16" viewBox="0 0 16 16">
<title>home1</title>
<path fill="#444" d="M6.259 14.372v-4.348h3.478v4.348c0 0.478 0.391 0.87 0.87 0.87h2.609c0.478 0 0.87-0.391 0.87-0.87v-6.087h1.478c0.4 0 0.591-0.496 0.287-0.757l-7.27-6.548c-0.33-0.296-0.835-0.296-1.165 0l-7.27 6.548c-0.296 0.261-0.113 0.757 0.287 0.757h1.478v6.087c0 0.478 0.391 0.87 0.87 0.87h2.609c0.478 0 0.87-0.391 0.87-0.87z"></path>
</svg>
