<!-- Generated by IcoMoon.io -->
<svg version="1.1" xmlns="http://www.w3.org/2000/svg" width="16" height="16" viewBox="0 0 16 16">
<title>pesonne</title>
<path fill="#444" d="M10.293 0.021c-0.498 0.172-1.072 0.278-1.669 0.294l-0.008 0c-0.465 0.037-0.929 0.043-1.33 0.053-0.054-0.004-0.116-0.007-0.179-0.007-0.855 0-1.605 0.454-2.020 1.134l-0.006 0.010c-0.338 0.667-0.535 1.454-0.535 2.287 0 0.039 0 0.078 0.001 0.117l-0-0.006c-0.475-0.117-0.534 0.352-0.534 0.705s0.395 1.143 0.828 0.972c0.206 0.611 0.466 1.141 0.786 1.629l-0.017-0.027c0.375 0.645 0.923 1.153 1.58 1.47l0.022 0.009c-1.296 0.092-2.485 0.477-3.525 1.089l0.038-0.021h0.037c-1.148 0.705-1.933 1.714-1.922 2.921-0.025 0.279-0.040 0.604-0.040 0.933 0 0.532 0.038 1.055 0.11 1.566l-0.007-0.059c0.077 0.304 0.27 0.553 0.529 0.702l0.005 0.003c0.267 0.129 0.581 0.204 0.912 0.204 0.029 0 0.057-0.001 0.085-0.002l-0.004 0h0.166c1.96 0 6.771 0 8.79 0h0.139c0.004 0 0.008 0 0.012 0 0.368 0 0.717-0.085 1.027-0.236l-0.014 0.006c0.262-0.15 0.454-0.395 0.532-0.686l0.002-0.008c0.073-0.457 0.115-0.983 0.115-1.519 0-0.317-0.015-0.63-0.043-0.94l0.003 0.040c0-1.218-0.796-2.237-1.949-2.937-0.964-0.577-2.107-0.96-3.329-1.066l-0.030-0.002h-0.032c0.732-0.283 1.323-0.797 1.695-1.452l0.008-0.016c0.269-0.442 0.495-0.953 0.651-1.493l0.011-0.045v-0.048c0.481-0.085 0.705-0.609 0.79-1.004 0-0.427-0.080-0.78-0.534-0.705 0.001-0.065 0.002-0.142 0.002-0.219 0-0.779-0.067-1.542-0.195-2.284l0.011 0.079c-0.106-0.556-0.374-1.036-0.752-1.404l-0.001-0.001c-0.091-0.096-0.043-0.048-0.208-0.032zM6.95 2.274c0.267 0.105 0.577 0.166 0.901 0.166 0.006 0 0.013-0 0.019-0h0.111c0.056 0.005 0.121 0.007 0.186 0.007 0.318 0 0.621-0.064 0.897-0.179l-0.015 0.006c0.087-0.024 0.186-0.037 0.289-0.037 0.17 0 0.332 0.037 0.476 0.104l-0.007-0.003c0.451 0.231 0.785 0.637 0.916 1.125l0.003 0.012c0.104 0.353 0.163 0.759 0.163 1.178 0 0.876-0.26 1.692-0.708 2.373l0.010-0.016c-0.419 0.828-1.247 1.395-2.211 1.436l-0.005 0c-0.796 0-1.517-0.609-2.067-1.463-0.732-1.18-1.025-2.136-0.646-3.514 0.129-0.515 0.476-0.93 0.935-1.149l0.010-0.004c0.14-0.054 0.301-0.085 0.47-0.085v0c0.041-0.004 0.088-0.006 0.136-0.006s0.095 0.002 0.142 0.007l-0.006-0zM7.981 8.987v0c0.013-0 0.028-0 0.043-0 1.057 0 2.068 0.196 2.999 0.553l-0.057-0.019h-0.059c-0.779 1.501-1.755 2.782-2.914 3.87l-0.008 0.007c-1.152-1.074-2.114-2.332-2.842-3.731l-0.036-0.076-0.037-0.075c0.866-0.338 1.868-0.533 2.915-0.534h0zM4.777 9.633c0.806 1.612 1.85 2.983 3.103 4.129l0.011 0.010c0.030 0.030 0.071 0.048 0.117 0.048 0 0 0.001 0 0.001 0h-0c0.001 0 0.003 0 0.004 0 0.046 0 0.088-0.018 0.119-0.048l-0 0c1.243-1.139 2.278-2.479 3.059-3.974l0.038-0.080 0.037-0.080c0.307 0.136 0.561 0.269 0.805 0.418l-0.031-0.017h-0.027c1.068 0.657 1.778 1.565 1.778 2.638 0.023 0.271 0.036 0.586 0.036 0.904 0 0.502-0.032 0.997-0.095 1.482l0.006-0.057c-0.046 0.21-0.18 0.382-0.359 0.479l-0.004 0.002c-0.245 0.111-0.532 0.176-0.834 0.176-0.005 0-0.011-0-0.016-0h-0.127c-2.013 0-6.841 0-8.79 0h-0.16c-0.294-0-0.573-0.065-0.824-0.181l0.012 0.005c-0.184-0.106-0.317-0.282-0.362-0.492l-0.001-0.005c-0.053-0.426-0.083-0.92-0.083-1.42 0-0.325 0.013-0.647 0.038-0.966l-0.003 0.042c0-1.202 0.961-2.136 1.762-2.617 0.205-0.127 0.446-0.256 0.697-0.368l0.040-0.016h0.043z"></path>
</svg>
