<!-- Generated by IcoMoon.io -->
<svg version="1.1" xmlns="http://www.w3.org/2000/svg" width="16" height="16" viewBox="0 0 16 16">
<title>t56Cage</title>
<path fill="#444" d="M1.328 10.593h13.338v0.351h-13.338v-0.351z"></path>
<path fill="#444" d="M15.997 10.753c0-0.024 0-0.053 0-0.081 0-4.418-3.581-7.999-7.999-7.999s-7.999 3.581-7.999 7.999c0 0.028 0 0.057 0 0.085l-0-0.004v0.186h1.386v-0.186c0.001-3.653 2.963-6.615 6.617-6.615 1.826 0 3.48 0.74 4.677 1.936l-0-0c1.196 1.191 1.936 2.839 1.936 4.66 0 0.007-0 0.013-0 0.019v-0.001 0.191h1.384v-0.188zM14.988 10.565v-0.057c-0.141-3.75-3.215-6.736-6.987-6.736-3.766 0-6.837 2.978-6.986 6.708l-0 0.013v0.071h-0.636v-0.062c0.062-2.015 0.903-3.822 2.23-5.139l0-0c1.379-1.38 3.285-2.234 5.391-2.234 4.117 0 7.471 3.265 7.616 7.346l0 0.013v0.073h-0.63z"></path>
<path fill="#444" d="M10.827 10.951h-5.662c-0.123 0-0.223-0.1-0.223-0.223v0-4.33c0-0.123 0.1-0.223 0.223-0.223v0h5.662c0.123 0 0.223 0.1 0.223 0.223v0 4.33c0 0.123-0.1 0.223-0.223 0.223v0zM5.295 10.601h5.402v-4.074h-5.402z"></path>
<path fill="#444" d="M10.969 10.868h-3.067v-4.613h3.067zM8.092 10.68h2.689v-4.236h-2.691z"></path>
<path fill="#444" d="M13.092 13.284h-0.329v-1.315h-0.482v-0.282h1.295v0.282h-0.482z"></path>
<path fill="#444" d="M13.989 12.339c0.072-0.055 0.163-0.088 0.261-0.088 0.007 0 0.014 0 0.022 0l-0.001-0c0.001-0 0.002-0 0.004-0 0.262 0 0.475 0.213 0.475 0.475 0 0.012-0 0.024-0.001 0.035l0-0.002c0 0.215-0.109 0.565-0.575 0.565-0.247 0-0.493-0.146-0.512-0.464h0.312c-0 0.001-0 0.003-0 0.005 0 0.116 0.094 0.21 0.21 0.21 0.003 0 0.007-0 0.010-0l-0 0c0.149 0 0.235-0.127 0.235-0.295 0-0.141-0.067-0.282-0.231-0.282-0.005-0-0.011-0.001-0.017-0.001-0.082 0-0.154 0.045-0.191 0.112l-0.001 0.001-0.277-0.013 0.108-0.865h0.865v0.264h-0.641z"></path>
<path fill="#444" d="M15.651 12.108c-0.007-0.085-0.077-0.152-0.164-0.152-0.007 0-0.013 0-0.019 0.001l0.001-0c-0.201 0-0.247 0.231-0.26 0.435l0.005 0.005c0.061-0.081 0.156-0.132 0.264-0.132 0.011 0 0.022 0 0.033 0.002l-0.001-0c0.005-0 0.010-0 0.016-0 0.257 0 0.465 0.208 0.465 0.465 0 0.007-0 0.015-0 0.022l0-0.001c0 0.344-0.21 0.575-0.514 0.575-0.477 0-0.57-0.399-0.57-0.792 0-0.299 0.039-0.822 0.585-0.822 0.064 0 0.247 0.025 0.322 0.102 0.084 0.074 0.139 0.178 0.146 0.296l0 0.001zM15.452 12.514c-0.118 0-0.237 0.073-0.237 0.27 0 0.171 0.097 0.294 0.247 0.294 0.113 0 0.218-0.087 0.218-0.3 0-0.2-0.129-0.264-0.228-0.264z"></path>
</svg>
