<!-- Generated by IcoMoon.io -->
<svg version="1.1" xmlns="http://www.w3.org/2000/svg" width="16" height="16" viewBox="0 0 16 16">
<title>escaped-lost-disappeared</title>
<path fill="#444" d="M13.653 2.347c-1.44-1.547-3.467-2.347-5.6-2.347-4.427 0-7.947 3.627-8 8 0 4.373 3.52 7.893 7.893 7.947v0.053h0.16v-0.053c4.373-0.053 7.893-3.627 7.893-7.947-0.053-2.133-0.853-4.107-2.347-5.653v0zM13.92 3.787v0c0.8 1.173 1.28 2.4 1.333 3.787v0.053h-2.827v-0.053c0-0.107 0-0.16 0-0.267 0-0.213-0.053-0.427-0.053-0.587-0.107-0.427-0.213-0.907-0.267-1.387l-0.053-0.32c0-0.107-0.053-0.16 0.053-0.213 0.427-0.213 0.853-0.427 1.333-0.64l0.48-0.373zM9.653 0.907c1.493 0.32 2.72 1.067 3.84 2.24l0.053 0.053-1.92 0.907c-0.48-1.173-1.173-2.133-2.027-3.147l-0.053-0.053h0.107zM2.613 3.2c1.12-1.173 2.293-1.92 3.84-2.24h0.107l-0.053 0.053c-0.907 0.96-1.6 2.027-2.027 3.147v0.053l-1.867-1.013zM0.8 7.573c0.107-1.44 0.48-2.613 1.333-3.787v0 0c0.053 0.053 0.107 0.053 0.16 0.107l0.053 0.053c0.213 0.107 0.373 0.213 0.533 0.32s0.373 0.16 0.533 0.267h0.053c0.16 0.053 0.267 0.107 0.373 0.213 0.053 0.053 0.107 0.16 0.107 0.213-0.267 0.8-0.427 1.707-0.427 2.56v0.107l-2.72-0.053zM2.133 12.213v0c-0.8-1.173-1.28-2.4-1.333-3.787v-0.053h2.827v0.053c0.053 0.96 0.213 1.92 0.48 2.72v0l-1.973 1.067zM6.4 15.093c-1.493-0.373-2.72-1.12-3.787-2.24l-0.053-0.053 1.813-0.907v0.053c0.48 1.173 1.173 2.187 2.027 3.147v0zM8.48 15.147l-0.053 0.053v-2.667h-0.693v2.667l-0.053-0.053c-1.12-0.907-1.973-2.080-2.507-3.52v-0.053h0.053c0.48-0.16 0.96-0.267 1.493-0.32v-0.587c0-0.053 0-0.053 0-0.107l-1.813 0.32c-0.213-0.373-0.48-1.973-0.427-2.453v-0.053h2.293v-0.693h-2.347v-0.053c-0.053-0.48 0.213-1.973 0.427-2.453v0l0.32 0.053v-0.907c0 0 0 0-0.053 0v0 0c0.587-1.333 1.44-2.453 2.507-3.413l0.053-0.053v3.040c0.213 0 0.48 0 0.747 0v-3.040l0.107 0.053c1.12 0.907 1.92 2.080 2.507 3.467v0.053h-0.053c-0.107 0.053-0.16 0.053-0.267 0.053l-0.107 0.053c0.213 0.16 0.373 0.373 0.533 0.64l0.16-0.053v0.053c0.267 0.8 0.427 1.653 0.427 2.453v0.053h-0.267c-0.053 0.267-0.107 0.48-0.16 0.693h0.427v0.053c0.053 0.48-0.213 2.027-0.427 2.453v0l-1.92-0.32c0 0.053 0 0.053 0 0.107v0.587c0.64 0.107 1.28 0.213 1.653 0.373h0.053v0.053c-0.693 1.387-1.547 2.507-2.613 3.467v0zM13.44 12.8c-1.067 1.173-2.293 1.867-3.787 2.24h-0.107l0.053-0.107c0.853-0.96 1.547-2.027 2.027-3.147v-0.053l1.813 1.067zM15.253 8.373c-0.053 1.387-0.533 2.667-1.333 3.787v0l-1.973-1.067c0.267-0.853 0.427-1.76 0.48-2.72v-0.053l2.827 0.053zM10.72 7.2v-0.693c0-0.907-0.587-1.92-2.080-1.92-0.16 0-0.32 0-0.48 0-0.853 0-1.493 0.107-2.24 0.267v0.96h2.4c0.693 0 1.067 0.213 1.067 0.8v0.533c0 0.533-0.373 0.747-0.8 0.747h-1.12v1.92h1.067v-0.853c0.107 0 0.213 0 0.373 0 1.227 0 1.813-0.587 1.813-1.76v0zM7.52 11.787h0.8c0.107 0 0.213-0.053 0.213-0.213v-0.907c0-0.16-0.053-0.213-0.213-0.213h-0.8c-0.16 0-0.213 0.107-0.213 0.213v0.853c0 0.16 0.107 0.267 0.213 0.267v0z"></path>
</svg>
