<!-- Generated by IcoMoon.io -->
<svg version="1.1" xmlns="http://www.w3.org/2000/svg" width="16" height="16" viewBox="0 0 16 16">
<title>slide</title>
<path fill="#444" d="M12.107 16h-8.213v-16h8.213v16zM4.213 15.68h7.52v-15.36h-7.52v15.36z"></path>
<path fill="#444" d="M10.933 10.56h-5.813v-5.44h5.813v5.44zM5.387 10.347h5.333v-4.96h-5.333v4.96z"></path>
<path fill="#444" d="M9.76 7.84c0 0.96-0.747 1.707-1.707 1.707s-1.707-0.747-1.707-1.707 0.747-1.707 1.707-1.707 1.707 0.8 1.707 1.707z"></path>
</svg>
