<!-- Generated by IcoMoon.io -->
<svg version="1.1" xmlns="http://www.w3.org/2000/svg" width="16" height="16" viewBox="0 0 16 16">
<title>back</title>
<path fill="#444" d="M5.996 4.177v-1.446c0-0.809-0.982-1.219-1.555-0.646l-4.175 4.174c-0.355 0.355-0.355 0.928 0 1.282l4.175 4.175c0.573 0.573 1.555 0.173 1.555-0.637v-1.537c4.547 0 7.731 1.455 10.004 4.638-0.909-4.547-3.638-9.095-10.004-10.004z"></path>
</svg>
