<!-- Generated by IcoMoon.io -->
<svg version="1.1" xmlns="http://www.w3.org/2000/svg" width="16" height="16" viewBox="0 0 16 16">
<title>observation</title>
<path fill="#444" d="M8 2.545c-3.636 0-6.742 2.262-8 5.455 1.258 3.193 4.364 5.455 8 5.455s6.742-2.262 8-5.455c-1.258-3.193-4.364-5.455-8-5.455zM8 11.636c-2.007 0-3.636-1.629-3.636-3.636s1.629-3.636 3.636-3.636c2.007 0 3.636 1.629 3.636 3.636s-1.629 3.636-3.636 3.636zM8 5.818c-1.207 0-2.182 0.975-2.182 2.182s0.975 2.182 2.182 2.182c1.207 0 2.182-0.975 2.182-2.182s-0.975-2.182-2.182-2.182z"></path>
</svg>
