<!-- Generated by IcoMoon.io -->
<svg version="1.1" xmlns="http://www.w3.org/2000/svg" width="16" height="16" viewBox="0 0 16 16">
<title>rightarrow</title>
<path fill="#444" d="M1.027 6.978h11.469l-5.011-5.011c-0.4-0.4-0.4-1.058 0-1.458s1.047-0.4 1.448 0l6.767 6.767c0.4 0.4 0.4 1.047 0 1.448l-6.767 6.767c-0.4 0.4-1.047 0.4-1.448 0s-0.4-1.047 0-1.448l5.011-5.011h-11.469c-0.565 0-1.027-0.462-1.027-1.027s0.462-1.027 1.027-1.027z"></path>
</svg>
