<!-- Generated by IcoMoon.io -->
<svg version="1.1" xmlns="http://www.w3.org/2000/svg" width="16" height="16" viewBox="0 0 16 16">
<title>save</title>
<path fill="#444" d="M12.969 0.524c-0.338-0.338-0.791-0.524-1.262-0.524h-9.929c-0.987 0-1.778 0.8-1.778 1.778v12.444c0 0.978 0.8 1.778 1.778 1.778h12.444c0.978 0 1.778-0.8 1.778-1.778v-9.929c0-0.471-0.187-0.924-0.524-1.253l-2.507-2.516zM8 14.222c-1.476 0-2.667-1.191-2.667-2.667s1.191-2.667 2.667-2.667c1.476 0 2.667 1.191 2.667 2.667s-1.191 2.667-2.667 2.667zM8.889 5.333h-5.333c-0.978 0-1.778-0.8-1.778-1.778s0.8-1.778 1.778-1.778h5.333c0.978 0 1.778 0.8 1.778 1.778s-0.8 1.778-1.778 1.778z"></path>
</svg>
