<!-- Generated by IcoMoon.io -->
<svg version="1.1" xmlns="http://www.w3.org/2000/svg" width="16" height="16" viewBox="0 0 16 16">
<title>logo-centralmonitoring-color</title>
<path fill="#3f51b5" d="M8.067 10.411c-1.394 0-2.466-1.125-2.466-2.519s1.125-2.466 2.519-2.466 2.466 1.125 2.466 2.519v0c0 1.394-1.125 2.466-2.519 2.466v0 0z"></path>
<path fill="#3f51b5" d="M11.713 3.175c-0.053 0-0.108 0-0.161 0-0.161-0.053-0.214 0-0.322 0.161-0.375 0.644-0.75 1.233-1.072 1.822-0.108 0.161-0.108 0.161-0.214 0.053-0.161-0.108-0.214-0.161-0.375-0.214-0.108-0.053-0.108-0.108-0.053-0.214 0.322-0.589 0.697-1.18 1.019-1.716 0.161-0.161 0.161-0.428 0-0.589-0.322-0.483-0.322-1.125 0.053-1.608s1.019-0.697 1.608-0.536c0.644 0.161 1.072 0.75 1.072 1.394-0.055 0.805-0.698 1.447-1.555 1.447 0.053 0 0.053 0 0 0v0 0z"></path>
<path fill="#3f51b5" d="M5.119 9.286l-0.589 0.214-1.502 0.483c-0.108 0-0.108 0.053-0.108 0.161 0 0.536-0.322 1.072-0.858 1.286-0.536 0.269-1.233 0.161-1.661-0.322-0.536-0.589-0.536-1.502 0-2.037s1.502-0.536 2.037 0c0.053 0.053 0.053 0.053 0.108 0.108 0.053 0.108 0.161 0.108 0.214 0.053l1.93-0.644c0.161-0.053 0.161-0.053 0.214 0.108 0.053 0.216 0.106 0.43 0.214 0.591v0 0z"></path>
<path fill="#3f51b5" d="M16 8.589c0 0.589-0.322 1.072-0.858 1.341-0.483 0.214-1.072 0.161-1.502-0.214-0.214-0.214-0.428-0.428-0.483-0.75 0-0.108-0.108-0.161-0.161-0.161-0.483-0.053-0.964-0.108-1.447-0.161h-0.108c-0.108 0-0.108-0.053-0.108-0.161s0.053-0.322 0.053-0.483 0.053-0.108 0.161-0.108l0.805 0.108 0.697 0.053c0.053 0 0.161-0.053 0.161-0.108 0.322-0.697 1.233-1.019 1.93-0.697 0.269 0.108 0.483 0.322 0.644 0.644 0.162 0.214 0.216 0.43 0.216 0.697v0 0z"></path>
<path fill="#3f51b5" d="M9.567 15.719c-0.644 0-1.18-0.375-1.394-0.964-0.214-0.644 0-1.341 0.536-1.661 0.108-0.053 0.161-0.161 0.108-0.269-0.108-0.483-0.214-0.964-0.322-1.447-0.053-0.161 0-0.161 0.108-0.214 0.161 0 0.322-0.053 0.428-0.108 0.108 0 0.108 0 0.161 0.108 0.108 0.483 0.214 1.019 0.322 1.502 0 0.108 0.053 0.161 0.161 0.161 0.697 0.108 1.233 0.644 1.286 1.394 0.053 0.536-0.214 1.019-0.697 1.286-0.214 0.158-0.428 0.213-0.697 0.213v0 0z"></path>
<path fill="#3f51b5" d="M5.977 5.373l-0.483 0.483c-0.053 0.053-0.108 0-0.161 0-0.269-0.269-0.483-0.483-0.805-0.75-0.053-0.053-0.161-0.108-0.214-0.053-0.75 0.322-1.608 0-1.93-0.697s0-1.608 0.697-1.93c0.75-0.322 1.608 0 1.93 0.697 0.053 0.161 0.108 0.322 0.108 0.483 0 0.214 0 0.483-0.108 0.697-0.053 0.053-0.053 0.161 0.053 0.214v0c0.269 0.214 0.483 0.483 0.75 0.75 0.055 0.052 0.109 0.106 0.162 0.106v0 0z"></path>
</svg>
