<!-- Generated by IcoMoon.io -->
<svg version="1.1" xmlns="http://www.w3.org/2000/svg" width="16" height="16" viewBox="0 0 16 16">
<title>sperm-collection</title>
<path fill="#444" d="M11.296 0h-6.591c0 0 0 0 0 0-0.159 0-0.266 0.106-0.266 0.266 0 0 0 0 0 0v0 1.86c0 0 0 0 0 0 0 0.106 0.106 0.266 0.266 0.266 0 0 0 0 0 0h0.691v11.003c0 1.435 1.169 2.605 2.605 2.605s2.605-1.169 2.605-2.605v-11.056h0.691c0 0 0 0 0 0 0.106 0 0.266-0.106 0.266-0.266 0 0 0 0 0 0v0-1.807c0 0 0 0 0 0 0-0.159-0.106-0.266-0.266-0.266 0 0 0 0 0 0v0 0zM10.126 13.342c0 0 0 0 0 0 0 1.223-0.957 2.179-2.126 2.179s-2.126-0.957-2.126-2.126c0 0 0-0.053 0-0.053v0-11.003h4.252v11.003zM11.083 1.86h-6.166v-1.382h6.113v1.382z"></path>
<path fill="#444" d="M9.542 10.153c0 0.159-0.159 0.319-0.319 0.319s-0.319-0.159-0.319-0.319c0-0.159 0.159-0.319 0.319-0.319s0.319 0.106 0.319 0.319z"></path>
<path fill="#444" d="M9.329 13.236c0 0.213-0.159 0.372-0.372 0.372s-0.372-0.159-0.372-0.372c0-0.213 0.159-0.372 0.372-0.372 0.213-0.053 0.372 0.159 0.372 0.372z"></path>
<path fill="#444" d="M7.256 4.253c0.053 0 0.053 0 0 0 0.159 0 0.266-0.106 0.266-0.213s-0.106-0.213-0.213-0.213c-0.106 0-0.213 0.106-0.213 0.213v0c0 0 0 0 0 0-0.053 0.106 0.053 0.213 0.159 0.213v0z"></path>
<path fill="#444" d="M6.937 8.664c0 0 0 0 0 0 0.159 0 0.266-0.106 0.266-0.266s-0.106-0.266-0.266-0.266c-0.159 0-0.266 0.106-0.266 0.266 0 0 0 0 0 0v0 0c-0.053 0.106 0.106 0.266 0.266 0.266v0 0z"></path>
<path fill="#444" d="M7.522 14.193c0 0.159-0.159 0.319-0.319 0.319s-0.319-0.159-0.319-0.319 0.159-0.319 0.319-0.319c0.213 0 0.319 0.159 0.319 0.319z"></path>
<path fill="#444" d="M8.213 11.429v-1.595h-0.053v-0.638c0-0.053 0-0.106-0.053-0.106v0c0-0.106 0-0.213 0-0.319v0c0 0 0 0 0 0 0-0.106 0.053-0.213 0.053-0.319v0c0-0.053 0.053-0.106 0.106-0.159s0.053-0.106 0.106-0.159v0c0.053-0.106 0.106-0.266 0.106-0.425v0c0 0 0-0.053 0-0.053 0-0.159-0.053-0.266-0.053-0.372v0c-0.053-0.053-0.053-0.106-0.106-0.159v0l-0.106-0.159c-0.159-0.159-0.266-0.425-0.266-0.638v0c0 0 0-0.053 0-0.053 0-0.106 0-0.213 0.053-0.319v0c0-0.053 0.053-0.159 0.053-0.213v0c0-0.053 0.053-0.106 0.053-0.159 0.106-0.213 0.213-0.478 0.319-0.691 0.053-0.213 0.106-0.425 0.106-0.638 0-0.053 0-0.106 0-0.159v0c0-0.266-0.053-0.532-0.159-0.797v0.053c0.053 0.213 0.106 0.478 0.106 0.744v0c0 0 0 0 0 0.053 0 0.266-0.053 0.478-0.159 0.744v0c-0.106 0.266-0.266 0.425-0.372 0.691-0.053 0.053-0.053 0.106-0.106 0.159s-0.053 0.106-0.053 0.213c-0.053 0.106-0.053 0.266-0.053 0.425v0c0 0 0 0 0 0 0 0.159 0 0.266 0.053 0.425v0c0.053 0.159 0.106 0.266 0.213 0.372l0.106 0.159c0.053 0.053 0.053 0.106 0.106 0.159v0c0.053 0.053 0.053 0.159 0.053 0.266 0 0.053 0 0.053 0 0.106v0c0 0.106-0.053 0.213-0.106 0.319v0c-0.053 0.053-0.053 0.106-0.106 0.159v0c-0.053 0.053-0.106 0.106-0.106 0.159-0.053 0.053-0.053 0.106-0.106 0.213v0c0 0.053-0.053 0.159-0.053 0.213v0c0 0.053 0 0.053 0 0.106 0 0.106 0 0.159 0 0.266v0c-0.053 0-0.053 0.053-0.053 0.106 0 0 0 0 0 0v0 0.638h-0.053v1.595c0.106 0.319 0.159 0.532 0.266 0.797v-0.053c0.053-0.425 0.159-0.638 0.266-0.957v0 0z"></path>
</svg>
