<!-- Generated by IcoMoon.io -->
<svg version="1.1" xmlns="http://www.w3.org/2000/svg" width="16" height="16" viewBox="0 0 16 16">
<title>graph</title>
<path fill="#444" d="M5.6 13.333l-2.667-4.053-1.653 1.653-1.28-1.227 3.2-3.253 2.187 3.307 1.813-3.68 3.307-2.507 2.080 2.613 1.813-3.52 1.6 0.8-3.040 6.133-2.773-3.413-1.6 1.173-2.987 5.973z"></path>
</svg>
