<!-- Generated by IcoMoon.io -->
<svg version="1.1" xmlns="http://www.w3.org/2000/svg" width="16" height="16" viewBox="0 0 16 16">
<title>batiment</title>
<path fill="#444" d="M15.84 5.013l-7.68-2.24c0 0-0.053 0-0.053 0s-0.053 0-0.053 0c-2.987 0.853-7.52 2.133-7.84 2.187v0c-0.107 0-0.213 0.107-0.213 0.213s0.107 0.213 0.213 0.213c0 0 0 0 0 0 0.053 0 0.533-0.107 1.227-0.32v7.947c0 0.107 0.107 0.213 0.213 0.213h12.853c0 0 0 0 0 0 0.107 0 0.213-0.107 0.213-0.213v-7.893l1.013 0.267c0 0 0.053 0 0.053 0v0 0c0.107 0 0.213-0.107 0.213-0.213 0-0.053-0.053-0.16-0.16-0.16zM10.347 8.267v4.533h-2.24v-4.533h2.24zM7.84 12.8h-2.24v-4.533h2.24v4.533zM14.293 12.8h-3.68v-4.693c0-0.053-0.053-0.16-0.16-0.16h-4.96c-0.053 0-0.16 0.053-0.16 0.16v4.693h-3.467v-7.84c1.813-0.48 4.693-1.28 6.24-1.76l6.24 1.76v7.84z"></path>
<path fill="#444" d="M5.493 5.333v0.587c0 0.053 0.053 0.053 0.053 0.053h4.907c0.053 0 0.053-0.053 0.053-0.053v-0.587c0-0.053-0.053-0.053-0.053-0.053h-4.907c0 0-0.053 0-0.053 0.053zM5.653 5.387h4.8v0.48h-4.8v-0.48z"></path>
</svg>
