<!-- Generated by IcoMoon.io -->
<svg version="1.1" xmlns="http://www.w3.org/2000/svg" width="16" height="16" viewBox="0 0 16 16">
<title>space</title>
<path fill="#444" d="M15.384 5.418h-14.768c-0.339 0-0.616 0.277-0.616 0.616v3.933c0 0.339 0.277 0.616 0.616 0.616h14.771c0.339 0 0.616-0.277 0.613-0.618v-3.93c0-0.338-0.277-0.616-0.616-0.616zM15.704 9.964c0 0.175-0.143 0.32-0.32 0.32h-14.768c-0.175 0-0.32-0.143-0.32-0.32v-3.93c0-0.175 0.143-0.32 0.32-0.32v0h14.768c0.175 0 0.32 0.143 0.32 0.32v3.93z"></path>
<path fill="#444" d="M4.827 8.203c0 0.062-0.016 0.117-0.048 0.165s-0.077 0.087-0.138 0.115-0.133 0.042-0.217 0.042c-0.1 0-0.183-0.019-0.247-0.057-0.046-0.027-0.083-0.063-0.112-0.109s-0.043-0.090-0.043-0.133c0-0.025 0.008-0.046 0.026-0.064s0.039-0.027 0.066-0.027c0.022 0 0.040 0.007 0.055 0.021s0.027 0.034 0.038 0.062c0.013 0.033 0.027 0.059 0.042 0.081s0.036 0.039 0.063 0.053c0.027 0.014 0.063 0.021 0.107 0.021 0.061 0 0.11-0.014 0.148-0.043s0.057-0.064 0.057-0.106c0-0.033-0.010-0.061-0.031-0.082s-0.047-0.037-0.079-0.048-0.076-0.023-0.13-0.035c-0.072-0.017-0.134-0.037-0.183-0.060s-0.088-0.054-0.117-0.093c-0.029-0.039-0.043-0.088-0.043-0.147 0-0.056 0.015-0.105 0.046-0.148s0.074-0.077 0.133-0.1c0.058-0.023 0.126-0.035 0.203-0.035 0.063 0 0.116 0.008 0.162 0.023s0.083 0.036 0.113 0.062c0.030 0.026 0.052 0.052 0.066 0.081s0.021 0.056 0.021 0.082c0 0.024-0.008 0.047-0.026 0.066s-0.039 0.029-0.065 0.029c-0.023 0-0.042-0.006-0.053-0.017s-0.026-0.031-0.040-0.058c-0.018-0.038-0.041-0.068-0.067-0.090s-0.067-0.032-0.124-0.032c-0.053 0-0.096 0.012-0.128 0.035s-0.049 0.052-0.049 0.084c0 0.020 0.006 0.037 0.017 0.052s0.027 0.027 0.046 0.038c0.019 0.011 0.039 0.019 0.059 0.025s0.052 0.015 0.098 0.027c0.058 0.013 0.109 0.028 0.155 0.044s0.086 0.036 0.118 0.059 0.058 0.052 0.076 0.087c0.017 0.033 0.027 0.077 0.027 0.128z"></path>
<path fill="#444" d="M5.394 8.112h-0.188v0.287c0 0.041-0.010 0.072-0.029 0.093s-0.044 0.032-0.073 0.032c-0.031 0-0.056-0.011-0.075-0.032s-0.028-0.052-0.028-0.092v-0.782c0-0.045 0.010-0.077 0.031-0.097s0.053-0.029 0.099-0.029h0.264c0.078 0 0.138 0.006 0.18 0.018s0.077 0.031 0.107 0.058 0.053 0.059 0.069 0.098c0.016 0.038 0.023 0.082 0.023 0.131 0 0.103-0.032 0.182-0.096 0.235s-0.158 0.080-0.284 0.080zM5.344 7.647h-0.138v0.31h0.138c0.048 0 0.089-0.005 0.122-0.015s0.058-0.027 0.074-0.050c0.017-0.023 0.026-0.053 0.026-0.091 0-0.045-0.013-0.081-0.039-0.109-0.030-0.030-0.091-0.045-0.183-0.045z"></path>
<path fill="#444" d="M6.47 8.392l-0.048-0.127h-0.412l-0.048 0.13c-0.019 0.051-0.035 0.085-0.048 0.102s-0.035 0.027-0.066 0.027c-0.026 0-0.048-0.009-0.068-0.028s-0.030-0.040-0.030-0.064c0-0.014 0.003-0.028 0.007-0.043s0.013-0.035 0.022-0.062l0.259-0.658c0.008-0.019 0.017-0.042 0.027-0.068s0.022-0.048 0.033-0.066c0.012-0.017 0.027-0.032 0.047-0.043s0.043-0.017 0.071-0.017c0.028 0 0.052 0.006 0.072 0.017s0.035 0.025 0.047 0.042c0.012 0.017 0.022 0.035 0.030 0.055s0.018 0.046 0.031 0.078l0.265 0.654c0.021 0.050 0.031 0.086 0.031 0.108s-0.010 0.045-0.029 0.065c-0.020 0.020-0.043 0.029-0.071 0.029-0.016 0-0.030-0.002-0.042-0.008s-0.021-0.013-0.029-0.023c-0.008-0.010-0.017-0.025-0.025-0.046s-0.017-0.038-0.023-0.054zM6.063 8.11h0.303l-0.152-0.418-0.151 0.418z"></path>
<path fill="#444" d="M7.668 8.187c0 0.033-0.008 0.068-0.024 0.105s-0.041 0.074-0.075 0.111c-0.034 0.036-0.077 0.066-0.131 0.088s-0.115 0.034-0.185 0.034c-0.053 0-0.103-0.005-0.146-0.015s-0.083-0.026-0.119-0.047-0.068-0.050-0.098-0.085c-0.027-0.032-0.049-0.068-0.068-0.107s-0.033-0.082-0.043-0.126c-0.009-0.045-0.014-0.092-0.014-0.143 0-0.082 0.012-0.155 0.036-0.219s0.058-0.12 0.102-0.166 0.096-0.081 0.156-0.105c0.059-0.024 0.122-0.036 0.19-0.036 0.082 0 0.155 0.017 0.219 0.049s0.113 0.073 0.147 0.122c0.034 0.048 0.051 0.093 0.051 0.137 0 0.023-0.008 0.044-0.025 0.063s-0.037 0.027-0.060 0.027c-0.027 0-0.046-0.006-0.059-0.018s-0.027-0.034-0.044-0.064c-0.027-0.050-0.058-0.087-0.094-0.112s-0.081-0.037-0.134-0.037c-0.084 0-0.152 0.032-0.202 0.096s-0.075 0.155-0.075 0.273c0 0.079 0.011 0.144 0.033 0.197s0.053 0.092 0.094 0.117c0.041 0.026 0.088 0.038 0.143 0.038 0.059 0 0.109-0.015 0.15-0.044s0.072-0.072 0.093-0.129c0.009-0.027 0.020-0.048 0.032-0.065s0.033-0.025 0.063-0.025c0.024 0 0.046 0.008 0.063 0.026 0.017 0.015 0.025 0.036 0.025 0.062z"></path>
<path fill="#444" d="M8.522 7.651h-0.463v0.249h0.426c0.032 0 0.055 0.007 0.070 0.021s0.023 0.032 0.023 0.056-0.008 0.042-0.023 0.057c-0.015 0.014-0.038 0.022-0.071 0.022h-0.426v0.288h0.478c0.033 0 0.057 0.008 0.073 0.023s0.024 0.035 0.024 0.060c0 0.024-0.008 0.043-0.024 0.058s-0.041 0.023-0.073 0.023h-0.558c-0.045 0-0.077-0.010-0.097-0.030s-0.029-0.052-0.029-0.096v-0.763c0-0.029 0.004-0.053 0.013-0.072s0.022-0.032 0.041-0.041 0.043-0.013 0.072-0.013h0.543c0.033 0 0.057 0.008 0.073 0.022s0.024 0.033 0.024 0.057c0 0.024-0.008 0.043-0.024 0.058s-0.041 0.022-0.073 0.022z"></path>
<path fill="#444" d="M9.586 8.507h-0.31c-0.045 0-0.077-0.010-0.096-0.030s-0.028-0.052-0.028-0.096v-0.763c0-0.045 0.010-0.077 0.029-0.097s0.052-0.029 0.095-0.029h0.328c0.048 0 0.090 0.003 0.126 0.009s0.068 0.017 0.096 0.035c0.024 0.014 0.045 0.032 0.063 0.054s0.033 0.046 0.043 0.072c0.010 0.027 0.014 0.054 0.014 0.084 0 0.102-0.051 0.176-0.152 0.223 0.133 0.042 0.2 0.125 0.2 0.247 0 0.057-0.014 0.107-0.043 0.153s-0.068 0.079-0.117 0.101c-0.031 0.012-0.067 0.022-0.107 0.027s-0.087 0.008-0.14 0.008zM9.357 7.647v0.262h0.188c0.051 0 0.091-0.005 0.118-0.014s0.049-0.028 0.064-0.055c0.012-0.019 0.017-0.041 0.017-0.065 0-0.051-0.018-0.085-0.055-0.102s-0.092-0.025-0.167-0.025h-0.167zM9.57 8.057h-0.213v0.296h0.221c0.139 0 0.208-0.050 0.208-0.15 0-0.051-0.018-0.088-0.054-0.112s-0.090-0.034-0.162-0.034z"></path>
<path fill="#444" d="M10.767 8.392l-0.048-0.127h-0.412l-0.048 0.13c-0.019 0.051-0.035 0.085-0.048 0.102s-0.035 0.027-0.066 0.027c-0.026 0-0.048-0.009-0.068-0.028s-0.030-0.040-0.030-0.064c0-0.014 0.002-0.028 0.007-0.043s0.012-0.035 0.023-0.062l0.259-0.658c0.008-0.019 0.017-0.042 0.027-0.068s0.022-0.048 0.033-0.066c0.012-0.017 0.027-0.032 0.047-0.043s0.043-0.017 0.071-0.017c0.028 0 0.052 0.006 0.072 0.017s0.035 0.025 0.047 0.042c0.012 0.017 0.022 0.035 0.030 0.055s0.018 0.046 0.031 0.078l0.265 0.654c0.021 0.050 0.031 0.086 0.031 0.108s-0.010 0.045-0.029 0.065c-0.020 0.020-0.043 0.029-0.071 0.029-0.016 0-0.030-0.002-0.042-0.008s-0.021-0.013-0.029-0.023c-0.008-0.010-0.017-0.025-0.025-0.046s-0.017-0.038-0.023-0.054zM10.359 8.11h0.303l-0.152-0.418-0.151 0.418z"></path>
<path fill="#444" d="M11.412 8.073h-0.072v0.326c0 0.043-0.009 0.074-0.028 0.095s-0.043 0.031-0.074 0.031c-0.033 0-0.058-0.011-0.076-0.032s-0.027-0.052-0.027-0.093v-0.78c0-0.044 0.010-0.077 0.030-0.096s0.052-0.030 0.096-0.030h0.334c0.046 0 0.086 0.002 0.118 0.006s0.063 0.012 0.088 0.024c0.032 0.013 0.060 0.032 0.084 0.058s0.043 0.054 0.056 0.087c0.012 0.033 0.019 0.067 0.019 0.105 0 0.076-0.022 0.136-0.064 0.181s-0.107 0.077-0.194 0.096c0.037 0.019 0.072 0.048 0.104 0.086s0.063 0.078 0.089 0.121c0.026 0.043 0.047 0.081 0.061 0.116s0.022 0.058 0.022 0.071c0 0.013-0.004 0.027-0.012 0.040s-0.020 0.023-0.035 0.031c-0.015 0.008-0.032 0.012-0.051 0.012-0.023 0-0.043-0.006-0.058-0.017s-0.029-0.024-0.041-0.041c-0.012-0.017-0.027-0.041-0.046-0.073l-0.082-0.137c-0.029-0.050-0.056-0.088-0.079-0.115s-0.047-0.044-0.071-0.054c-0.024-0.011-0.054-0.016-0.091-0.016zM11.53 7.647h-0.189v0.279h0.184c0.049 0 0.091-0.004 0.124-0.013s0.059-0.023 0.078-0.043c0.017-0.021 0.027-0.049 0.027-0.085 0-0.028-0.008-0.052-0.022-0.074s-0.034-0.037-0.059-0.048c-0.025-0.011-0.072-0.016-0.143-0.016z"></path>
</svg>
