<!-- Generated by IcoMoon.io -->
<svg version="1.1" xmlns="http://www.w3.org/2000/svg" width="16" height="16" viewBox="0 0 16 16">
<title>donated-sold</title>
<path fill="#444" d="M12.096 2.727c-0.053-0.053-0.053-0.16-0.107-0.213-0.373-0.586-1.226-0.853-1.865-0.213-0.16 0.16-0.266 0.32-0.426 0.48-0.053-0.053-0.053-0.107-0.107-0.16-0.266-0.48-0.693-0.799-1.172-0.853-0.533-0.053-1.066-0.16-1.545-0.213-0.053 0-0.107 0.053-0.107 0.107-0.053 0.533-0.107 1.012-0.16 1.492-0.053 0.426-0.053 0.906 0.053 1.279 0 0.107 0.053 0.16 0.107 0.266l-1.599 0.639c-0.107 0.053-0.107 0.16-0.053 0.213l1.012 1.492c0.053 0.107 0.16 0.107 0.266 0.053l1.279-1.119c0.426 0.266 0.959 0.373 1.385 0.426 1.279 0.053 2.398-0.906 2.558-2.185 0.053-0.213 0.053-0.48 0.107-0.639 0.053-0.266 0.16-0.48 0.426-0.586 0.053 0 0.053-0.053 0.107-0.053-0.107-0.107-0.107-0.16-0.16-0.213v0zM7.194 2.247c0 0 0.053-0.053 0.107-0.053 0.16 0 1.119 0.16 1.332 0.266 0.746 0.266 0.799 1.119 0.533 1.492-0.213 0.373-0.533 0.48-0.959 0.48-0.48 0-0.799-0.266-0.959-0.693-0.16-0.48-0.16-1.012-0.053-1.492v0zM7.194 5.604l-0.959 0.799-0.48-0.746 1.119-0.426c0.107 0.107 0.213 0.266 0.32 0.373v0zM11.084 3.526c0 0.266-0.053 0.48-0.107 0.746-0.213 0.853-0.746 1.332-1.545 1.492-0.906 0.213-1.599-0.16-2.078-0.959-0.053-0.107-0.107-0.213-0.16-0.32 0.266 0.107 0.48 0.266 0.693 0.32 0.48 0.16 0.959 0.107 1.279-0.266 0.266-0.266 0.48-0.533 0.586-0.906 0.053-0.213 0.16-0.426 0.213-0.639 0.107-0.266 0.266-0.426 0.533-0.533 0.32-0.16 0.693-0.107 0.959 0.213-0.266 0.266-0.32 0.533-0.373 0.853v0zM10.497 3.1c0 0.107 0.053 0.213 0.16 0.213s0.213-0.053 0.213-0.16c0-0.107-0.053-0.213-0.16-0.213-0.107-0.053-0.213 0.053-0.213 0.16zM10.817 9.707c-0.48-0.053-0.959-0.107-1.385-0.107-1.066 0-2.025-0.32-2.824-0.959v0 0c-0.266-0.16-0.533-0.373-0.746-0.533-0.213-0.107-0.373-0.266-0.586-0.373-0.906-0.639-1.865-0.693-2.931-0.213-0.48 0.213-1.012 0.426-1.492 0.693l-0.853 0.373v0.639c0.107-0.053 0.16-0.053 0.16-0.053l0.959-0.426c0.533-0.213 1.012-0.426 1.492-0.693 0.906-0.373 1.599-0.32 2.345 0.16 0.213 0.16 0.373 0.266 0.586 0.426 0.266 0.16 0.48 0.32 0.746 0.533v0c0.906 0.693 1.972 1.066 3.197 1.066 0.48 0 0.906 0.053 1.332 0.107 0.16 0 0.213 0.107 0.213 0.213 0.053 0.266-0.107 0.32-0.16 0.32-0.266 0.107-0.533 0.16-0.746 0.213h-0.16c-0.906 0-1.758 0.053-2.664 0-0.586-0.053-1.119-0.266-1.652-0.533-0.107-0.053-0.266-0.107-0.48-0.107-0.16 0-0.32 0.107-0.32 0.266s0.107 0.32 0.266 0.32c0.107 0 0.213 0 0.266 0.053 0.639 0.266 1.172 0.533 1.865 0.586 0.426 0.053 0.853 0.053 1.226 0.053 0.48 0 1.012 0 1.439 0h0.16c0.32 0 0.693-0.107 0.959-0.213 0.373-0.16 0.586-0.48 0.533-0.959-0.053-0.586-0.32-0.799-0.746-0.853v0zM15.986 8.748c-0.053-0.266-0.266-0.533-0.586-0.639-0.266-0.107-0.533-0.16-0.799-0.107s-0.48 0.107-0.746 0.213c-0.16-0.32-0.426-0.639-1.066-0.586-0.32 0.053-0.586 0.16-0.853 0.213-0.053 0-0.16 0.053-0.213 0.053-0.373-0.32-0.799-0.426-1.172-0.266-0.533 0.213-1.012 0.48-1.492 0.746-0.213 0.107-0.426 0.213-0.639 0.32-0.16 0.053-0.213 0.266-0.107 0.373 0.053 0.16 0.266 0.213 0.373 0.107 0.213-0.107 0.426-0.213 0.639-0.32 0.48-0.266 0.959-0.533 1.439-0.746 0.32-0.16 0.533 0.107 0.639 0.213 0.053 0.107 0.213 0.107 0.32 0.107 0.16-0.053 0.266-0.107 0.426-0.107 0.266-0.107 0.533-0.16 0.746-0.213 0.266-0.053 0.373 0 0.48 0.426 0 0.053 0.053 0.16 0.16 0.16 0.053 0.053 0.16 0.053 0.213 0 0.107-0.053 0.213-0.053 0.266-0.107 0.213-0.053 0.426-0.16 0.639-0.213 0.107-0.053 0.32 0 0.426 0.053 0.16 0.053 0.213 0.16 0.266 0.266s0 0.213-0.107 0.32-0.32 0.373-0.533 0.48c-0.853 0.533-1.652 1.119-2.451 1.599-1.066 0.693-2.131 1.332-3.197 2.078-0.746 0.48-1.385 0.533-2.185 0.107-0.32-0.16-0.586-0.32-0.906-0.48-0.693-0.32-1.279-0.693-1.972-1.066-0.639-0.16-1.279-0.16-1.865 0.373-0.107 0.107-1.172 0.639-2.131 1.119v0.639c1.705-0.906 2.345-1.226 2.504-1.279 0.426-0.32 0.853-0.373 1.332-0.053 0.639 0.373 1.279 0.693 1.972 1.066 0.32 0.16 0.586 0.32 0.906 0.48 1.012 0.533 1.865 0.48 2.771-0.107 1.066-0.693 2.078-1.385 3.197-2.078 0.853-0.533 1.652-1.119 2.451-1.599 0.266-0.16 0.48-0.373 0.693-0.639 0.107-0.32 0.213-0.639 0.16-0.906v0z"></path>
</svg>
