<!-- Generated by IcoMoon.io -->
<svg version="1.1" xmlns="http://www.w3.org/2000/svg" width="16" height="16" viewBox="0 0 16 16">
<title>incorrect_data</title>
<path fill="#444" d="M6.507 4.96l-1.76 1.76-1.76-1.76-1.387 1.333 1.76 1.76-1.76 1.76 1.333 1.333 1.76-1.76 1.76 1.76 1.333-1.333-1.76-1.76 1.76-1.76-1.28-1.333z"></path>
<path fill="#444" d="M13.6 9.333h-4.32c-0.213 0-0.427 0.213-0.427 0.427s0.213 0.373 0.427 0.373h4.32c0.267 0 0.427-0.213 0.427-0.427s-0.213-0.373-0.427-0.373z"></path>
<path fill="#444" d="M14.933 2.24h-13.867c-0.48 0-1.067 0.267-1.067 1.067v9.44c0 0.48 0.267 1.067 1.067 1.067h13.867c0.427 0 1.067-0.267 1.067-1.067v-9.44c0-0.48-0.267-1.067-1.067-1.067v0zM15.147 12.693c0 0.053 0 0.213-0.213 0.213h-13.867c-0.053 0-0.213 0-0.213-0.213v-9.387c0-0.053 0-0.213 0.213-0.213h13.867c0.053 0 0.213 0 0.213 0.213v9.387z"></path>
<path fill="#444" d="M13.6 5.813h-4.32c-0.213 0-0.427 0.213-0.427 0.427s0.213 0.427 0.427 0.427h4.32c0.267 0 0.427-0.213 0.427-0.427s-0.213-0.427-0.427-0.427z"></path>
<path fill="#444" d="M13.6 7.627h-4.32c-0.213 0-0.427 0.213-0.427 0.427s0.213 0.427 0.427 0.427h4.32c0.267 0 0.427-0.213 0.427-0.427 0-0.267-0.213-0.427-0.427-0.427z"></path>
</svg>
