<!-- Generated by IcoMoon.io -->
<svg version="1.1" xmlns="http://www.w3.org/2000/svg" width="16" height="16" viewBox="0 0 16 16">
<title>tools</title>
<path fill="#444" d="M6.933 9.587c0 0-0.853-0.853-1.76-1.76l-4.533 4.533c-0.853 0.747-0.853 2.080 0 2.933 0.853 0.747 2.187 0.747 2.933 0l3.627-3.627c-0.373-0.587-0.427-1.387-0.267-2.080v0zM2.027 14.76c-0.533 0-1.013-0.48-1.013-1.013s0.48-1.013 1.013-1.013c0.533 0 1.013 0.48 1.013 1.013s-0.427 1.013-1.013 1.013z"></path>
<path fill="#444" d="M15.733 2.653l-2.027 2.027c-0.64 0.64-1.707 0.64-2.4 0-0.64-0.64-0.64-1.707 0-2.293l2.027-2.027c-0.373-0.16-0.853-0.213-1.227-0.213-2.187 0-3.84 1.707-3.84 3.787 0 0.32 0 0.533 0.053 0.853l-0.747 0.747c0.907 0.907 1.867 1.76 1.867 1.76 0.747-0.16 1.547 0 2.24 0.373 0.16 0 0.32 0 0.48 0 2.187 0 3.84-1.707 3.84-3.787-0.053-0.48-0.107-0.853-0.267-1.227v0z"></path>
<path fill="#444" d="M8.48 9.587c-0.373 0.747-0.32 1.76 0.373 2.4l3.307 3.253c0.853 0.747 2.187 0.747 2.933 0 0.853-0.747 0.853-2.080 0-2.933l-3.307-3.147c-0.64-0.64-1.6-0.747-2.4-0.373l-5.173-5.12c0.213-0.48 0.053-1.013-0.48-1.387l-2.293-1.6c-0.16-0.107-0.373-0.107-0.48 0.053l-0.693 0.693c-0.16 0.107-0.16 0.267-0.053 0.427l1.6 2.293c0.373 0.533 1.013 0.64 1.493 0.373l5.173 5.067z"></path>
</svg>
