<!-- Generated by IcoMoon.io -->
<svg version="1.1" xmlns="http://www.w3.org/2000/svg" width="16" height="16" viewBox="0 0 16 16">
<title>adulte</title>
<path fill="#444" d="M12.584 6.028c0.053-0.213 0.267-0.426 0.533-0.373s0.426 0.267 0.373 0.533c-0.053 0.213-0.32 0.426-0.533 0.373s-0.426-0.267-0.373-0.533zM15.996 6.134c-0.053-0.107-0.16-0.16-0.16-0.267-0.053-0.107-0.107-0.16-0.107-0.267-0.053-0.107-0.053-0.16-0.107-0.213-0.32-0.64-0.906-1.173-1.652-1.333s-1.546 0-2.186 0.533c-0.213 0.16-0.426 0.373-0.64 0.586-0.107 0.107-0.16 0.16-0.32 0.32l-0.16 0.16-0.16-0.373c-0.053-0.107-0.053-0.16-0.107-0.213-0.533-1.119-1.279-1.759-2.345-2.026-0.693-0.16-1.386-0.32-2.079-0.533-0.48-0.16-0.906-0.213-1.333-0.373-0.053 0-0.053 0-0.053 0v0.053c-0.107 0.426-0.16 0.8-0.267 1.226-0.16 0.693-0.32 1.386-0.48 2.079-0.16 0.906-0.32 1.866-0.16 2.825 0 0.16 0.053 0.213 0.107 0.373l0.107 0.32-3.731 0.959c0 0-0.213 0-0.16 0.16 0 0 1.652 3.465 1.812 3.625 0.053 0.107 0.107 0.107 0.107 0.107h0.107l3.518-2.292 0.107 0.107c0.586 0.48 1.279 0.853 2.186 1.066v0c0.213 0.053 0.426 0.107 0.64 0.16 2.825 0.533 5.384-1.173 6.077-3.945 0.16-0.533 0.213-1.066 0.373-1.652 0-0.533 0.426-0.959 1.066-1.173v0 0zM5.122 3.576c0.053-0.16 0.267-0.267 0.426-0.213 0.267 0.053 2.612 0.64 2.985 0.853 0.853 0.426 1.173 1.119 1.279 1.599 0.16 0.746 0.053 1.599-0.373 2.132-0.533 0.746-1.279 1.066-2.345 0.906-0.107 0-0.213-0.053-0.32-0.053-0.853-0.213-1.493-0.853-1.759-1.812-0.426-1.279-0.213-2.452 0.107-3.412v0zM2.19 12.797l-1.013-2.079 2.985-0.746 0.053 0.16c0.16 0.32 0.32 0.586 0.533 0.853l0.16 0.16-2.719 1.652zM14.716 5.974c-0.64 0.213-0.8 0.746-0.906 1.386l-0.053 0.267c-0.107 0.48-0.16 0.906-0.32 1.333-0.586 1.866-1.972 2.932-3.998 3.145-0.586 0.053-1.173 0.053-1.652-0.107-1.279-0.32-2.239-1.226-2.825-2.505-0.053-0.16-0.16-0.267-0.16-0.426l-0.32-0.746 0.48 0.267c0.16 0.107 0.32 0.16 0.48 0.267 0.32 0.16 0.586 0.426 0.906 0.533 1.013 0.533 1.972 0.426 2.772-0.16 0.64-0.48 1.173-1.066 1.493-1.759l0.16-0.373c0.16-0.32 0.32-0.64 0.48-0.959 0.267-0.533 0.746-0.906 1.279-1.173 0.8-0.32 1.759 0 2.239 0.693l0.16 0.16-0.213 0.16z"></path>
</svg>
