<!-- Generated by IcoMoon.io -->
<svg version="1.1" xmlns="http://www.w3.org/2000/svg" width="16" height="16" viewBox="0 0 16 16">
<title>coloration</title>
<path fill="#444" d="M15.573 6.88v8.587h-15.147v-8.587h15.147zM16 6.453h-16v9.44h16v-9.44z"></path>
<path fill="#444" d="M9.92 3.627c0 1.067-0.853 1.92-1.92 1.92s-1.92-0.853-1.92-1.92v0c0-1.067 1.92-3.52 1.92-3.52s1.92 2.453 1.92 3.52z"></path>
<path fill="#444" d="M8 7.733v0c-1.867 0-3.413 1.547-3.413 3.413s1.547 3.413 3.413 3.413 3.413-1.547 3.413-3.413v0 0c0-1.867-1.547-3.413-3.413-3.413v0 0zM9.92 9.653l-1.013 1.013c0 0-0.053 0.053-0.107 0.053v0c-0.053 0.053-0.107 0.107-0.16 0.16v0c-0.053 0.053-0.053 0.053-0.107 0.107v0c-0.053 0-0.107 0.053-0.16 0.053v0c-0.053 0-0.107 0-0.16 0.053-0.107 0-0.213 0.053-0.32 0.16v0c-0.053 0.053-0.107 0.107-0.16 0.16v0c0 0.053 0 0.053-0.053 0.107v0 0.16c0 0.107-0.053 0.213-0.107 0.267v0c-0.053 0.107-0.107 0.16-0.16 0.213v0c-0.053 0.053-0.107 0.107-0.213 0.16v0c-0.053 0-0.107 0.053-0.107 0.053-0.053 0-0.107 0.053-0.107 0.053-0.16 0.053-0.32 0.107-0.48 0.16s-0.32 0.16-0.427 0.267v0c-0.107 0.107-0.213 0.267-0.32 0.373v0c0.107-0.16 0.213-0.32 0.32-0.427v0c0.107-0.107 0.267-0.213 0.427-0.32v0c0.16-0.107 0.32-0.107 0.48-0.16 0.053 0 0.053-0.053 0.107-0.053s0.053-0.053 0.107-0.053 0.107-0.107 0.213-0.16v0c0.107-0.107 0.16-0.267 0.16-0.427v0-0.107c0-0.053 0-0.107 0.053-0.16v0c0.053-0.107 0.107-0.16 0.16-0.213v0c0.053-0.053 0.16-0.107 0.213-0.16v0c0.053 0 0.107-0.053 0.107-0.053v0c0.053 0 0.107 0 0.107-0.053 0.053 0 0.107-0.053 0.16-0.107v0c0.053-0.053 0.107-0.107 0.16-0.16v0c0-0.053 0-0.053 0.053-0.107v0l1.013-1.013c0.107-0.053 0.267-0.16 0.427-0.213h0.053c0 0.053-0.053 0.213-0.16 0.373v0 0z"></path>
</svg>
