<!-- Generated by IcoMoon.io -->
<svg version="1.1" xmlns="http://www.w3.org/2000/svg" width="16" height="16" viewBox="0 0 16 16">
<title>info</title>
<path fill="#444" d="M8 0c-4.416 0-8 3.584-8 8s3.584 8 8 8c4.416 0 8-3.584 8-8s-3.584-8-8-8zM8 12c-0.44 0-0.8-0.36-0.8-0.8v-3.2c0-0.44 0.36-0.8 0.8-0.8s0.8 0.36 0.8 0.8v3.2c0 0.44-0.36 0.8-0.8 0.8zM8.8 5.6h-1.6v-1.6h1.6v1.6z"></path>
</svg>
