<!-- Generated by IcoMoon.io -->
<svg version="1.1" xmlns="http://www.w3.org/2000/svg" width="16" height="16" viewBox="0 0 16 16">
<title>HNV</title>
<path fill="#444" d="M15.933 6.671c-0.231-1.44-0.696-2.732-1.358-3.897l0.030 0.057-0.635 0.533-0.373 0.768-1.179-0.544-0.32 2.267-1.429-2.848-1.749 0.837-1.76-0.96c-0.376 1.079-0.601 2.324-0.619 3.619l-0 0.008c0.325 0.055 0.607 0.125 0.88 0.215l-0.043-0.012h-0.043c0.008-1.030 0.153-2.022 0.419-2.964l-0.019 0.079v0.080l1.104 0.661 1.6-0.805 1.915 3.67 0.448-3.093 0.955 0.48 0.485-0.885c0.412 0.824 0.723 1.78 0.883 2.786l0.007 0.057c0.379 2.8-1.035 5.334-3.2 5.605-0.121 0.017-0.262 0.027-0.404 0.027-0.212 0-0.418-0.021-0.618-0.062l0.020 0.003v0.075c0.063 0.035 0.137 0.061 0.214 0.074l0.004 0.001c0.24 0.030 0.447 0.154 0.585 0.334l0.002 0.002c0.076 0.092 0.123 0.211 0.123 0.34 0 0.002-0 0.004-0 0.007v-0 0.037h0.219c2.56-0.352 4.294-3.291 3.856-6.507z"></path>
<path fill="#444" d="M10.621 12.474v-0.032l0.037-0.288c-0.005-0.958-0.177-1.874-0.487-2.723l0.018 0.056v0.059l-0.165-0.315c-0.166-0.276-0.342-0.515-0.538-0.736l0.004 0.005 0.997-1.12c0.036-0.041 0.059-0.095 0.059-0.155v-0c0-0.124-0.1-0.224-0.224-0.224v0c-0.070 0.001-0.132 0.031-0.176 0.080l-0 0-0.971 1.093c-0.133-0.117-0.272-0.24-0.427-0.352l-0.149-0.112 0.603-1.472c0.003-0.013 0.004-0.028 0.004-0.043s-0.002-0.030-0.004-0.044l0 0.001c0-0.124-0.1-0.224-0.224-0.224v0c-0.002-0-0.005-0-0.008-0-0.091 0-0.169 0.057-0.199 0.137l-0 0.001-0.555 1.392c-2.347-1.232-4.55-0.656-6.027 1.243-0.288 0.379-0.437 0.715-0.704 1.093l-0.064 0.091c-0.224 0.373-0.827 0.421-1.419 0.395v0c0 0.091-0.155 3.408 2.784 2.864 0.569-0.12 1.054-0.421 1.405-0.839l0.003-0.004c0.048 0.709 0.165 0.928 0.533 0.923 1.152 0 6.63 0 6.63 0s0.283 0 0.101-0.229-0.72-0.091-0.832-0.533zM8.535 12.762h-3.68c-0.053-0.002-0.096-0.037-0.112-0.084l-0-0.001c-0.061-0.213-0.096-0.457-0.096-0.71 0-0.084 0.004-0.168 0.012-0.25l-0.001 0.011c0.046-0.376 0.271-0.691 0.586-0.861l0.006-0.003 0.085-0.037c0.245-0.078 0.526-0.123 0.818-0.123 0.007 0 0.014 0 0.021 0l-0.001-0c0.768 0.010 1.443 0.397 1.851 0.985l0.005 0.007c0.214 0.272 0.402 0.58 0.549 0.911l0.011 0.028v0.032c0 0.002 0 0.004 0 0.005 0 0.038-0.031 0.069-0.069 0.069-0 0-0 0-0 0h0zM9.986 12.485c-0.009 0.093-0.064 0.172-0.143 0.213l-0.001 0.001c-0.151 0.046-0.325 0.073-0.505 0.073-0.063 0-0.125-0.003-0.186-0.010l0.008 0.001c-0.373-0.987-1.483-3.131-3.957-2.395l-0.181 0.075c-0.425 0.235-0.731 0.64-0.83 1.12l-0.002 0.011c-0.144 0.123-0.293 0.251-0.427 0.379-0.383 0.368-0.879 0.619-1.432 0.697l-0.014 0.002c-1.755 0-1.755-1.877-1.755-1.877h0.181c0.052 0.007 0.113 0.012 0.174 0.012 0.492 0 0.921-0.271 1.145-0.672l0.003-0.007 0.133-0.208c0.229-0.347 0.448-0.651 0.715-0.981 0.696-0.863 1.753-1.41 2.938-1.41 0.478 0 0.934 0.089 1.355 0.251l-0.026-0.009c0.516 0.143 0.968 0.362 1.367 0.649l-0.013-0.009c0.096 0.069 0.187 0.149 0.272 0.224l-0.459 0.533c-0.036 0.039-0.059 0.091-0.059 0.149 0 0 0 0 0 0v-0c0 0 0 0 0 0 0 0.124 0.1 0.224 0.224 0.224 0.002 0 0.004-0 0.006-0l-0 0c0.065-0 0.123-0.027 0.165-0.069l0-0 0.432-0.491c0.528 0.661 0.851 1.505 0.864 2.424l0 0.003c0 0.128 0 0.277 0 0.405v0.704z"></path>
<path fill="#444" d="M2.396 11.199l-0.261 0.101-0.096-0.288c-0.019-0.035-0.056-0.059-0.098-0.059-0.001 0-0.002 0-0.003 0h0c-0.059 0-0.107 0.048-0.107 0.107v0l0.101 0.288-0.331 0.123c-0.044 0.014-0.075 0.054-0.075 0.101v0c-0.001 0.005-0.002 0.010-0.002 0.016s0.001 0.011 0.002 0.016l-0-0c0.007 0.029 0.026 0.053 0.053 0.064l0.001 0h0.101l0.288-0.101 0.096 0.293c0.022 0.034 0.059 0.057 0.101 0.059l0 0c0.060-0.003 0.107-0.052 0.107-0.112 0-0 0-0 0-0v0l-0.101-0.288 0.288-0.096c0.035-0.019 0.059-0.056 0.059-0.098 0-0.001-0-0.002-0-0.003v0c0-0.059-0.048-0.107-0.107-0.107v0z"></path>
</svg>
