<!-- Generated by IcoMoon.io -->
<svg version="1.1" xmlns="http://www.w3.org/2000/svg" width="16" height="16" viewBox="0 0 16 16">
<title>pending_samples</title>
<path fill="#444" d="M13.653 6.613h-4.32c-0.213 0-0.427-0.213-0.427-0.373 0-0.213 0.213-0.427 0.427-0.427h4.32c0.213 0 0.427 0.213 0.427 0.427 0 0.16-0.16 0.373-0.427 0.373v0zM13.653 8.427h-4.32c-0.213 0-0.427-0.213-0.427-0.427s0.213-0.373 0.427-0.373h4.32c0.213 0 0.427 0.213 0.427 0.373s-0.16 0.427-0.427 0.427v0zM13.653 10.133h-4.32c-0.213 0-0.427-0.213-0.427-0.427s0.213-0.427 0.427-0.427h4.32c0.213 0 0.427 0.213 0.427 0.427s-0.16 0.427-0.427 0.427v0zM14.987 13.813h-13.92c-0.8 0-1.067-0.587-1.067-1.067v-9.493c0-0.8 0.587-1.067 1.067-1.067h13.867c0.8 0 1.067 0.587 1.067 1.067v9.493c0 0.8-0.587 1.067-1.013 1.067v0zM1.067 3.093c-0.213 0-0.213 0.107-0.213 0.16v9.493c0 0.213 0.16 0.213 0.213 0.213h13.867c0.213 0 0.213-0.16 0.213-0.213v-9.493c0-0.213-0.16-0.213-0.213-0.213l-13.867 0.053zM7.52 8.32c-0.053-0.16-0.267-0.32-0.427-0.32h-0.48v-2.72c0-0.267-0.267-0.533-0.533-0.533h-2.613c-0.267 0-0.533 0.267-0.533 0.533v2.72h-0.48c-0.213 0-0.427 0.16-0.48 0.32-0.053 0.213 0 0.32 0.16 0.533l2.187 2.187c0.16 0.16 0.267 0.213 0.373 0.213 0.16 0 0.267-0.053 0.427-0.16l2.24-2.187c0.16-0.213 0.213-0.373 0.16-0.587v0zM6.933 8.533l-2.133 2.133c-0.053 0.053-0.107 0.053-0.16 0l-2.133-2.133h0.747c0.107 0 0.213-0.107 0.213-0.213v-2.987h2.56v2.987c0 0.107 0.107 0.213 0.213 0.213h0.693z"></path>
</svg>
