<!-- Generated by IcoMoon.io -->
<svg version="1.1" xmlns="http://www.w3.org/2000/svg" width="16" height="16" viewBox="0 0 16 16">
<title>sensor_import</title>
<path fill="#444" d="M3.771 13.057c0 0.321-0.268 0.642-0.642 0.642s-0.642-0.268-0.642-0.642c0-0.321 0.268-0.642 0.642-0.642s0.642 0.321 0.642 0.642v0zM14.206 10.221h-2.408l-0.963 0.963h3.371c0.268 0 0.482 0.214 0.482 0.482v2.89c0 0.268-0.214 0.482-0.482 0.482h-12.361c-0.268 0-0.482-0.214-0.482-0.482v-2.89c0-0.268 0.214-0.482 0.482-0.482h3.371l-0.963-0.963h-2.408c-0.856 0-1.445 0.642-1.445 1.445v2.89c0 0.856 0.642 1.445 1.445 1.445h12.308c0.856 0 1.445-0.642 1.445-1.445v-2.89c0.054-0.749-0.589-1.445-1.391-1.445v0zM8.052 12.575c-0.268 0-0.535-0.161-0.749-0.321l-4.334-4.334c-0.268-0.268-0.321-0.642-0.214-0.963 0.161-0.321 0.482-0.535 0.856-0.535h0.91v-5.458c0-0.535 0.428-0.963 0.963-0.963h5.137c0.535 0 0.963 0.428 0.963 0.963v5.405h0.963c0.321 0 0.696 0.214 0.856 0.535s0.054 0.749-0.214 0.963l-4.334 4.334c-0.214 0.268-0.535 0.375-0.803 0.375v0zM3.503 7.171l4.334 4.334c0.161 0.161 0.214 0.161 0.321 0l4.334-4.334h-1.819v-6.261c0-0.054-0.054-0.054-0.054-0.054h-5.137c-0.054 0-0.054 0.054-0.054 0.054v6.314l-1.926-0.054zM7.517 4.281c-0.161-0.214-0.428-0.214-0.535-0.161-0.214 0.161-0.214 0.428-0.161 0.535 0.214 0.268 0.268 0.642 0.268 0.91 0 0.428-0.161 0.749-0.428 1.017-0.054 0.054-0.054 0.214-0.054 0.268 0 0.161 0.054 0.214 0.161 0.268s0.161 0.054 0.268 0.054 0.214-0.054 0.321-0.161c0.321-0.428 0.535-1.017 0.535-1.605 0.054-0.214-0.107-0.696-0.375-1.124v0zM8.32 2.89c-0.161-0.161-0.428-0.161-0.535 0-0.054 0.054-0.161 0.214-0.161 0.268 0 0.161 0.054 0.214 0.161 0.268 0.535 0.642 0.91 1.391 0.91 2.194s-0.321 1.659-0.963 2.301c-0.054 0.054-0.161 0.214-0.161 0.268 0 0.161 0.054 0.214 0.161 0.268s0.214 0.161 0.268 0.161c0.161 0 0.214-0.054 0.268-0.161 0.749-0.749 1.177-1.819 1.177-2.836s-0.428-1.926-1.124-2.729v0z"></path>
</svg>
