<!-- Generated by IcoMoon.io -->
<svg version="1.1" xmlns="http://www.w3.org/2000/svg" width="16" height="16" viewBox="0 0 16 16">
<title>to_release</title>
<path fill="#444" d="M11.44 6.187c-0.053-0.053-0.16-0.107-0.267-0.053l-2.293 0.373c-0.16 0.107-0.32 0.267-0.32 0.427 0.053 0.16 0.213 0.267 0.373 0.267l1.387-0.213-1.333 1.44c-0.373-0.213-0.907-0.32-1.333-0.32h-3.893c-1.6 0-2.987 1.333-2.987 2.987v4.907h9.867v-4.907c0-0.907-0.373-1.653-1.013-2.24l1.28-1.333v1.333c0 0.16 0.16 0.32 0.32 0.32v0c0.16 0 0.32-0.16 0.32-0.32v-2.347c0-0.107 0-0.267-0.107-0.32v0zM4.133 10.773v4.427h-2.667v-4.213c0-1.227 1.013-2.24 2.24-2.24h3.893c0.267 0 0.533 0.053 0.853 0.16l-1.333 1.44h-2.613c-0.213 0.053-0.373 0.213-0.373 0.427v0zM6.96 15.2h-2.080v-4.107h2.080v4.107zM9.893 11.093v4.16h-2.187v-4.32l1.44-1.547c0.427 0.427 0.747 1.013 0.747 1.707v0zM13.733 0c0.427 0 0.907 0.213 1.12 0.48 0.053 0.053 0.107 0.213 0.16 0.267s0.107 0.107 0.213 0.213c-0.053 0-0.053 0.053-0.107 0.053-0.267 0.16-0.427 0.373-0.373 0.747 0 0.267 0 0.64 0 0.907 0 1.547-1.173 2.72-2.72 2.827-0.107 0-0.16 0-0.267 0-0.48 0-0.96-0.053-1.387-0.267-0.213-0.107-0.373-0.213-0.533-0.373l-1.653 0.907c0 0 0 0-0.053 0 0 0-0.053 0-0.053-0.053-0.16-0.373-0.907-2.133-0.907-2.133s-0.053-0.107 0-0.107c0-0.053 0.107-0.053 0.107-0.053l1.547-0.267c-0.053-0.32-0.107-0.693-0.107-1.013 0-0.64 0-1.173 0-1.813 0-0.107 0.053-0.107 0.107-0.107v0c0.107 0 0.16 0 0.267 0 0.267 0 0.533 0 0.853 0 0.213 0 0.48 0 0.747 0 0.64 0 1.12 0.32 1.493 0.853 0.053 0.053 0.053 0.107 0.107 0.16 0.107-0.213 0.213-0.373 0.373-0.64 0.267-0.427 0.693-0.587 1.067-0.587v0zM10.907 3.893c-0.107 0-0.267 0-0.427-0.053-0.32-0.053-0.533-0.16-0.853-0.267h-0.053c0.053 0.107 0.107 0.213 0.213 0.267 0.427 0.64 1.067 0.96 1.76 0.96 0.267 0 0.48-0.053 0.8-0.16 0.96-0.32 1.493-1.013 1.6-2.027 0-0.267 0-0.533 0-0.853s0-0.693 0.32-0.907c-0.16-0.16-0.373-0.213-0.64-0.213-0.16 0-0.32 0.053-0.48 0.16-0.213 0.16-0.427 0.373-0.48 0.693-0.053 0.213-0.107 0.48-0.16 0.8-0.107 0.427-0.267 0.8-0.533 1.12-0.32 0.373-0.693 0.48-1.067 0.48v0zM10.587 3.307c0.053 0 0.053 0 0.107 0 0.427-0.053 0.853-0.213 1.013-0.693 0.213-0.533 0-1.44-0.853-1.653-0.213-0.053-0.96-0.107-1.333-0.107-0.107 0-0.213 0-0.267 0s-0.107 0.053-0.107 0.053c0 0.64 0 1.173 0.32 1.653s0.693 0.747 1.12 0.747v0zM8.24 4.853l1.013-0.533c-0.107-0.16-0.213-0.32-0.32-0.533l-1.067 0.16 0.373 0.907zM13.413 1.173c-0.107 0-0.213 0.107-0.213 0.213s0.107 0.213 0.267 0.213c0.107 0 0.213-0.107 0.213-0.213 0-0.16-0.107-0.267-0.267-0.213z"></path>
</svg>
