<!-- Generated by IcoMoon.io -->
<svg version="1.1" xmlns="http://www.w3.org/2000/svg" width="16" height="16" viewBox="0 0 16 16">
<title>localtion</title>
<path fill="#444" d="M8 0c-3.18 0-5.752 2.572-5.752 5.752 0 3.427 3.632 8.152 5.128 9.952 0.329 0.394 0.929 0.394 1.257 0 1.487-1.8 5.12-6.525 5.12-9.952 0-3.18-2.572-5.752-5.752-5.752zM8 7.807c-1.134 0-2.054-0.92-2.054-2.054s0.92-2.054 2.054-2.054c1.134 0 2.054 0.92 2.054 2.054s-0.92 2.054-2.054 2.054z"></path>
</svg>
