<!-- Generated by IcoMoon.io -->
<svg version="1.1" xmlns="http://www.w3.org/2000/svg" width="16" height="16" viewBox="0 0 16 16">
<title>hermaphrodite</title>
<path fill="#444" d="M13.306-0.302l-2.133-0.053c-0.32 0-0.587 0.267-0.533 0.64 0.053 0.267 0.267 0.48 0.533 0.48h0.587l-2.293 2.24c-0.747-0.587-1.653-0.96-2.72-1.013-2.347-0.053-4.32 1.867-4.373 4.267-0.053 2.187 1.6 4 3.68 4.32 0 0 0.053 0 0.053 0v2.56h-1.067c-0.32 0-0.533 0.213-0.533 0.533s0.213 0.533 0.533 0.533h1.067v0.907c0 0.32 0.213 0.533 0.533 0.533s0.533-0.213 0.533-0.533v-0.853h1.067c0.32 0 0.533-0.213 0.533-0.533s-0.213-0.533-0.533-0.533h-1.067v-2.56c2.080-0.267 3.733-2.027 3.787-4.213 0-0.96-0.267-1.813-0.8-2.56l2.293-2.293v0.48c0 0.267 0.16 0.533 0.48 0.587s0.64-0.213 0.64-0.533v-1.973c0.16-0.267-0.053-0.427-0.267-0.427v0zM7.013 9.511c-0.907 0.053-1.76-0.267-2.4-0.853 0 0 0 0-0.053-0.053 0 0-0.053-0.053-0.053-0.053-0.587-0.587-0.907-1.333-0.907-2.24 0-1.76 1.44-3.147 3.147-3.147s3.147 1.44 3.147 3.147c0 1.387-0.907 2.613-2.187 2.987-0.213 0.107-0.48 0.16-0.693 0.213v0z"></path>
</svg>
