<!-- Generated by IcoMoon.io -->
<svg version="1.1" xmlns="http://www.w3.org/2000/svg" width="16" height="16" viewBox="0 0 16 16">
<title>all-sites</title>
<path fill="#444" d="M4.411 3.854c-0.34-0.86-1.164-1.457-2.128-1.457-1.261 0-2.283 1.022-2.283 2.283 0 0 0 0 0 0.001v-0c0 2.192 2.283 5.051 2.283 5.051 0.561-0.72 1.078-1.531 1.517-2.388l0.040-0.086c-0.064-0.326-0.102-0.704-0.107-1.089l-0-0.004c0-0.001 0-0.002 0-0.003 0-0.857 0.253-1.655 0.687-2.323l-0.010 0.017zM2.277 5.796c-0.589 0-1.067-0.478-1.067-1.067s0.478-1.067 1.067-1.067c0.589 0 1.067 0.478 1.067 1.067v0c0 0 0 0 0 0 0 0.587-0.475 1.064-1.061 1.067h-0z"></path>
<path fill="#444" d="M16 4.681c0-0.009 0-0.019 0-0.029 0-1.258-1.020-2.277-2.277-2.277-0.977 0-1.81 0.615-2.134 1.48l-0.005 0.016c0.423 0.646 0.677 1.437 0.683 2.287l0 0.001c-0.003 0.379-0.040 0.748-0.107 1.105l0.006-0.039c0.48 0.952 1.001 1.77 1.593 2.53l-0.025-0.034s2.267-2.848 2.267-5.040zM12.64 4.708c0-0.589 0.478-1.067 1.067-1.067s1.067 0.478 1.067 1.067c0 0.589-0.478 1.067-1.067 1.067v0c-0.589 0-1.067-0.478-1.067-1.067v0z"></path>
<path fill="#444" d="M8 2.761c-1.866 0.006-3.376 1.52-3.376 3.387 0 0.004 0 0.008 0 0.011v-0.001c0 3.248 3.376 7.467 3.376 7.467s3.381-4.229 3.381-7.467c0-0.003 0-0.007 0-0.011 0-1.869-1.513-3.384-3.381-3.387h-0zM8 8.324c-1.178 0-2.133-0.955-2.133-2.133s0.955-2.133 2.133-2.133c1.178 0 2.133 0.955 2.133 2.133v0c0 1.178-0.955 2.133-2.133 2.133v0z"></path>
</svg>
