<!-- Generated by IcoMoon.io -->
<svg version="1.1" xmlns="http://www.w3.org/2000/svg" width="16" height="16" viewBox="0 0 16 16">
<title>logo-position-color</title>
<path fill="#673ab7" d="M15.68 9.441h-1.494c0.053-0.053 0.106-0.214 0.106-0.32v-2.134c0-0.267-0.214-0.427-0.48-0.427h-2.080c-0.267 0-0.48 0.214-0.48 0.427v2.133c0 0.106 0.053 0.267 0.106 0.32h-1.866c0.053-0.053 0.106-0.214 0.106-0.32v-2.133c0-0.267-0.214-0.427-0.48-0.427h-2.080c-0.267 0-0.48 0.214-0.48 0.427v2.133c0 0.106 0.053 0.267 0.106 0.32h-2.081c0.053-0.053 0.053-0.106 0.053-0.267v-1.652c0-0.214-0.214-0.373-0.373-0.373h-1.652c-0.214 0-0.373 0.214-0.373 0.373v1.653c0 0.053 0.053 0.214 0.053 0.267h-1.867c-0.267 0-0.427 0.213-0.427 0.427s0.214 0.427 0.427 0.427h14.986c0.267 0 0.427-0.214 0.427-0.427s0.108-0.427-0.159-0.427v0 0z"></path>
<path fill="#673ab7" d="M13.653 12.053h-1.653c-0.214 0-0.373 0.214-0.373 0.373v1.653c0 0.214 0.214 0.373 0.373 0.373h1.653c0.214 0 0.373-0.214 0.373-0.373v-1.653c0-0.213-0.159-0.373-0.373-0.373z"></path>
<path fill="#673ab7" d="M9.28 11.414h-2.080c-0.267 0-0.48 0.214-0.48 0.427v2.133c0 0.267 0.214 0.427 0.48 0.427h2.080c0.267 0 0.48-0.214 0.48-0.427v-2.133c-0.053-0.267-0.213-0.427-0.48-0.427v0z"></path>
<path fill="#673ab7" d="M4.694 11.414h-2.080c-0.267 0-0.48 0.214-0.48 0.427v2.133c0 0.214 0.214 0.427 0.48 0.427h2.080c0.267 0 0.48-0.214 0.48-0.427v-2.133c0.053-0.267-0.214-0.427-0.48-0.427v0z"></path>
<path fill="#673ab7" d="M15.68 4.533h-1.759c0.267 0 0.427-0.214 0.427-0.427v-2.133c0-0.267-0.214-0.427-0.48-0.427h-2.081c-0.267 0-0.48 0.214-0.48 0.427v2.133c0 0.267 0.214 0.427 0.427 0.427h-2.719c0.214 0 0.373-0.214 0.373-0.373v-1.706c0-0.214-0.214-0.373-0.373-0.373h-1.708c-0.214 0-0.373 0.214-0.373 0.373v1.706c0 0.214 0.214 0.373 0.373 0.373h-2.612c0.267 0 0.427-0.214 0.427-0.427v-2.133c0-0.267-0.214-0.427-0.48-0.427h-2.081c-0.267 0-0.48 0.214-0.48 0.427v2.133c0 0.267 0.214 0.427 0.427 0.427h-1.92c-0.267 0-0.427 0.214-0.427 0.427s0.214 0.427 0.427 0.427h14.986c0.267 0 0.427-0.214 0.427-0.427s-0.052-0.427-0.319-0.427v0 0z"></path>
</svg>
