<!-- Generated by IcoMoon.io -->
<svg version="1.1" xmlns="http://www.w3.org/2000/svg" width="16" height="16" viewBox="0 0 16 16">
<title>return_labo</title>
<path fill="#444" d="M1.739 0.001h4.074c0.008-0 0.018-0.001 0.028-0.001 0.234 0 0.432 0.15 0.504 0.36l0.001 0.004c0.041 0.074 0.065 0.161 0.065 0.255 0 0.16-0.070 0.303-0.181 0.401l-0.001 0.001-0.597 0.581 0.363 0.357c0.111 0.117 0.179 0.276 0.179 0.451s-0.068 0.333-0.18 0.451l0-0-2.101 2.133c-0.116 0.112-0.274 0.181-0.448 0.181s-0.332-0.069-0.448-0.181l0 0-0.363-0.357-0.597 0.64c-0.098 0.113-0.242 0.184-0.403 0.184-0.095 0-0.184-0.025-0.261-0.068l0.003 0.001c-0.211-0.088-0.357-0.294-0.357-0.533 0-0 0-0 0-0v0-4.080c0.002-0.211 0.094-0.401 0.239-0.533l0.001-0.001c0.059-0.176 0.24-0.24 0.48-0.24zM2.576 3.776l0.779 0.779h0.064l2.133-2.096v-0.059l-0.752-0.8 0.96-1.019h-4.080c-0.123 0-0.123 0.059-0.123 0.117v4.101l1.019-1.024z"></path>
<path fill="#444" d="M4.976 6.774c-0.145-0.011-0.273-0.079-0.362-0.181l-0.001-0.001-0.347-0.357c-0.108-0.090-0.18-0.219-0.192-0.366l-0-0.002c0.001-0.147 0.076-0.276 0.19-0.351l0.002-0.001 2.277-2.277c0.095-0.087 0.221-0.14 0.36-0.14s0.265 0.053 0.36 0.14l-0-0 0.357 0.357c0.103 0.090 0.17 0.217 0.181 0.361l0 0.002c0 0.003 0 0.007 0 0.011 0 0.143-0.071 0.269-0.18 0.345l-0.001 0.001-2.288 2.277c-0.077 0.11-0.203 0.181-0.346 0.181-0.004 0-0.008-0-0.011-0l0.001 0zM4.736 5.867l0.24 0.24 2.133-2.133-0.219-0.24-2.133 2.133z"></path>
<path fill="#444" d="M11.568 13.722c1.013-0.61 1.737-1.611 1.969-2.789l0.004-0.027c0.043-0.235 0.068-0.505 0.068-0.78 0-1.151-0.43-2.202-1.138-3l0.004 0.005v-0.059c0.001-0.016 0.001-0.034 0.001-0.052 0-0.496-0.204-0.944-0.534-1.265l-0-0 0.96-0.96 0.299 0.299c0.059 0.064 0.117 0.064 0.181 0.123s0.24 0 0.357-0.123c0.057-0.063 0.093-0.147 0.093-0.24s-0.035-0.177-0.093-0.24l0 0-0.357-0.24 0.597-0.597c0.101-0.089 0.169-0.214 0.181-0.355l0-0.002c0-0.002 0-0.003 0-0.005 0-0.146-0.071-0.276-0.18-0.356l-0.001-0.001-1.392-1.376c-0.095-0.087-0.221-0.14-0.36-0.14s-0.265 0.053-0.36 0.14l0-0-0.603 0.597-0.299-0.299c-0.064-0.054-0.148-0.087-0.24-0.087s-0.176 0.033-0.241 0.088l0.001-0c-0.054 0.064-0.087 0.148-0.087 0.24s0.033 0.176 0.088 0.241l-0-0.001 0.304 0.299-5.274 5.242-1.067 0.176c-0.137 0.025-0.249 0.116-0.303 0.237l-0.001 0.003c-0.014 0.037-0.022 0.081-0.022 0.126 0 0.090 0.033 0.173 0.087 0.237l-0-0.001 2.576 2.635c0.059 0.059 0.117 0.059 0.176 0.123h0.181c0.125-0.054 0.217-0.166 0.24-0.302l0-0.002 0.181-1.067 1.675-1.675c0.323 0.33 0.772 0.534 1.27 0.534 0.019 0 0.037-0 0.056-0.001l-0.003 0c0.176 0 0.357-0.064 0.475-0.064 0.217 0.322 0.347 0.718 0.347 1.145 0 0.148-0.016 0.292-0.045 0.431l0.002-0.014c-0.205 0.967-1.031 1.689-2.033 1.733l-0.005 0h-0.075c-0.005-0.001-0.011-0.001-0.018-0.001-0.088 0-0.16 0.072-0.16 0.16 0 0.008 0.001 0.016 0.002 0.023l-0-0.001v1.259h-5.157c-0.013-0.002-0.028-0.003-0.043-0.003-0.15 0-0.277 0.102-0.314 0.241l-0.001 0.002-0.779 1.467c-0.028 0.054-0.045 0.119-0.045 0.187 0 0.224 0.179 0.406 0.402 0.411h11.445c0.005 0 0.010 0 0.016 0 0.224 0 0.405-0.181 0.405-0.405 0-0.004-0-0.008-0-0.012l0 0.001v-1.499c0-0.003 0-0.007 0-0.011 0-0.227-0.184-0.411-0.411-0.411-0.004 0-0.008 0-0.011 0l0.001-0h-2.992zM12.224 2.278l1.067 1.067-0.416 0.533-1.067-1.067zM7.253 9.408l-1.067-1.067 5.093-5.093 1.067 1.067-1.067 1.067c-0.211-0.064-0.456-0.106-0.708-0.117l-0.006-0c-1.025 0.003-1.855 0.831-1.861 1.855v0.001c0.008 0.239 0.052 0.465 0.127 0.677l-0.005-0.015-1.557 1.6zM9.466 7.131c0.042-0.596 0.536-1.063 1.139-1.063s1.097 0.467 1.138 1.060l0 0.004c-0.020 0.62-0.516 1.118-1.134 1.141l-0.002 0c-0.63 0-1.141-0.511-1.141-1.141v0zM9.888 12.944c1.296-0.309 2.25-1.444 2.277-2.808l0-0.003c-0.015-0.557-0.174-1.073-0.44-1.518l0.008 0.014c0.191-0.168 0.351-0.365 0.474-0.586l0.006-0.011c0.42 0.583 0.672 1.311 0.672 2.098 0 0.001 0 0.002 0 0.004v-0c0 0.008 0 0.018 0 0.028 0 1.766-1.289 3.231-2.977 3.505l-0.020 0.003v-0.725zM14.261 15.28c0 0.002 0 0.003 0 0.005 0 0.032-0.026 0.059-0.059 0.059-0 0-0 0-0 0h-10.469l0.48-0.901 0.053-0.043h9.935c0.032 0 0.059 0.026 0.059 0.059v0 0.837z"></path>
</svg>
