<!-- Generated by IcoMoon.io -->
<svg version="1.1" xmlns="http://www.w3.org/2000/svg" width="16" height="16" viewBox="0 0 16 16">
<title>leftarrow</title>
<path fill="#444" d="M14.973 6.978h-11.469l5.011-5.011c0.4-0.4 0.4-1.058 0-1.458s-1.047-0.4-1.448 0l-6.767 6.767c-0.4 0.4-0.4 1.047 0 1.448l6.767 6.767c0.4 0.4 1.047 0.4 1.448 0s0.4-1.047 0-1.448l-5.011-5.011h11.469c0.565 0 1.027-0.462 1.027-1.027s-0.462-1.027-1.027-1.027z"></path>
</svg>
