<!-- Generated by IcoMoon.io -->
<svg version="1.1" xmlns="http://www.w3.org/2000/svg" width="16" height="16" viewBox="0 0 16 16">
<title>logo-trackmobile</title>
<path fill="#444" d="M11.893 0h-7.787c-0.703 0.009-1.271 0.577-1.28 1.279l-0 0.001v13.44c0.009 0.703 0.577 1.271 1.279 1.28l0.001 0h7.787c0.703-0.009 1.271-0.577 1.28-1.279l0-0.001v-13.44c-0.009-0.703-0.577-1.271-1.279-1.28l-0.001-0zM12.32 13.653h-8.64v-11.307h8.64z"></path>
<path fill="#444" d="M11.776 7.104c-0.034-0.039-0.064-0.083-0.089-0.13l-0.002-0.004c0-0.043-0.064-0.197-0.091-0.24-0.159-0.318-0.443-0.553-0.786-0.643l-0.009-0.002c-0.087-0.020-0.188-0.031-0.291-0.031-0.315 0-0.606 0.106-0.838 0.284l0.003-0.002c-0.107 0.091-0.469 0.475-0.469 0.475l-0.075-0.123c0-0.043 0-0.069-0.043-0.112-0.196-0.474-0.59-0.831-1.076-0.973l-0.012-0.003c-0.331-0.091-0.667-0.155-0.997-0.245-0.197-0.043-0.421-0.091-0.624-0.155-0.043 0.203-0.085 0.379-0.133 0.576-0.064 0.336-0.155 0.667-0.219 1.003-0.066 0.25-0.104 0.537-0.104 0.834 0 0.184 0.015 0.364 0.043 0.54l-0.003-0.019c0.004 0.066 0.020 0.128 0.044 0.185l-0.001-0.004 0.043 0.155-1.776 0.464s-0.112 0-0.069 0.091c0 0 0.8 1.643 0.869 1.733 0.006 0.002 0.014 0.004 0.021 0.004s0.015-0.001 0.022-0.004l-0 0h0.043l1.669-1.067 0.043 0.043c0.3 0.24 0.657 0.424 1.046 0.529l0.020 0.005 0.309 0.064c0.147 0.031 0.315 0.049 0.488 0.049 1.173 0 2.154-0.821 2.4-1.921l0.003-0.016c0.064-0.267 0.107-0.533 0.176-0.779 0.073-0.26 0.274-0.46 0.528-0.532l0.005-0.001zM6.576 5.867c0.031-0.067 0.098-0.113 0.175-0.113 0.008 0 0.016 0 0.023 0.001l-0.001-0c0.575 0.128 1.052 0.265 1.517 0.428l-0.093-0.028c0.31 0.148 0.534 0.432 0.596 0.772l0.001 0.007c0.026 0.095 0.041 0.205 0.041 0.318 0 0.264-0.081 0.508-0.22 0.71l0.003-0.004c-0.195 0.284-0.517 0.467-0.882 0.467-0.080 0-0.159-0.009-0.234-0.026l0.007 0.001c-0.043 0-0.112 0-0.155 0-0.418-0.117-0.739-0.443-0.846-0.856l-0.002-0.008c-0.053-0.205-0.084-0.44-0.084-0.683 0-0.328 0.056-0.644 0.159-0.937l-0.006 0.020zM5.2 10.267l-0.491-1.003 1.424-0.357v0.069c0.067 0.153 0.149 0.285 0.247 0.403l-0.002-0.003 0.064 0.069-1.264 0.821zM11.2 7.040c-0.309 0.112-0.373 0.352-0.421 0.667v0.133c-0.047 0.258-0.101 0.475-0.166 0.687l0.011-0.042c-0.249 0.845-1.004 1.457-1.906 1.488l-0.004 0c-0.039 0.002-0.084 0.004-0.13 0.004-0.237 0-0.466-0.034-0.682-0.098l0.017 0.004c-0.612-0.164-1.102-0.586-1.355-1.139l-0.005-0.013c0-0.064-0.069-0.133-0.091-0.197l-0.155-0.357s1.019 1.131 2.224 0.443c0.304-0.214 0.545-0.498 0.704-0.83l0.006-0.013 0.091-0.181c0.064-0.155 0.155-0.309 0.219-0.464 0.131-0.241 0.336-0.427 0.584-0.53l0.008-0.003c0.087-0.029 0.186-0.045 0.29-0.045 0.31 0 0.586 0.149 0.759 0.379l0.002 0.002 0.064 0.091-0.064 0.016z"></path>
<path fill="#444" d="M10.096 7.029c0.023-0.104 0.115-0.18 0.224-0.18 0.015 0 0.030 0.001 0.044 0.004l-0.001-0c0.104 0.015 0.183 0.104 0.183 0.211 0 0.020-0.003 0.039-0.008 0.057l0-0.002c-0.028 0.104-0.121 0.179-0.232 0.179-0.012 0-0.024-0.001-0.036-0.003l0.001 0c-0.104-0.036-0.177-0.133-0.177-0.247 0-0.007 0-0.014 0.001-0.020l-0 0.001z"></path>
</svg>
