<!-- Generated by IcoMoon.io -->
<svg version="1.1" xmlns="http://www.w3.org/2000/svg" width="16" height="16" viewBox="0 0 16 16">
<title>file_21</title>
<path fill="#444" d="M15.733 6.293h-0.533v-1.76l-5.013-4.533h-9.387v6.293h-0.533v6.827h0.533v2.88h14.347v-2.88h0.533l0.053-6.827zM1.387 0.587h8.213v4.533h5.013v1.173h-13.227v-5.707zM14.613 15.413h-13.227v-2.293h13.227v2.293z"></path>
</svg>
