<!-- Generated by IcoMoon.io -->
<svg version="1.1" xmlns="http://www.w3.org/2000/svg" width="16" height="16" viewBox="0 0 16 16">
<title>affichage_vertical-empty</title>
<path fill="#444" d="M2.827 0.96v14.133h-1.867v-14.133h1.867zM3.787 0h-3.787v16h3.787v-16z"></path>
<path fill="#444" d="M8.96 0.96v14.133h-1.867v-14.133h1.867zM9.867 0h-3.787v16h3.787v-16z"></path>
<path fill="#444" d="M15.040 0.96v14.133h-1.867v-14.133h1.867zM16 0h-3.787v16h3.787v-16z"></path>
</svg>
