<!-- Generated by IcoMoon.io -->
<svg version="1.1" xmlns="http://www.w3.org/2000/svg" width="16" height="16" viewBox="0 0 16 16">
<title>duplicate1</title>
<path fill="#444" d="M10.545 0h-8c-0.8 0-1.455 0.655-1.455 1.455v9.455c0 0.4 0.327 0.727 0.727 0.727s0.727-0.327 0.727-0.727v-8.727c0-0.4 0.327-0.727 0.727-0.727h7.273c0.4 0 0.727-0.327 0.727-0.727s-0.327-0.727-0.727-0.727zM10.975 3.338l3.513 3.513c0.269 0.269 0.422 0.64 0.422 1.025v6.669c0 0.8-0.655 1.455-1.455 1.455h-8.007c-0.8 0-1.447-0.655-1.447-1.455l0.007-10.182c0-0.8 0.647-1.455 1.447-1.455h4.487c0.385 0 0.756 0.153 1.033 0.429zM10.545 8h3.273l-4-4v3.273c0 0.4 0.327 0.727 0.727 0.727z"></path>
</svg>
