<!-- Generated by IcoMoon.io -->
<svg version="1.1" xmlns="http://www.w3.org/2000/svg" width="16" height="16" viewBox="0 0 16 16">
<title>rfid</title>
<path fill="#444" d="M15.5 0.55h-11.15l-3.85 3.95v10.95h15v-1.35l-13.75 0.1v-9.15l3.15-3.4h9.45v10.25h-10.35v-5.8l2-2.050h5.95v3.7h-1.8v-1.55h-4.3v4.3h4.3v-1.5h3.050v-6.3h-7.75l-2.7 2.8v7.55h12.65v-12.5h0.1z"></path>
</svg>
