<!-- Generated by IcoMoon.io -->
<svg version="1.1" xmlns="http://www.w3.org/2000/svg" width="16" height="16" viewBox="0 0 16 16">
<title>logo-repro-mgt-color</title>
<path fill="#df3a50" d="M11.877 5.997v0l-0.161-0.106-0.053-0.053c-0.694-0.588-1.655-0.588-2.348-0.161 0.161 0.373 0.214 0.802 0.267 1.228 0-0.053 0.053-0.053 0.053-0.106 0.373-0.427 0.961-0.481 1.389-0.106l0.106 0.106c0.427 0.373 0.427 1.014 0.053 1.389-0.373 0.427-0.961 0.481-1.389 0.106l-0.161-0.106c-0.053-0.053-0.161-0.161-0.161-0.214-0.106 0.427-0.214 0.802-0.427 1.175v0 0 0c0.855 0.694 2.083 0.588 2.884-0.267 0.748-0.855 0.695-2.083-0.053-2.884v0z"></path>
<path fill="#df3a50" d="M15.722 1.244h-2.456c-0.161 0-0.32 0.161-0.32 0.32v0 0.373c0 0.161 0.161 0.32 0.32 0.32v0h1.014l-1.869 1.87c-1.281-1.014-3.044-1.122-4.433-0.32 0.267 0.214 0.534 0.481 0.748 0.802 1.122-0.534 2.511-0.267 3.364 0.641v0l0.161 0.161c0.053 0.053 0.106 0.053 0.106 0.106 0.053 0.053 0.106 0.053 0.161 0.161 0.161 0.106 0.32 0.161 0.481 0.106l0.534-0.106h0.053l0.267-0.053 0.373 1.122-0.322 0.266h-0.053l-0.427 0.214c-0.161 0.106-0.267 0.267-0.32 0.427-0.053 0.32-0.106 0.534-0.161 0.748-0.053 0.161-0.053 0.373 0.106 0.534l0.214 0.267 0.053 0.053 0.32 0.373-0.855 0.961-0.427-0.214h-0.053l-0.695-0.32-0.106 0.053c-0.214 0.106-0.427 0.161-0.694 0.214-0.214 0.053-0.373 0.161-0.427 0.32l-0.214 0.481-0.106 0.373-1.175-0.214v-0.267l0.053-0.641c0-0.161-0.053-0.32-0.161-0.427-0.053-0.053-0.106-0.106-0.214-0.161v0c0-0.161-0.053-0.161-0.106-0.214l-0.161-0.106c-1.069-0.748-1.442-2.136-0.961-3.364-0.161-0.373-0.427-0.641-0.748-0.908-1.014 1.709-0.588 3.898 1.014 5.127v0l0.106 0.053c0.053 0.053 0.053 0.053 0.106 0.106 0 0 0 0 0.053 0l-0.053 0.908c-0.053 0.373 0.214 0.748 0.641 0.802l1.709 0.32c0.373 0.106 0.748-0.161 0.855-0.481l0.32-0.855c0.106-0.053 0.267-0.053 0.373-0.106l0.694 0.481c0 0 0.053 0 0.053 0.053 0.32 0.161 0.694 0.106 0.961-0.161l1.175-1.336c0.214-0.267 0.267-0.641 0.053-0.961 0 0 0-0.053-0.053-0.053l-0.534-0.694c0.053-0.106 0.053-0.267 0.053-0.373l0.802-0.427c0.32-0.161 0.534-0.588 0.373-0.908l-0.534-1.656c0 0 0 0 0-0.053-0.106-0.267-0.373-0.481-0.641-0.481-0.053 0-0.106 0-0.161 0h-0.048l-0.373 0.053-0.32 0.053 1.762-1.602v1.014c0 0.161 0.161 0.32 0.32 0.32h0.373c0.161 0 0.32-0.161 0.32-0.32v0-2.456c0.053-0.159-0.106-0.32-0.267-0.32v0z"></path>
<path fill="#df3a50" d="M4.506 7.973l-0.106-0.106c-0.427-0.32-0.534-0.908-0.214-1.389s0.961-0.588 1.389-0.267l0.106 0.106c0.053-0.373 0.161-0.748 0.32-1.069-0.961-0.534-2.136-0.267-2.777 0.694s-0.481 2.191 0.427 2.886v0 0c0 0 0.053 0 0.053 0.053l0.161 0.106c0.641 0.373 1.389 0.427 2.083 0.053-0.161-0.373-0.267-0.694-0.32-1.069-0.267 0.216-0.748 0.269-1.122 0.002v0z"></path>
<path fill="#df3a50" d="M8.512 5.142c-0.267-0.481-0.694-0.908-1.122-1.175v0l-0.161-0.106c-0.053-0.053-0.106-0.053-0.161-0.106v0l-0.053-0.908c0-0.373-0.32-0.694-0.748-0.748l-1.709-0.106c-0.373-0.053-0.748 0.214-0.802 0.588l-0.214 0.908c-0.106 0.053-0.267 0.106-0.373 0.161l-0.748-0.427h-0.053c-0.373-0.106-0.748 0-0.961 0.267l-1.014 1.495c-0.214 0.32-0.161 0.694 0.053 0.961 0 0 0 0 0.053 0.053l0.641 0.588c0 0.106 0 0.267-0.053 0.373l-0.748 0.534c-0.32 0.214-0.427 0.641-0.267 0.961l0.748 1.602c0 0 0 0 0 0.053 0.161 0.267 0.427 0.427 0.694 0.427 0.053 0 0.106 0 0.161 0h0.053l0.908-0.373c0.053 0 0.106 0 0.161 0.053l0.053 0.053 0.161 0.106c0.481 0.373 1.069 0.588 1.709 0.641v1.336h-1.175c-0.106 0-0.214 0.106-0.214 0.214v0 0.588c0 0.106 0.106 0.214 0.214 0.214h1.175v1.175c0 0.106 0.106 0.214 0.214 0.214v0h0.588c0.106 0 0.214-0.106 0.214-0.214v0-1.175h1.175c0.106 0 0.214-0.106 0.214-0.214v0-0.588c0-0.106-0.106-0.214-0.214-0.214v0h-1.175v-1.336c0.481-0.053 0.961-0.214 1.442-0.481-0.267-0.267-0.481-0.534-0.694-0.802-0.908 0.43-2.030 0.377-2.831-0.211v0l-0.267-0.267c0 0 0 0-0.053-0.053l-0.159-0.159c-0.106-0.106-0.373-0.053-0.534 0l-0.641 0.214-0.214 0.053-0.481-1.069 0.214-0.161 0.534-0.373c0.161-0.106 0.267-0.267 0.267-0.481 0-0.32 0-0.534 0.053-0.748s0-0.373-0.161-0.534l-0.481-0.427-0.212-0.159 0.694-1.069 0.267 0.106 0.961 0.373 0.106-0.053c0.214-0.106 0.427-0.214 0.641-0.32 0.214-0.053 0.32-0.214 0.373-0.427l0.161-0.694 0.053-0.214 1.175 0.053v0.161l0.053 0.694c0 0.161 0.106 0.32 0.214 0.427 0.053 0.053 0.106 0.053 0.161 0.106 0.053 0 0.053 0.053 0.106 0.053 0.053 0.053 0.106 0.053 0.161 0.106l0.053 0.053c0.053 0 0.053 0.053 0.106 0.053 1.175 0.748 1.602 2.244 1.014 3.472 0.161 0.32 0.427 0.641 0.748 0.855 0.695-1.172 0.695-2.722-0.052-3.95v0z"></path>
</svg>
