<!-- Generated by IcoMoon.io -->
<svg version="1.1" xmlns="http://www.w3.org/2000/svg" width="16" height="16" viewBox="0 0 16 16">
<title>search</title>
<path fill="#444" d="M11.73 10.318h-0.741l-0.263-0.253c1.126-1.313 1.707-3.105 1.388-5.009-0.441-2.608-2.617-4.69-5.243-5.009-3.968-0.488-7.307 2.851-6.819 6.819 0.319 2.626 2.401 4.802 5.009 5.243 1.904 0.319 3.696-0.263 5.009-1.388l0.253 0.263v0.741l3.986 3.986c0.385 0.385 1.013 0.385 1.398 0s0.385-1.013 0-1.398l-3.977-3.996zM6.102 10.318c-2.336 0-4.221-1.885-4.221-4.221s1.885-4.221 4.221-4.221c2.336 0 4.221 1.885 4.221 4.221s-1.885 4.221-4.221 4.221z"></path>
</svg>
