<!-- Generated by IcoMoon.io -->
<svg version="1.1" xmlns="http://www.w3.org/2000/svg" width="16" height="16" viewBox="0 0 16 16">
<title>3</title>
<path fill="#444" d="M13.865 0h-11.731c-1.175 0-2.135 0.96-2.135 2.135v11.731c0 1.175 0.96 2.135 2.135 2.135h11.731c1.175 0 2.135-0.96 2.135-2.135v-11.731c-0.002-1.175-0.96-2.135-2.135-2.135zM14.928 13.865c0 0.587-0.485 1.062-1.062 1.062h-11.731c-0.587 0-1.062-0.485-1.062-1.062v-11.731c0-0.587 0.485-1.062 1.062-1.062l11.731-0.008c0.587 0 1.062 0.485 1.062 1.062v11.738z"></path>
<path fill="#444" d="M9.234 8.056c-0.11-0.11-0.242-0.207-0.402-0.292 0.165-0.137 0.292-0.28 0.38-0.425s0.132-0.32 0.132-0.522c0-0.155-0.030-0.3-0.092-0.432s-0.152-0.252-0.272-0.355c-0.12-0.102-0.262-0.18-0.425-0.232-0.162-0.055-0.342-0.080-0.54-0.080-0.225 0-0.43 0.032-0.612 0.095-0.182 0.065-0.335 0.15-0.46 0.255-0.122 0.105-0.217 0.217-0.28 0.335-0.065 0.117-0.095 0.227-0.095 0.335 0 0.11 0.035 0.197 0.102 0.265s0.142 0.1 0.225 0.1c0.070 0 0.13-0.013 0.182-0.037s0.090-0.057 0.11-0.1c0.035-0.080 0.072-0.162 0.115-0.252s0.085-0.162 0.132-0.22c0.048-0.057 0.11-0.102 0.19-0.137s0.182-0.052 0.307-0.052c0.182 0 0.327 0.057 0.437 0.17 0.107 0.112 0.162 0.247 0.162 0.405 0 0.205-0.067 0.362-0.202 0.472s-0.297 0.165-0.482 0.165h-0.125c-0.145 0-0.252 0.030-0.327 0.090-0.072 0.060-0.11 0.14-0.11 0.237 0 0.1 0.030 0.177 0.092 0.232 0.060 0.055 0.147 0.085 0.26 0.085 0.025 0 0.080-0.005 0.165-0.012s0.147-0.012 0.19-0.012c0.232 0 0.412 0.067 0.542 0.202s0.195 0.322 0.195 0.56c0 0.16-0.037 0.302-0.115 0.425s-0.172 0.215-0.29 0.275c-0.117 0.062-0.237 0.092-0.365 0.092-0.22 0-0.39-0.067-0.51-0.205s-0.235-0.347-0.34-0.63c-0.018-0.047-0.050-0.087-0.105-0.12-0.052-0.033-0.107-0.050-0.165-0.050-0.115 0-0.21 0.035-0.285 0.107-0.077 0.072-0.115 0.167-0.115 0.285 0 0.092 0.032 0.207 0.095 0.347 0.065 0.14 0.157 0.275 0.285 0.407 0.125 0.132 0.285 0.24 0.477 0.327s0.412 0.13 0.655 0.13c0.24 0 0.46-0.037 0.657-0.115s0.37-0.182 0.515-0.317c0.145-0.135 0.255-0.29 0.327-0.462 0.075-0.172 0.112-0.352 0.112-0.537 0-0.155-0.027-0.297-0.082-0.432-0.057-0.135-0.137-0.257-0.247-0.367z"></path>
</svg>
