<!-- Generated by IcoMoon.io -->
<svg version="1.1" xmlns="http://www.w3.org/2000/svg" width="16" height="16" viewBox="0 0 16 16">
<title>less</title>
<path fill="#444" d="M15.999 13.865v-11.731c0-1.175-0.96-2.135-2.135-2.135h-11.731c-1.175 0-2.132 0.96-2.132 2.135v11.731c0 1.175 0.96 2.135 2.135 2.135h11.731c1.172-0.002 2.132-0.96 2.132-2.135v0zM2.133 14.935c-0.587 0-1.062-0.485-1.062-1.062v-11.738c0-0.587 0.485-1.062 1.062-1.062h11.731c0.587 0 1.062 0.485 1.062 1.062v11.731c0 0.587-0.485 1.062-1.062 1.062l-11.731 0.008z"></path>
<path fill="#444" d="M5.27 7.519h5.049c0.255 0 0.462 0.207 0.462 0.462s-0.207 0.462-0.462 0.462h-5.049c-0.255 0-0.462-0.207-0.462-0.462s0.207-0.462 0.462-0.462z"></path>
</svg>
