<!-- Generated by IcoMoon.io -->
<svg version="1.1" xmlns="http://www.w3.org/2000/svg" width="16" height="16" viewBox="0 0 16 16">
<title>clear_early</title>
<path fill="#444" d="M8 0c-3.147 0-5.44 5.44-5.44 9.12 0 3.733 2.4 6.88 5.44 6.88s5.44-3.040 5.44-6.88c0-3.627-2.293-9.12-5.44-9.12v0zM8 15.093c-2.507 0-4.587-2.667-4.587-6.027 0-3.52 2.24-8.267 4.587-8.267s4.587 4.747 4.587 8.267c0 3.36-2.080 6.027-4.587 6.027zM10.773 5.707c-0.16-0.16-0.373-0.16-0.533 0l-0.747 0.747c-0.427-0.32-0.96-0.533-1.547-0.533-1.44 0-2.613 1.173-2.613 2.613 0 0.587 0.213 1.12 0.533 1.547l-0.747 0.747c-0.16 0.16-0.16 0.373 0 0.533 0.053 0.053 0.16 0.107 0.267 0.107s0.213-0.053 0.267-0.107l0.747-0.747c0.427 0.32 0.96 0.533 1.547 0.533 1.44 0 2.613-1.173 2.613-2.613 0-0.587-0.213-1.12-0.533-1.547l0.747-0.747c0.107-0.16 0.107-0.373 0-0.533v0zM6.080 8.533c0-1.013 0.853-1.867 1.867-1.867 0.373 0 0.747 0.107 1.013 0.32l-2.56 2.56c-0.213-0.267-0.32-0.64-0.32-1.013v0zM9.813 8.533c0 1.013-0.853 1.867-1.867 1.867-0.373 0-0.747-0.107-1.013-0.32l2.56-2.56c0.213 0.267 0.32 0.64 0.32 1.013v0z"></path>
</svg>
