<!-- Generated by IcoMoon.io -->
<svg version="1.1" xmlns="http://www.w3.org/2000/svg" width="16" height="16" viewBox="0 0 16 16">
<title>emitters</title>
<path fill="#444" d="M4.5 9.81c-0.75-0.8-1.15-1.9-1.15-3.1 0-0.95 0.25-1.9 0.9-2.75 0.2-0.25 0.55-0.35 0.8-0.15s0.35 0.55 0.15 0.8c-0.4 0.55-0.7 1.3-0.7 2 0 0.8 0.25 1.65 0.8 2.25 0.2 0.25 0.25 0.75 0 0.95-0.2 0.2-0.65 0.15-0.8 0zM10.65 9.76c-0.25-0.2-0.25-0.65-0.050-0.85 0.5-0.6 0.75-1.35 0.75-2.1 0-0.7-0.2-1.35-0.55-1.9-0.2-0.25-0.1-0.65 0.15-0.8s0.55-0.1 0.8 0.15c0.55 0.75 0.8 1.65 0.8 2.6 0 1-0.3 1.9-0.85 2.65-0.2 0.25-0.55 0.4-0.85 0.3-0.1 0.050-0.15 0-0.2-0.050zM2.7 12.060c-1.45-1.45-2.2-3.35-2.2-5.35s0.75-3.9 2.2-5.25c0.2-0.2 0.6-0.25 0.8 0 0.2 0.2 0.25 0.6 0 0.8-1.15 1.15-1.85 2.8-1.85 4.45 0 1.7 0.7 3.3 1.85 4.5 0.2 0.2 0.25 0.65 0.050 0.85-0.25 0.3-0.75 0.1-0.85 0zM12.55 12.060c-0.2-0.2-0.2-0.6 0-0.8 1.25-1.25 1.85-2.8 1.85-4.5 0-1.65-0.6-3.2-1.8-4.4-0.2-0.25-0.2-0.6 0-0.8 0.25-0.2 0.6-0.2 0.8 0 1.4 1.4 2.1 3.25 2.1 5.15 0 2-0.75 3.9-2.2 5.35-0.2 0.15-0.55 0.15-0.75 0zM9.45 6.71c0-0.8-0.7-1.45-1.45-1.45-0.8 0-1.45 0.7-1.45 1.45 0 0.6 0.35 1.1 0.9 1.3v6.1c0 0.35 0.25 0.6 0.6 0.6s0.6-0.25 0.6-0.6v-6.1c0.5-0.2 0.8-0.65 0.8-1.3v0z"></path>
</svg>
