{
  "id": "${KEYCLOAK_REALM_ID}",
  "realm": "${KEYCLOAK_REALM_ID}",
  "enabled": true,
  "accessTokenLifespan": 18000,
  "accessTokenLifespanForImplicitFlow": 54000,
  "roles": {
    "realm": [
      {
        "id": "2dda9c46-56fe-4d6a-b07c-5cd8c86a3fe6",
        "name": "reader",
        "composite": false,
        "clientRole": false,
        "containerId": "${KEYCLOAK_REALM_ID}",
        "attributes": {
          "x-hasura-default-role": ["reader"]
        }
      },
      {
        "id": "2604d8f0-1ea6-4bf4-87a0-617ee80b890a",
        "name": "editor",
        "composite": false,
        "clientRole": false,
        "containerId": "${KEYCLOAK_REALM_ID}",
        "attributes": {
          "x-hasura-default-role": ["editor"]
        }
      },
      {
        "id": "06dc029a-e302-46ea-aa3e-3aa26acc58f6",
        "name": "admin",
        "composite": false,
        "clientRole": false,
        "containerId": "${KEYCLOAK_REALM_ID}",
        "attributes": {
          "x-hasura-default-role": ["admin"]
        }
      }
    ]
  },
  "groups": [
    {
      "id": "820cec5e-fce5-4db6-bd97-4ca69b61b68a",
      "name": "${KEYCLOAK_REALM_ID}",
      "path": "/${KEYCLOAK_REALM_ID}",
      "attributes": {},
      "realmRoles": [],
      "clientRoles": {},
      "subGroups": []
    }
  ],
  "users": [
    {
      "id": "c8c8b8a0-f8f6-4581-b8a7-3a812eb199cb",
      "username": "admin",
      "enabled": true,
      "totp": false,
      "emailVerified": true,
      "firstName": "admin",
      "lastName": "${KEYCLOAK_REALM_ID}",
      "email": "admin@${DOMAIN}",
      "credentials": [
        {
          "id": "1ce640f9-0939-4c37-8e3d-3059553baf80",
          "type": "password",
          "createdDate": 1648583600324,
          "secretData": "{\"value\":\"//CKMtOEmuyDFdKLK/H9lJ7FTIECqHR8bqEbnDCla6OqQCt0bXK9w2SafgsTv10GIdonlxmFDhj/W+mhspyhow==\",\"salt\":\"R0rLiS5ULtB9UnxoEQN1xg==\",\"additionalParameters\":{}}",
          "credentialData": "{\"hashIterations\":27500,\"algorithm\":\"pbkdf2-sha256\",\"additionalParameters\":{}}"
        }
      ],
      "disableableCredentialTypes": [],
      "requiredActions": [],
      "realmRoles": ["admin", "default-roles-${KEYCLOAK_REALM_ID}"],
      "notBefore": 0,
      "groups": ["/${KEYCLOAK_REALM_ID}"]
    },
    {
      "id": "a198864d-2694-44d2-8814-76ef5326881b",
      "username": "reader",
      "enabled": true,
      "totp": false,
      "emailVerified": true,
      "firstName": "reader",
      "lastName": "${KEYCLOAK_REALM_ID}",
      "email": "reader@${DOMAIN}",
      "credentials": [
        {
          "id": "b19b2dbd-2ab8-42c2-873a-81169e2759a8",
          "type": "password",
          "createdDate": 1648583600324,
          "secretData": "{\"value\":\"//CKMtOEmuyDFdKLK/H9lJ7FTIECqHR8bqEbnDCla6OqQCt0bXK9w2SafgsTv10GIdonlxmFDhj/W+mhspyhow==\",\"salt\":\"R0rLiS5ULtB9UnxoEQN1xg==\",\"additionalParameters\":{}}",
          "credentialData": "{\"hashIterations\":27500,\"algorithm\":\"pbkdf2-sha256\",\"additionalParameters\":{}}"
        }
      ],
      "disableableCredentialTypes": [],
      "requiredActions": [],
      "realmRoles": ["reader"],
      "notBefore": 0,
      "groups": ["/${KEYCLOAK_REALM_ID}"]
    }
  ],
  "clients": [
    {
      "id": "6e5e2156-a6f3-42ad-88e7-e78123cb5772",
      "clientId": "${KEYCLOAK_CLIENT_ID}",
      "rootUrl": "",
      "adminUrl": "",
      "surrogateAuthRequired": false,
      "enabled": true,
      "alwaysDisplayInConsole": false,
      "clientAuthenticatorType": "client-secret",
      "secret": "${KEYCLOAK_CLIENT_SECRET}",
      "redirectUris": ["*"],
      "webOrigins": ["/*"],
      "notBefore": 0,
      "bearerOnly": false,
      "consentRequired": false,
      "standardFlowEnabled": true,
      "implicitFlowEnabled": false,
      "directAccessGrantsEnabled": true,
      "serviceAccountsEnabled": true,
      "authorizationServicesEnabled": true,
      "publicClient": false,
      "frontchannelLogout": false,
      "protocol": "openid-connect",
      "attributes": {
        "saml.multivalued.roles": "false",
        "saml.force.post.binding": "false",
        "oauth2.device.authorization.grant.enabled": "false",
        "backchannel.logout.revoke.offline.tokens": "false",
        "saml.server.signature.keyinfo.ext": "false",
        "use.refresh.tokens": "true",
        "oidc.ciba.grant.enabled": "false",
        "backchannel.logout.session.required": "true",
        "client_credentials.use_refresh_token": "false",
        "saml.client.signature": "false",
        "require.pushed.authorization.requests": "false",
        "saml.assertion.signature": "false",
        "id.token.as.detached.signature": "false",
        "saml.encrypt": "false",
        "saml.server.signature": "false",
        "exclude.session.state.from.auth.response": "false",
        "saml.artifact.binding": "false",
        "saml_force_name_id_format": "false",
        "tls.client.certificate.bound.access.tokens": "false",
        "acr.loa.map": "{}",
        "saml.authnstatement": "false",
        "display.on.consent.screen": "false",
        "token.response.type.bearer.lower-case": "false",
        "saml.onetimeuse.condition": "false"
      },
      "authenticationFlowBindingOverrides": {},
      "fullScopeAllowed": true,
      "nodeReRegistrationTimeout": -1,
      "protocolMappers": [
        {
          "id": "0cea66c5-db5b-4a03-b6e4-33ace7e5d56b",
          "name": "Client Host",
          "protocol": "openid-connect",
          "protocolMapper": "oidc-usersessionmodel-note-mapper",
          "consentRequired": false,
          "config": {
            "user.session.note": "clientHost",
            "id.token.claim": "true",
            "access.token.claim": "true",
            "claim.name": "clientHost",
            "jsonType.label": "String"
          }
        },
        {
          "id": "a69d9b4c-83f7-4cee-94aa-2a646a05948b",
          "name": "Client IP Address",
          "protocol": "openid-connect",
          "protocolMapper": "oidc-usersessionmodel-note-mapper",
          "consentRequired": false,
          "config": {
            "user.session.note": "clientAddress",
            "id.token.claim": "true",
            "access.token.claim": "true",
            "claim.name": "clientAddress",
            "jsonType.label": "String"
          }
        },
        {
          "id": "3702e0bc-6595-4a31-b0c8-6f3448459aa9",
          "name": "Client ID",
          "protocol": "openid-connect",
          "protocolMapper": "oidc-usersessionmodel-note-mapper",
          "consentRequired": false,
          "config": {
            "user.session.note": "clientId",
            "id.token.claim": "true",
            "access.token.claim": "true",
            "claim.name": "clientId",
            "jsonType.label": "String"
          }
        },
        {
          "id": "61f626f5-796e-49a2-8a5c-25f81f23b6d6",
          "name": "hasura claim",
          "protocol": "openid-connect",
          "protocolMapper": "script-hasura_claim.js",
          "consentRequired": false,
          "config": {
            "id.token.claim": "true",
            "access.token.claim": "true",
            "userinfo.token.claim": "true"
          }
        }
      ],
      "defaultClientScopes": ["web-origins", "profile", "roles", "email"],
      "optionalClientScopes": [
        "address",
        "phone",
        "offline_access",
        "microprofile-jwt"
      ],
      "authorizationSettings": {
        "allowRemoteResourceManagement": true,
        "policyEnforcementMode": "ENFORCING",
        "resources": [
          {
            "name": "Default Resource",
            "type": "urn:backend:resources:default",
            "ownerManagedAccess": false,
            "attributes": {},
            "_id": "5e7f615d-f7b1-4026-a9c6-b64f4fb2c0f2",
            "uris": ["/*"]
          }
        ],

        "scopes": [],
        "decisionStrategy": "UNANIMOUS"
      }
    }
  ]
}
