{
  "name": "Teacher",
  "base": "PersistedModel",
  "idInjection": true,
  "options": {
    "validateUpsert": true
  },
  "properties": {
    "name": {
      "type": "string",
      "required": true
    },
    "createdAt": {
      "type": "date",
      "defaultFn": "now"
    }
  },
  "validations": [],
  "relations": {
    "blogPosts": {
      "type": "hasMany",
      "model": "BlogPost",
      "foreignKey": ""
    }
  },
  "acls": [],
  "methods": {}
}
