{
  "name": "Content",
  "base": "PersistedModel",
  "idInjection": true,
  "options": {
    "validateUpsert": true
  },
  "properties": {
    "reference": {
      "type": "string",
      "required": true
    }
  },
  "validations": [],
  "relations": {
    "comments": {
      "type": "hasMany",
      "model": "Comment",
      "foreignKey": ""
    }
  },
  "acls": [],
  "methods": {},
  "mixins": {
    "MessageQueue": {
      "consumers": {
        "consumeItems": {
          "queue": "comment.post.write",
          "type": "#"
        }
      }
    }
  }
}
