{
  "loopback-component-explorer": {
    "mountPath": "/explorer",
    "generateOperationScopedModels": true
  },
  "loopback-component-jwt": {
    "fields": [
      "firstname",
      "lastname"
    ]
  }
}
