{
  "name": "Author",
  "base": "PersistedModel",
  "idInjection": true,
  "options": {
    "validateUpsert": true
  },
  "properties": {
    "firstname": {
      "type": "string",
      "required": true
    },
    "lastname": {
      "type": "string",
      "required": true
    },
    "profileImage": {
      "type": "string",
      "default": "url"
    },
    "reference": {
      "type": "string",
      "required": true
    }
  },
  "validations": [],
  "relations": {
    "posts": {
      "type": "hasMany",
      "model": "Post",
      "foreignKey": ""
    }
  },
  "acls": [],
  "methods": {},
  "mixins": {
    "MessageQueue": {
      "consumers": {
        "consumeItems": {
          "queue": "post.user.write",
          "type": "#"
        }
      }
    }
  }
}
