{
  "data": [
    {
      "responsive_id": "",
      "id": 1,
      "avatar": "10-small.png",
      "full_name": "7",
      "post": "Nuclear Power Engineer",
      "email": "TS2021-0319012728",
      "city": "Krasnosilka",
      "start_date": "เงินสด",
      "salary": "17/08/2021",
      "age": "61",
      "experience": "1 Year",
      "status": 1,
      "pattern": "2,099.00",
      "price": "CEO Sesame"
    },
    {
      "responsive_id": "",
      "id": 2,
      "avatar": "1-small.png",
      "full_name": "6",
      "post": "VP Quality Control",
      "email": "TS2021-0319014504",
      "city": "Hinigaran",
      "start_date": "เงินสด",
      "salary": "05/08/2020",
      "age": "63",
      "experience": "3 Years",
      "status": 2,
      "pattern": "2,199.00",
      "price": "CEO Sesame"
    },
    {
      "responsive_id": "",
      "id": 3,
      "avatar": "9-small.png",
      "full_name": "5",
      "post": "Operator",
      "email": "TS2021-0319015353",
      "city": "Golcowa",
      "start_date": "เงินสด",
      "salary": "24/07/2020",
      "age": "66",
      "experience": "6 Years",
      "status": 1,
      "pattern": "13,850.00",
      "price": "CEO Sesame"
    },
    {
      "responsive_id": "",
      "id": 4,
      "avatar": "10-small.png",
      "full_name": "4",
      "post": "Cost Accountant",
      "email": "TS2021-0319015939",
      "city": "Paquera",
      "start_date": "เงินสด",
      "salary": "21/06/2020",
      "age": "22",
      "experience": "2 Years",
      "status": 2,
      "pattern": "13,750.00",
      "price": "CEO Sesame"
    },
    {
      "responsive_id": "",
      "id": 5,
      "avatar": "",
      "full_name": "3",
      "post": "Senior Cost Accountant",
      "email": "TS2021-0917013342",
      "city": "Lucan",
      "start_date": "เงินสด",
      "salary": "20/06/2020",
      "age": "33",
      "experience": "3 Years",
      "status": 1,
      "pattern": "7,775.00",
      "price": "CEO Sesame"
    },
    {
      "responsive_id": "",
      "id": 6,
      "avatar": "",
      "full_name": "2",
      "post": "Geologist",
      "email": "TS2021-0930015115",
      "city": "Maofan",
      "start_date": "เงินสด",
      "salary": "29/04/2020",
      "age": "61",
      "experience": "1 Year",
      "status": 1,
      "pattern": "290,000.00",
      "price": "CEO Sesame"
    },
    {
      "responsive_id": "",
      "id": 7,
      "avatar": "",
      "full_name": "1",
      "post": "Environmental Specialist",
      "email": "TS2021-1001110830",
      "city": "Lampuyang",
      "start_date": "เงินสด",
      "salary": "22/03/2020",
      "age": "59",
      "experience": "9 Years",
      "status": 1,
      "pattern": "288,500.00",
      "price": "CEO Sesame"
    }
  ]
}
