{
  "data": [
    {
      "responsive_id": "",
      "id": 1,
      "avatar": "10-small.png",
      "full_name": "7",
      "post": "Nuclear Power Engineer",
      "email": "150520004285",
      "city": "Krasnosilka",
      "start_date": "28,520",
      "salary": "17/08/2021",
      "age": "61",
      "experience": "1 Year",
      "status": 1,
      "pattern": "ณัฐติชา แสนแก้ว",
      "price": "CEO Sesame"
    },
    {
      "responsive_id": "",
      "id": 2,
      "avatar": "1-small.png",
      "full_name": "6",
      "post": "VP Quality Control",
      "email": "350150052269",
      "city": "Hinigaran",
      "start_date": "32,000",
      "salary": "05/08/2020",
      "age": "63",
      "experience": "3 Years",
      "status": 2,
      "pattern": "สุญาณี แจ้งแสงทอง",
      "price": "CEO Sesame"
    },
    {
      "responsive_id": "",
      "id": 3,
      "avatar": "9-small.png",
      "full_name": "5",
      "post": "Operator",
      "email": "150520009632",
      "city": "Golcowa",
      "start_date": "13,250",
      "salary": "24/07/2020",
      "age": "66",
      "experience": "6 Years",
      "status": 1,
      "pattern": "วรกาญน์ สนชาวไพร",
      "price": "CEO Sesame"
    },
    {
      "responsive_id": "",
      "id": 4,
      "avatar": "10-small.png",
      "full_name": "4",
      "post": "Cost Accountant",
      "email": "350150057928",
      "city": "Paquera",
      "start_date": "7,025",
      "salary": "21/06/2020",
      "age": "22",
      "experience": "2 Years",
      "status": 2,
      "pattern": "เสาว์ลักษณ์ พึ่งศรี",
      "price": "CEO Sesame"
    },
    {
      "responsive_id": "",
      "id": 5,
      "avatar": "",
      "full_name": "3",
      "post": "Senior Cost Accountant",
      "email": "1509970158426",
      "city": "Lucan",
      "start_date": "18,020",
      "salary": "20/06/2020",
      "age": "33",
      "experience": "3 Years",
      "status": 1,
      "pattern": "จีรวิทย์ เหว่ย",
      "price": "CEO Sesame"
    },
    {
      "responsive_id": "",
      "id": 6,
      "avatar": "",
      "full_name": "2",
      "post": "Geologist",
      "email": "1430800053863",
      "city": "Maofan",
      "start_date": "17,250",
      "salary": "29/04/2020",
      "age": "61",
      "experience": "1 Year",
      "status": 1,
      "pattern": "สมใจ สีวนา",
      "price": "CEO Sesame"
    },
    {
      "responsive_id": "",
      "id": 7,
      "avatar": "",
      "full_name": "1",
      "post": "Environmental Specialist",
      "email": "1430800053863",
      "city": "Lampuyang",
      "start_date": "20,526",
      "salary": "22/03/2020",
      "age": "59",
      "experience": "9 Years",
      "status": 1,
      "pattern": "ส้มส้ม วิริยะ",
      "price": "CEO Sesame"
    }
  ]
}
