{
  "data": [
    {
      "responsive_id": "",
      "id": 1,
      "avatar": "10-small.png",
      "full_name": "P2021-0917014641",
      "post": "Nuclear Power Engineer",
      "email": "ทองคำแท่ง",
      "city": "Krasnosilka",
      "start_date": "1 บาท",
      "salary": "17/08/2021",
      "age": "61",
      "experience": "1 Year",
      "status": 3
    },
    {
      "responsive_id": "",
      "id": 2,
      "avatar": "1-small.png",
      "full_name": "P2020-08050338",
      "post": "VP Quality Control",
      "email": "ทองคำแท่ง",
      "city": "Hinigaran",
      "start_date": "1 บาท",
      "salary": "05/08/2020",
      "age": "63",
      "experience": "3 Years",
      "status": 1
    },
    {
      "responsive_id": "",
      "id": 3,
      "avatar": "9-small.png",
      "full_name": "P2020-07240536",
      "post": "Operator",
      "email": "ทองคำแท่ง",
      "city": "Golcowa",
      "start_date": "1 บาท",
      "salary": "24/07/2020",
      "age": "66",
      "experience": "6 Years",
      "status": 2
    },
    {
      "responsive_id": "",
      "id": 4,
      "avatar": "10-small.png",
      "full_name": "P2020-072110250",
      "post": "Cost Accountant",
      "email": "สร้อยคอ",
      "city": "Paquera",
      "start_date": "1 สลึง",
      "salary": "21/06/2020",
      "age": "22",
      "experience": "2 Years",
      "status": 1
    },
    {
      "responsive_id": "",
      "id": 5,
      "avatar": "",
      "full_name": "P2020-07200320",
      "post": "Senior Cost Accountant",
      "email": "สร้อยคอ",
      "city": "Lucan",
      "start_date": "1 สลึง",
      "salary": "20/06/2020",
      "age": "33",
      "experience": "3 Years",
      "status": 1
    },
    {
      "responsive_id": "",
      "id": 6,
      "avatar": "",
      "full_name": "P2020-06290720",
      "post": "Geologist",
      "email": "แหวน",
      "city": "Maofan",
      "start_date": "1 สลึง",
      "salary": "29/04/2020",
      "age": "61",
      "experience": "1 Year",
      "status": 2
    },
    {
      "responsive_id": "",
      "id": 7,
      "avatar": "",
      "full_name": "P2020-06220658",
      "post": "Environmental Specialist",
      "email": "แหวน",
      "city": "Lampuyang",
      "start_date": "1 สลึง",
      "salary": "22/03/2020",
      "age": "59",
      "experience": "9 Years",
      "status": 3
    }
  ]
}
