{
  "data": [
    {
      "responsive_id": "",
      "id": 1,
      "avatar": "10-small.png",
      "full_name": "7",
      "post": "Nuclear Power Engineer",
      "email": "P2021-020204293",
      "city": "Krasnosilka",
      "start_date": "ชิตพล พันธุ์ยานนท์",
      "salary": "17/08/2021",
      "age": "61",
      "experience": "1 Year",
      "status": 1,
      "pattern": "35,000.00",
      "price": 1
    },
    {
      "responsive_id": "",
      "id": 2,
      "avatar": "1-small.png",
      "full_name": "6",
      "post": "VP Quality Control",
      "email": "P2021-020802210",
      "city": "Hinigaran",
      "start_date": "ชิตพล พันธุ์ยานนท์",
      "salary": "05/08/2020",
      "age": "63",
      "experience": "3 Years",
      "status": 2,
      "pattern": "7,200.00",
      "price": 1
    },
    {
      "responsive_id": "",
      "id": 3,
      "avatar": "9-small.png",
      "full_name": "5",
      "post": "Operator",
      "email": "P2021-020802565",
      "city": "Golcowa",
      "start_date": "พรประภา วิเศษนามสกุล",
      "salary": "24/07/2020",
      "age": "66",
      "experience": "6 Years",
      "status": 1,
      "pattern": "26,000.00",
      "price": 1
    },
    {
      "responsive_id": "",
      "id": 4,
      "avatar": "10-small.png",
      "full_name": "4",
      "post": "Cost Accountant",
      "email": "P2021-020909230",
      "city": "Paquera",
      "start_date": "จเร คิมนารักษ์",
      "salary": "21/06/2020",
      "age": "22",
      "experience": "2 Years",
      "status": 2,
      "pattern": "42,000.00",
      "price": 1
    },
    {
      "responsive_id": "",
      "id": 5,
      "avatar": "",
      "full_name": "3",
      "post": "Senior Cost Accountant",
      "email": "P2021-0215041739",
      "city": "Lucan",
      "start_date": "พรประภา วิเศษนามสกุล",
      "salary": "20/06/2020",
      "age": "33",
      "experience": "3 Years",
      "status": 1,
      "pattern": "25,400.00",
      "price": 1
    },
    {
      "responsive_id": "",
      "id": 6,
      "avatar": "",
      "full_name": "2",
      "post": "Geologist",
      "email": "P2021-0917014641",
      "city": "Maofan",
      "start_date": "พรประภา วิเศษนามสกุล",
      "salary": "29/04/2020",
      "age": "61",
      "experience": "1 Year",
      "status": 1,
      "pattern": "10,000.00",
      "price": 1
    },
    {
      "responsive_id": "",
      "id": 7,
      "avatar": "",
      "full_name": "1",
      "post": "Environmental Specialist",
      "email": "P2021-1005050018",
      "city": "Lampuyang",
      "start_date": "พรประภา วิเศษนามสกุล",
      "salary": "22/03/2020",
      "age": "59",
      "experience": "9 Years",
      "status": 1,
      "pattern": "10,000.00",
      "price": 1
    }
  ]
}
