{
  "data": [
    {
      "responsive_id": "",
      "id": 7,
      "avatar": "10-small.png",
      "full_name": "150520002646",
      "post": "Nuclear Power Engineer",
      "email": "150520002646",
      "city": "Krasnosilka",
      "start_date": "ส้มส้ม วิริยะ",
      "salary": "0965222300",
      "age": "61",
      "experience": "1 Year",
      "status": 1
    },
    {
      "responsive_id": "",
      "id": 6,
      "avatar": "1-small.png",
      "full_name": "150520004285",
      "post": "VP Quality Control",
      "email": "150520004285",
      "city": "Hinigaran",
      "start_date": "สมใจ สีวนา",
      "salary": "0852522200",
      "age": "63",
      "experience": "3 Years",
      "status": 1
    },
    {
      "responsive_id": "",
      "id": 4,
      "avatar": "9-small.png",
      "full_name": "350150052269",
      "post": "Operator",
      "email": "350150052269",
      "city": "Golcowa",
      "start_date": "จีรวิทย์ เหว่ย",
      "salary": "0985551234",
      "age": "66",
      "experience": "6 Years",
      "status": 1
    },
    {
      "responsive_id": "",
      "id": 5,
      "avatar": "10-small.png",
      "full_name": "150520009632",
      "post": "Cost Accountant",
      "email": "150520009632",
      "city": "Paquera",
      "start_date": "เสาว์ลักษณ์ พึ่งศรี",
      "salary": "0987564756",
      "age": "22",
      "experience": "2 Years",
      "status": 1
    },
    {
      "responsive_id": "",
      "id": 3,
      "avatar": "",
      "full_name": "350150057928",
      "post": "Senior Cost Accountant",
      "email": "350150057928",
      "city": "Lucan",
      "start_date": "วรกาญน์ สนชาวไพร",
      "salary": "0985551234",
      "age": "33",
      "experience": "3 Years",
      "status": 1
    },
    {
      "responsive_id": "",
      "id": 1,
      "avatar": "",
      "full_name": "1509970158426",
      "post": "Geologist",
      "email": "1509970158426",
      "city": "Maofan",
      "start_date": "สุญาณี แจ้งแสงทอง",
      "salary": "0987564756",
      "age": "61",
      "experience": "1 Year",
      "status": 1
    },
    {
      "responsive_id": "",
      "id": 2,
      "avatar": "",
      "full_name": "1430800053863",
      "post": "Environmental Specialist",
      "email": "1430800053863",
      "city": "Lampuyang",
      "start_date": "ณัฐติชา แสนแก้ว",
      "salary": "0987646563",
      "age": "59",
      "experience": "9 Years",
      "status": 1
    }
  ]
}
