{
  "data": [
    {
      "responsive_id": "",
      "id": 1,
      "avatar": "10-small.png",
      "full_name": "ทอง 99.99%",
      "post": "Nuclear Power Engineer",
      "email": "สร้อยคอ",
      "city": "Krasnosilka",
      "start_date": "1 บาท",
      "salary": "17/08/2021",
      "age": "61",
      "experience": "1 Year",
      "status": 1,
      "pattern": "เกลี้ยง",
      "price": "9,600.00"
    },
    {
      "responsive_id": "",
      "id": 2,
      "avatar": "1-small.png",
      "full_name": "ทอง 96.5%",
      "post": "VP Quality Control",
      "email": "สร้อยคอ",
      "city": "Hinigaran",
      "start_date": "1 บาท",
      "salary": "05/08/2020",
      "age": "63",
      "experience": "3 Years",
      "status": 2,
      "pattern": "มังกรทอง",
      "price": "40,000.00"
    },
    {
      "responsive_id": "",
      "id": 3,
      "avatar": "9-small.png",
      "full_name": "ทอง 90%",
      "post": "Operator",
      "email": "ไม่ระบุ",
      "city": "Golcowa",
      "start_date": "1 บาท",
      "salary": "24/07/2020",
      "age": "66",
      "experience": "6 Years",
      "status": 1,
      "pattern": "หัวใจโปร่ง",
      "price": "7,200.00"
    },
    {
      "responsive_id": "",
      "id": 4,
      "avatar": "10-small.png",
      "full_name": "ทอง 99.99%",
      "post": "Cost Accountant",
      "email": "ไม่ระบุ",
      "city": "Paquera",
      "start_date": "1 สลึง",
      "salary": "21/06/2020",
      "age": "22",
      "experience": "2 Years",
      "status": 2,
      "pattern": "วัดเจดีย์",
      "price": "9,600.00"
    },
    {
      "responsive_id": "",
      "id": 5,
      "avatar": "",
      "full_name": "ทอง 96.5%",
      "post": "Senior Cost Accountant",
      "email": "ทองคำแท่ง",
      "city": "Lucan",
      "start_date": "1 สลึง",
      "salary": "20/06/2020",
      "age": "33",
      "experience": "3 Years",
      "status": 1,
      "pattern": "ปีกนก",
      "price": "4,740.00"
    },
    {
      "responsive_id": "",
      "id": 6,
      "avatar": "",
      "full_name": "ทอง 96.5%",
      "post": "Geologist",
      "email": "แหวน",
      "city": "Maofan",
      "start_date": "1 สลึง",
      "salary": "29/04/2020",
      "age": "61",
      "experience": "1 Year",
      "status": 1,
      "pattern": "ลายปอกมีด",
      "price": "20,000.00"
    },
    {
      "responsive_id": "",
      "id": 7,
      "avatar": "",
      "full_name": "ทอง 96.5%",
      "post": "Environmental Specialist",
      "email": "แหวน",
      "city": "Lampuyang",
      "start_date": "1 สลึง",
      "salary": "22/03/2020",
      "age": "59",
      "experience": "9 Years",
      "status": 1,
      "pattern": "พิกุลครึ่งวง",
      "price": "4,740.00"
    }
  ]
}
