{
  "data": [
    {
      "responsive_id": "",
      "id": 1,
      "avatar": "10-small.png",
      "full_name": "About To Sleep",
      "post": "Need Attention",
      "email": "80",
      "city": "Krasnosilka",
      "start_date": "01/02/2021 - 28/02/2021",
      "salary": "142,500",
      "age": "61",
      "experience": "1 Year",
      "status": 1
    },
    {
      "responsive_id": "",
      "id": 2,
      "avatar": "1-small.png",
      "full_name": "At Risk",
      "post": "Cannot Lose Them",
      "email": "10",
      "city": "Hinigaran",
      "start_date": "01/02/2021 - 28/02/2021",
      "salary": "142,500",
      "age": "63",
      "experience": "3 Years",
      "status": 1
    },
    {
      "responsive_id": "",
      "id": 3,
      "avatar": "9-small.png",
      "full_name": "Cannot Lose Them",
      "post": "Champions",
      "email": "30",
      "city": "Golcowa",
      "start_date": "31/01/2021 - 28/02/2021",
      "salary": "142,500",
      "age": "66",
      "experience": "6 Years",
      "status": 1
    },
    {
      "responsive_id": "",
      "id": 4,
      "avatar": "10-small.png",
      "full_name": "Champions",
      "post": "At Risk",
      "email": "40",
      "city": "Paquera",
      "start_date": "01/01/2021 - 31/01/2021",
      "salary": "142,500",
      "age": "22",
      "experience": "2 Years",
      "status": 1
    },
    {
      "responsive_id": "",
      "id": 5,
      "avatar": "",
      "full_name": "Hibernating",
      "post": "At Risk",
      "email": "50",
      "city": "Lucan",
      "start_date": "21/01/2021 - 21/02/2021",
      "salary": "142,500",
      "age": "33",
      "experience": "3 Years",
      "status": 1
    },
    {
      "responsive_id": "",
      "id": 6,
      "avatar": "",
      "full_name": "Loyal Customers",
      "post": "About To Sleep",
      "email": "100",
      "city": "Maofan",
      "start_date": "01/01/2021 - 28/02/2021",
      "salary": "142,500",
      "age": "61",
      "experience": "1 Year",
      "status": 1
    },
    {
      "responsive_id": "",
      "id": 7,
      "avatar": "",
      "full_name": "Need Attention",
      "post": "Cannot Lose Them",
      "email": "140",
      "city": "Lampuyang",
      "start_date": "01/01/2021 - 31/01/2021",
      "salary": "142,500",
      "age": "59",
      "experience": "9 Years",
      "status": 1
    },
      {
          "responsive_id": "",
          "id": 8,
          "avatar": "",
          "full_name": "New Customers",
          "post": "Cannot Lose Them",
          "email": "170",
          "city": "Lampuyang",
          "start_date": "01/01/2021 - 31/01/2021",
          "salary": "142,500",
          "age": "59",
          "experience": "9 Years",
          "status": 1
      },
      {
          "responsive_id": "",
          "id": 9,
          "avatar": "",
          "full_name": "Potential",
          "post": "Cannot Lose Them",
          "email": "200",
          "city": "Lampuyang",
          "start_date": "01/01/2021 - 31/01/2021",
          "salary": "142,500",
          "age": "59",
          "experience": "9 Years",
          "status": 1
      },
      {
          "responsive_id": "",
          "id": 10,
          "avatar": "",
          "full_name": "Promising",
          "post": "Cannot Lose Them",
          "email": "210",
          "city": "Lampuyang",
          "start_date": "01/01/2021 - 31/01/2021",
          "salary": "142,500",
          "age": "59",
          "experience": "9 Years",
          "status": 1
      },
      {
          "responsive_id": "",
          "id": 10,
          "avatar": "",
          "full_name": "Unknow",
          "post": "Cannot Lose Them",
          "email": "5",
          "city": "Lampuyang",
          "start_date": "01/01/2021 - 31/01/2021",
          "salary": "142,500",
          "age": "59",
          "experience": "9 Years",
          "status": 1
      }
  ]
}
