94

8
Xx1GNsJL-47356143
m5SbHhkQ-96840874
DQBAb38z-13978400
9_fQSQJy-17192485
gfbljjlB-69281194
Ae2OKaba-26297477
qM9ilTcC-13586255
34YqA7yI-58238877
7 5 6 8 4 1 2 3
6 2 1 8 7 4 3 5
2 6 5 7 4 3 1 8
1 4 6 3 2 7 8 5
6 2 5 1 7 8 4 3
7 8 2 3 4 6 1 5

18
P1v0LTHm-03657999
vIprrunC-17645234
1HzFtTXY-28095124
BrRAjC1o-49215126
NwatgB__-33563897
yZEcXBYL-22604239
dhdYpIEc-07904425
cA4OI9V9-00408501
_hyPgfHK-85252100
Hxstujh0-45735666
ZyNz0x9y-38195493
FJi6RJuf-95662574
Y3n7yQFc-25162614
0OUeO9zl-13393875
WVmuPESO-64586336
4X3Oe2Yy-92738648
BA9Fz8zL-40634296
3v0RbSsd-03341938
12 18 16 15 2 10 11 17 4 6 13 1 7 3 8 9 5 14
6 15 18 8 16 1 7 9 12 10 5 14 13 11 2 3 17 4
6 12 16 7 10 15 14 11 9 3 18 4 13 2 17 8 1 5
9 17 11 3 18 10 2 6 16 4 12 14 7 5 1 8 15 13
9 10 11 16 6 13 4 7 15 2 8 12 17 3 5 18 14 1
5 4 14 1 16 13 8 10 17 11 2 7 6 15 9 3 12 18
3 15 18 13 5 6 4 14 16 1 10 12 7 11 9 2 17 8
1 2 10 12 8 6 7 11 9 3 5 4 13 14 16 15 17 18
1 5 3 15 17 6 7 8 9 10 11 12 13 14 4 16 2 18
17 2 12 9 10 5 1 8 4 6 13 3 11 14 15 16 7 18
18 5 14 1 12 10 15 7 2 6 4 13 17 16 9 3 8 11
14 5 8 16 7 4 17 15 13 11 2 12 10 9 18 1 3 6
15 3 12 9 17 1 4 18 11 13 5 2 7 14 16 10 6 8
2 1 3 4 12 15 9 8 11 10 7 5 13 6 14 16 17 18
3 13 18 8 4 6 17 9 7 2 10 15 14 5 12 1 16 11
12 16 9 3 4 6 2 18 11 7 14 5 13 1 15 8 17 10
7 1 16 13 14 2 15 4 8 10 3 17 11 9 12 6 5 18
1 17 8 5 7 15 3 18 9 4 16 11 13 6 14 12 2 10
14 17 13 8 5 3 12 18 6 4 7 11 16 1 10 9 2 15
14 5 12 18 16 13 4 6 10 17 11 2 9 1 8 3 15 7
1 7 2 16 5 6 3 11 15 18 12 10 13 14 9 4 8 17
6 13 15 12 14 10 9 18 8 1 2 16 17 5 3 7 11 4
4 1 14 13 8 11 2 15 16 7 10 18 12 17 9 5 6 3
6 15 9 8 14 3 1 13 4 18 11 5 12 7 10 16 17 2
1 11 8 5 18 7 3 13 9 4 6 17 10 14 2 12 16 15
3 12 8 4 17 13 2 11 15 14 16 18 1 10 9 5 7 6
2 4 13 7 17 6 11 8 15 9 10 16 18 3 1 12 5 14
14 10 3 16 6 9 13 8 15 11 17 12 5 18 4 7 2 1
16 10 3 4 5 1 6 8 2 9 7 12 13 14 15 11 17 18
1 14 3 7 9 15 17 6 10 2 13 16 18 5 12 11 8 4
2 8 9 1 10 18 5 4 7 15 6 16 13 3 12 14 17 11
1 2 3 4 18 6 7 8 9 13 11 12 10 14 15 16 17 5
1 2 5 4 13 6 16 10 9 18 17 8 7 14 15 3 11 12
15 11 7 6 5 18 13 17 4 16 2 8 12 1 3 14 10 9
15 18 12 8 11 10 7 9 17 6 16 4 2 13 14 5 3 1
18 11 10 3 12 1 16 15 5 9 8 4 2 13 14 17 7 6
15 9 17 13 16 14 5 7 10 1 3 2 4 8 12 11 6 18
1 4 18 2 6 13 15 8 9 12 11 10 7 14 5 17 16 3
10 7 13 18 12 17 11 3 4 16 1 8 2 6 5 15 14 9
6 7 10 15 18 3 17 16 9 5 14 1 11 2 13 12 8 4
12 3 10 5 7 17 8 6 15 18 2 4 16 14 11 1 13 9
16 13 2 1 10 8 17 18 9 15 11 14 12 4 3 6 7 5

6
0FpmDSoN-28240707
ByeVdUeq-49578142
iuPrOChX-95127146
hWqe_Wed-99493342
bzMjXsOp-51585368
Dov_4Ytg-33923607
3 2 5 1 6 4
2 5 3 6 4 1
4 2 1 3 5 6
1 2 5 3 4 6
3 6 5 2 4 1
5 2 6 3 4 1
4 3 1 5 6 2
1 6 2 4 3 5
1 5 2 6 3 4
1 4 2 3 6 5
1 5 4 2 6 3
4 6 5 3 1 2
3 5 1 6 2 4
1 5 3 4 2 6
5 2 4 3 6 1
2 5 4 3 1 6
4 3 6 2 5 1
1 6 2 4 3 5
1 6 4 3 2 5
4 1 3 2 5 6
6 1 4 5 3 2
5 3 4 2 1 6
2 6 5 1 4 3
3 1 4 5 2 6
6 5 2 1 4 3
6 3 5 4 1 2
3 4 5 1 2 6
4 3 1 6 5 2
3 2 5 6 4 1
1 4 5 6 3 2
6 1 5 4 3 2
6 1 3 4 5 2
1 2 3 4 5 6

2
VN8WdFnt-75019604
RDxubd20-70234266
1 2
1 2
2 1
2 1
1 2
1 2
2 1
2 1
1 2
2 1
1 2
2 1
1 2
1 2
2 1
1 2
1 2
1 2
2 1
2 1
2 1
1 2
1 2
2 1
2 1
1 2
2 1

5
553nyTBu-46429693
cMFSqJme-28580736
1tHlaL7Z-18701887
tyvH1cAe-90681927
sq5FhMNG-03213613
5 3 4 1 2
3 5 2 1 4
3 1 4 2 5

12
6pUGQuET-67767439
X9FASHwP-01778849
8Q9ee5I1-59282302
CjRTlzGe-32844743
7n6sdS5T-68945489
AwJ_lpFZ-74492120
wy5D1Vw4-07277956
amjfvhfE-85118606
KbrZ3uCN-05083286
pTf72IdG-40393939
j0NuEQVR-45704668
KLIdguoJ-40766817
10 2 6 1 9 4 7 3 8 5 12 11
4 5 3 2 12 1 6 8 9 10 7 11

15
peoZh3dj-99733280
HtU3BGUp-63441885
onAAw_mv-89192386
TFf2L9iQ-97995735
Z7y8IdP4-48318132
Uz2VP0Vv-67470503
DIRK1Cy2-06160287
caLhJeGn-61579576
K_IzRHbY-73202248
vjWZdzZN-12125196
bWPyaYPj-69019563
zQQ5Hdlc-99080997
T0AF1ACy-17099049
F8XlnzIX-24320369
obRSJ2lW-00915302
1 2 3 4 5 6 7 8 9 10 11 12 13 15 14
10 9 1 13 15 7 14 5 2 8 11 12 6 3 4
5 10 14 8 3 1 15 12 7 13 4 9 2 6 11
1 2 3 4 5 6 7 8 9 10 11 12 13 14 15
15 8 9 5 10 4 12 13 3 14 2 1 6 11 7
1 11 13 2 5 3 15 10 6 12 9 7 4 8 14
8 5 2 12 1 10 9 3 15 14 4 7 6 13 11
1 2 5 10 15 12 3 8 7 4 11 9 14 13 6
1 2 5 11 3 6 7 8 9 13 12 4 10 14 15

6
MzL1xkNT-55978636
88irth8D-14770082
9iMq5D8f-11570453
DaWT9WFI-39584882
qeaiZWL6-74544789
W39fvrBZ-34824531
5 3 4 1 6 2
6 1 3 2 4 5
3 5 1 4 2 6
6 3 2 5 4 1
1 6 2 5 3 4
1 4 3 2 5 6
1 5 3 4 2 6
6 2 3 1 4 5
5 4 2 6 1 3
5 6 1 4 3 2
4 5 6 3 2 1
1 3 2 4 5 6
3 1 4 5 6 2
5 3 6 4 2 1
4 5 2 1 6 3
1 2 4 6 3 5
1 6 3 4 2 5
5 1 2 4 6 3
2 3 6 1 4 5
6 4 5 3 1 2
1 4 3 5 6 2
5 2 3 6 4 1
5 3 2 4 6 1
6 1 3 5 4 2
3 4 6 2 1 5
2 1 6 4 3 5
2 1 3 5 6 4
3 4 5 2 6 1
1 3 5 4 6 2
1 3 6 4 5 2
5 2 3 6 4 1
4 1 3 6 5 2
3 5 4 1 2 6

16
4HOsJiCd-40292976
kxrWFIJS-60735579
ziaqJvBK-15862420
AFLfXwm2-96792406
_uXJb4bc-56999857
oC7uI23X-87280517
MjyqBIer-41572844
uhvEpNth-13475530
N7ubSSFd-20328456
Oub8jYsY-92532336
HyS8BQLO-84563954
s28aTKYN-49281230
I9fWkvBh-83289882
qAdLU8GU-84799377
DZLZECPm-63583433
i6y1vVg5-55520435
8 2 12 5 14 3 7 6 10 4 11 15 1 16 13 9
8 7 12 11 3 14 4 1 2 13 5 9 16 10 6 15
13 16 11 4 12 6 3 2 9 8 1 14 10 7 5 15
7 8 1 2 10 13 6 16 12 4 3 5 14 15 9 11
2 4 1 12 13 8 9 15 6 5 3 11 10 7 14 16
14 16 4 5 13 7 8 3 9 10 11 15 6 12 2 1
10 14 8 4 12 5 9 7 2 15 6 13 11 3 1 16
8 3 16 5 12 14 13 4 11 2 9 15 7 1 10 6
9 1 10 4 15 7 8 13 14 6 2 16 5 12 3 11
11 16 15 10 5 12 1 8 3 7 6 4 13 2 9 14
3 5 12 15 9 11 7 6 13 14 1 8 16 4 10 2
11 7 2 4 8 6 16 14 9 10 1 12 15 13 5 3
16 10 9 11 2 15 8 1 13 3 7 12 6 4 14 5
15 5 1 7 13 3 11 12 16 2 10 14 9 4 6 8
12 2 7 9 4 8 1 3 13 6 5 16 14 15 11 10
9 6 8 4 3 16 10 15 11 7 12 1 13 14 5 2
6 5 3 4 2 13 7 8 11 10 14 12 1 9 15 16
3 9 1 5 14 2 11 12 13 10 4 7 6 16 8 15
11 12 16 1 9 10 7 5 4 3 13 15 8 14 2 6
5 12 7 4 1 16 3 13 11 2 14 6 8 10 15 9
9 1 3 6 16 14 5 7 13 8 11 12 4 10 15 2
3 10 1 14 8 4 9 12 2 15 5 13 7 6 16 11
13 15 8 7 1 4 11 10 5 6 9 16 2 12 14 3
3 14 6 4 8 15 5 2 1 9 11 13 7 16 10 12
3 13 16 8 14 1 7 4 10 9 11 12 5 2 6 15
4 13 5 11 9 16 15 3 12 10 6 14 7 1 2 8
13 6 1 4 14 16 12 9 7 3 11 8 10 15 2 5
12 14 15 8 1 9 7 10 11 13 2 16 3 6 4 5
6 16 1 2 11 7 12 13 10 4 3 15 14 8 5 9
1 4 3 13 5 6 7 8 9 10 11 12 2 14 15 16
14 13 9 10 2 15 16 1 8 7 12 6 4 3 11 5
9 7 1 14 16 3 8 10 11 2 6 13 5 4 12 15
8 7 15 9 13 16 6 1 12 4 10 5 3 14 2 11
14 10 2 4 12 9 13 3 1 8 7 5 6 16 15 11
10 2 3 4 8 6 9 5 11 1 7 16 14 13 15 12
3 1 14 9 11 5 12 2 15 6 8 4 13 16 10 7
15 4 5 16 13 1 3 7 12 6 11 14 8 2 9 10
7 5 2 13 16 9 14 12 4 6 15 3 10 8 1 11
7 2 3 4 5 10 13 1 9 12 11 6 8 14 15 16
4 15 14 5 2 6 12 10 8 7 16 13 3 1 11 9
9 16 11 1 7 12 14 8 15 2 6 10 5 13 3 4
11 16 13 7 2 3 8 1 4 9 5 6 10 12 14 15
9 13 10 1 5 15 6 4 11 14 2 8 7 3 12 16
1 2 3 4 5 6 14 8 9 10 11 12 13 7 15 16
2 6 3 4 15 1 7 11 16 14 9 12 5 10 8 13
16 5 4 12 8 10 15 14 9 6 11 1 3 2 7 13
4 15 1 10 13 16 6 11 9 5 8 2 3 14 12 7
13 10 8 15 5 1 6 11 14 16 12 4 9 2 3 7

14
NiuZGUpH-40756066
li_IVOnn-97003991
mRQaXOE7-44692719
109wRyUz-57347597
H9yvEFZ2-97090672
ddm7g7aM-29443790
fe59y7FE-72056151
LrCM12Kz-61034817
mZKXKYeQ-24955492
abitA1F9-05311218
8F2guLVU-37217634
piSsaB_1-04883977
qOGZxLh8-69825492
0UZHK1tJ-01100230
1 2 3 14 5 6 7 8 9 12 11 10 13 4
2 7 9 5 8 3 13 6 11 12 14 4 1 10
14 10 4 11 9 8 1 6 2 5 13 7 12 3
2 10 5 14 12 1 11 6 3 4 8 13 9 7
14 6 1 3 13 11 12 7 9 2 10 8 4 5
14 4 6 11 8 12 7 5 9 1 2 3 10 13
5 11 1 8 6 4 13 9 2 14 3 10 12 7
13 14 10 12 3 8 11 2 9 4 6 5 7 1
11 12 3 4 5 14 7 10 13 6 1 9 2 8
14 9 3 1 2 12 8 10 4 13 5 11 6 7
13 1 12 10 2 5 7 9 4 6 11 14 3 8
1 7 3 4 5 6 13 8 9 14 11 12 10 2
9 7 5 4 14 12 1 6 11 13 10 2 8 3
1 14 11 4 10 8 9 7 3 12 2 6 5 13
13 11 14 12 3 8 5 6 10 1 2 4 7 9
14 11 13 4 8 9 6 5 2 7 10 1 3 12
13 12 1 3 4 7 8 5 9 11 2 14 6 10
10 12 11 13 1 8 3 2 4 5 9 6 14 7
1 12 2 3 14 9 10 7 8 11 5 4 6 13
9 8 10 2 3 7 11 6 13 5 12 14 1 4
5 12 10 9 8 4 11 3 7 6 13 1 14 2
5 8 4 13 3 11 10 1 7 6 12 2 14 9
13 11 10 6 5 8 14 7 12 1 2 3 4 9
12 4 5 1 3 7 9 14 6 13 11 10 8 2
1 2 3 4 5 6 7 13 11 10 9 12 8 14
12 2 3 7 1 13 9 14 6 10 8 4 5 11
9 7 1 2 3 14 12 6 13 8 11 4 5 10
13 3 10 4 1 9 14 8 6 2 12 5 11 7
4 2 1 5 8 7 6 11 10 12 3 13 14 9
2 8 6 5 10 13 12 11 4 7 14 1 3 9
1 2 3 7 9 6 4 13 5 10 11 12 8 14
6 2 10 5 9 14 11 1 7 8 3 4 12 13
4 2 6 11 7 1 3 10 5 9 12 13 8 14
12 14 4 7 1 3 13 10 6 2 8 11 9 5
13 7 12 10 3 5 1 2 11 4 9 14 8 6
1 2 11 7 4 9 6 13 3 14 5 12 10 8
3 2 4 12 8 11 1 7 14 6 5 9 13 10
11 6 1 12 4 7 10 2 14 9 8 13 5 3
10 6 12 4 11 3 2 5 9 1 7 8 14 13
8 9 6 4 11 13 2 1 12 14 5 3 10 7
11 13 2 4 5 3 8 9 1 6 10 7 12 14
5 8 9 10 1 14 13 12 7 3 6 11 4 2

5
erCZZn9R-41076386
JRdMGXqB-79154412
MN0kXMCZ-69545560
Uyw7BJMn-47285261
jNTQ4kXn-78889781
3 5 2 1 4
3 4 5 2 1
5 1 2 4 3
1 5 3 4 2
3 1 2 5 4
1 4 2 3 5
2 5 3 1 4
5 1 3 2 4
3 1 5 4 2
2 1 4 5 3
3 4 5 1 2
5 3 1 2 4
2 1 3 4 5
3 4 5 1 2

16
9imQ_nAU-68903391
VxvZmwUa-50681014
0ET6TMCB-83886166
C_GvM4xp-24885083
AZ1En8QG-85242844
FtYByNdg-63902946
6cP4aYnY-37589812
ITAtPQx_-60427174
lMkOJetD-31811225
pLe5G5cs-58719905
bnnMqOt5-59621907
jyZGNkzx-93614027
l30rFfcz-11332561
xlKpqKjS-50843054
M9GpjVZp-48198042
MTwyRurw-35645518
3 10 1 8 5 16 7 9 6 4 2 15 11 14 12 13
14 8 3 13 1 9 5 11 6 2 12 4 7 10 15 16
2 13 8 1 12 16 6 10 11 5 3 7 15 4 14 9
6 8 16 14 12 13 11 10 9 7 5 1 15 3 4 2

17
wkZU_MHM-15280015
8A7Dv8Ka-05252623
dpBkHET8-11122040
0hkLLWu9-41769719
w0_L8CTe-75311767
G5bcwMIT-11480697
YbO5m6mR-28976239
6cWjwcEv-93839368
ukIkaXKk-69062607
OrGi5wcy-38241838
mKcvZbDu-96475516
VGNPD7s_-56820107
kthovsEu-04196457
jVpZuH0b-41573719
gwiiFDsM-58524274
jvyFhEKO-70064775
tgtOYJrt-88178522
6 13 1 9 2 16 7 8 14 3 10 12 5 11 15 4 17
1 2 3 4 5 6 7 8 9 10 11 12 13 14 15 16 17
1 2 3 4 6 17 11 8 12 10 5 7 15 9 16 13 14
7 4 2 15 17 11 5 1 10 8 9 3 13 6 12 16 14
12 14 9 17 16 4 6 8 15 7 2 10 3 11 1 5 13
1 13 5 6 12 17 14 16 3 9 10 7 15 8 11 2 4
4 6 11 1 7 3 14 15 12 16 17 2 13 5 8 9 10
3 7 14 17 1 13 11 9 2 15 8 16 10 6 12 5 4
2 17 1 8 11 6 14 10 16 4 15 13 7 5 3 9 12
12 6 1 16 3 11 5 2 10 9 8 15 7 14 17 13 4
17 5 8 9 10 4 16 12 6 1 3 2 14 15 13 7 11
1 2 3 15 5 6 9 17 14 10 11 12 13 7 4 16 8
9 14 16 12 17 8 3 5 7 2 15 4 11 1 10 6 13
8 2 12 13 7 1 6 15 17 10 4 11 16 9 3 5 14
13 4 11 2 17 7 6 10 16 5 14 15 9 8 12 3 1
8 7 10 13 5 11 1 2 9 3 6 14 4 12 15 17 16
16 4 6 12 15 10 11 17 3 2 1 9 7 8 5 14 13
5 2 9 14 8 15 4 7 6 16 13 11 3 1 10 17 12
3 11 9 6 4 14 8 12 17 5 15 10 2 1 16 13 7
15 5 9 16 12 17 11 7 6 14 8 13 1 4 2 3 10
12 2 3 9 15 17 8 5 4 10 11 1 13 14 7 16 6
9 14 17 16 1 10 3 5 12 13 15 11 4 2 7 8 6
17 1 8 2 3 11 6 5 10 9 13 15 16 7 12 4 14
6 14 4 16 17 11 9 8 5 13 3 7 12 1 10 2 15
13 2 1 6 5 14 7 8 9 10 16 11 3 4 12 15 17

3
cO1vHcd4-63936977
EnLTVmLu-58683825
DybkNI6H-92163051
3 1 2
1 3 2
2 3 1
2 3 1
2 3 1
2 1 3
1 2 3
3 1 2
1 3 2
3 1 2
1 3 2
2 1 3
3 1 2
2 3 1
2 1 3
2 1 3
1 2 3
1 2 3
3 2 1
1 2 3
2 1 3
3 2 1
2 1 3
1 3 2
2 1 3
3 2 1
1 2 3
2 3 1
2 1 3
2 1 3
2 1 3
2 1 3
1 2 3
3 1 2
1 2 3
3 2 1
2 1 3
1 2 3
1 2 3
2 1 3
1 2 3

4
arC03JAK-08447526
DM_2ma01-26654087
n3OHMw_F-59376205
fbWC8HO_-89189408
4 3 1 2
1 3 4 2
1 3 2 4
2 3 1 4
1 3 4 2
4 2 1 3
3 4 2 1
4 3 2 1
2 3 1 4
4 2 1 3
3 4 1 2
4 1 3 2
3 1 4 2
1 2 4 3
4 2 3 1
3 1 2 4
2 3 1 4
2 1 4 3
3 2 4 1
4 2 1 3
4 2 3 1
4 2 3 1
1 4 3 2
4 3 1 2
3 1 4 2
1 3 4 2

20
ge2uQw4l-56386870
DXm9md8k-02019244
UAVlPfIr-04255179
6MTi5dge-56401712
mMRu1yjp-82814106
Aki_uRxx-73589412
JVpMVIuc-43948569
I1OJHOzJ-45051570
fr8AAzEI-68917836
pX2YLpDI-32696550
N25l4FPM-93983821
61WuezY1-27010694
6mPDhWNW-18412197
eieU_zMa-73992996
x1qWeYrQ-55176722
NtyolfgJ-09102029
Uu0pDTWE-51524069
viVKgHAH-93742461
4E9p1P5k-59765840
dJptLrJs-98534260
14 20 11 15 19 16 6 12 10 5 17 1 3 2 8 4 13 18 7 9
2 4 15 5 16 6 20 7 1 14 9 8 13 3 11 12 17 18 19 10
10 17 19 15 7 1 3 9 4 11 18 12 2 20 13 8 16 5 6 14
1 2 3 4 5 6 7 8 9 10 11 12 13 14 15 16 17 18 19 20
2 16 8 5 11 4 3 18 19 7 10 13 17 15 6 1 12 9 14 20
18 5 2 6 15 17 7 8 12 9 10 16 20 3 14 13 1 11 19 4
6 15 3 18 11 1 9 20 12 5 2 19 10 16 7 4 17 14 8 13
5 14 18 9 20 4 3 12 1 19 6 15 11 7 10 13 16 17 8 2
3 5 7 19 4 16 18 8 12 14 2 20 13 1 17 9 11 6 15 10
18 10 9 5 19 20 3 17 13 2 8 11 15 14 12 4 16 7 6 1
13 14 17 20 15 11 12 5 1 8 16 4 10 6 19 2 9 3 18 7
1 2 17 7 12 9 6 8 10 15 4 5 3 19 20 16 13 18 14 11
8 1 17 19 14 18 13 3 2 15 16 5 11 4 20 9 12 10 7 6
16 2 20 15 6 10 9 12 17 11 18 3 13 14 19 7 4 1 5 8
6 2 3 4 1 15 17 13 9 10 11 12 8 14 7 16 5 18 19 20
12 20 15 5 17 18 7 3 9 2 19 4 16 6 11 10 14 8 1 13
19 8 18 5 12 15 11 14 1 10 6 17 7 9 3 13 16 2 4 20
20 15 14 16 5 13 9 6 18 8 7 1 10 17 11 12 3 2 4 19
1 2 7 8 5 3 15 14 9 10 11 12 6 4 13 16 17 18 20 19
17 15 2 8 9 5 11 4 13 14 10 3 19 6 7 20 18 16 12 1
15 1 17 2 13 5 19 3 18 14 10 11 8 20 16 4 12 7 6 9
19 7 16 17 11 9 18 13 5 2 6 4 8 15 3 20 10 12 14 1
8 19 5 9 20 1 12 15 6 13 16 2 7 14 11 18 10 3 4 17
5 20 19 6 12 3 14 7 18 17 8 2 9 10 16 15 1 13 4 11
7 4 3 8 5 2 13 15 10 11 19 14 1 16 6 9 20 17 12 18
5 10 3 11 7 6 12 19 18 17 9 8 16 13 20 2 4 1 14 15
18 3 12 4 8 19 6 16 7 2 11 20 10 14 13 9 15 17 1 5
5 6 12 9 16 4 20 7 15 13 2 18 3 8 11 14 10 17 19 1
18 7 17 6 2 15 8 1 13 4 16 10 20 14 5 3 19 12 9 11
11 18 8 12 15 2 1 17 9 4 16 20 3 19 10 5 14 6 7 13
15 5 10 18 20 11 4 19 16 13 3 7 12 14 1 2 6 9 17 8
6 20 8 17 7 19 2 5 4 3 11 15 18 10 9 12 14 1 16 13
6 10 4 2 19 18 20 3 7 1 14 9 11 13 17 16 5 12 8 15

12
_ekSKhQL-98340775
NWjjkeFQ-06476114
D0SyCXB6-75324436
bS8IW2q_-38172667
Amr0JUJS-78147010
aUt5jbj8-03925143
SntiskC0-98211113
VqRZGDcf-37397661
pPDiygJ_-07475593
Jbt_3jOW-24207482
XDkyHE1e-40743918
CDWBbqMO-51001560
10 3 9 1 11 5 4 2 6 8 12 7
10 7 11 5 9 8 6 1 3 4 12 2
11 7 1 12 5 4 3 9 6 8 10 2
7 3 2 4 5 6 1 8 9 10 11 12
1 10 7 4 3 5 9 2 11 12 8 6
2 8 5 12 6 4 10 3 1 11 7 9
12 2 10 1 5 6 7 4 9 8 3 11
12 11 7 10 8 3 9 5 4 1 6 2
3 6 5 9 10 4 2 7 12 8 1 11

9
LYQtzlGR-45135960
QcwgsQK3-84136071
A1QMxxSP-62567334
wu96lyJY-24842730
2mfTNniK-72563402
JknMCNd5-19187499
5rZ9UrHS-24297945
i8fjJbp3-90964763
4D7uvjkh-51058479
7 3 8 9 4 2 5 6 1
9 4 7 2 1 8 5 6 3
3 1 4 6 7 5 8 2 9
3 8 4 7 6 5 1 2 9
3 8 4 1 7 6 5 2 9
5 1 2 3 6 4 7 8 9
9 4 2 1 6 7 3 8 5
6 7 3 8 9 5 2 1 4
8 4 2 9 7 1 3 5 6
8 9 7 5 3 4 2 6 1
8 4 7 2 1 9 5 6 3
2 1 7 8 6 3 9 5 4
6 9 8 7 4 3 1 2 5
2 6 1 8 7 3 4 9 5
9 2 5 8 3 7 1 4 6
6 7 9 5 2 3 1 8 4
1 7 6 8 5 3 9 2 4
6 7 3 9 2 1 4 8 5
9 5 8 1 7 4 6 3 2
9 7 1 6 8 2 4 3 5
1 8 7 3 6 4 9 2 5
1 2 8 7 6 9 3 4 5
1 6 7 5 8 2 9 4 3
1 2 3 5 8 6 9 4 7
1 3 9 4 5 7 6 8 2
8 3 9 6 1 5 7 2 4
1 9 4 8 2 7 3 6 5
9 4 3 1 5 8 7 6 2
9 2 8 7 5 1 6 4 3
3 2 8 6 5 7 1 9 4
6 1 5 3 7 4 8 2 9
5 7 9 8 3 4 1 2 6
2 7 8 5 1 4 6 3 9
1 5 4 9 2 3 8 6 7
8 4 5 3 6 7 1 2 9
7 3 4 5 6 9 1 2 8
9 5 7 3 8 2 4 1 6
2 5 6 4 1 8 9 7 3

8
Gjci9Iun-11801848
9qTU1GZG-02628243
0P5cs6EL-13289748
etXgeGKh-86531921
s2UCClgt-35583922
qr70Kpk3-84706332
9nC0KS13-77917876
7xA4rH4q-51216282
2 8 1 4 5 6 3 7
3 2 4 8 5 1 7 6
3 1 8 4 6 5 2 7
3 4 1 7 5 8 6 2
2 8 6 1 7 3 5 4
7 4 5 1 6 2 8 3
5 4 7 8 6 1 2 3
2 7 1 5 4 6 8 3
3 4 5 7 1 6 2 8
6 5 8 7 4 2 3 1
1 5 8 6 3 2 7 4
4 1 3 8 7 2 5 6
2 3 6 5 4 8 7 1
5 3 8 6 4 1 2 7
3 5 8 1 4 6 7 2
8 5 3 6 1 7 2 4
1 6 7 4 8 3 2 5
2 6 4 7 3 5 8 1
4 2 5 1 8 7 6 3
5 4 1 3 8 7 6 2
3 4 8 6 2 1 7 5
7 4 8 5 3 6 1 2
2 7 1 4 3 8 5 6
2 5 4 7 8 6 1 3
2 5 8 1 7 4 6 3
3 1 2 6 8 4 5 7
1 6 7 2 4 5 3 8
6 2 7 4 1 3 8 5
8 1 7 2 4 5 6 3
3 8 4 2 7 6 1 5
1 5 6 3 7 8 4 2
1 2 3 4 5 6 7 8
3 1 5 2 4 6 7 8
5 2 4 7 8 1 6 3
5 1 8 3 7 4 6 2
1 7 2 4 3 5 6 8
4 1 3 6 5 2 7 8
8 7 3 5 4 1 2 6
5 4 6 7 2 3 1 8
7 8 5 2 1 6 4 3
8 3 2 6 5 1 7 4
7 5 2 3 4 6 1 8
1 6 7 2 8 4 5 3
2 5 7 4 6 1 3 8
1 5 6 4 2 7 3 8
1 2 3 4 5 6 7 8
2 4 8 6 1 3 7 5
1 8 3 4 5 7 6 2
5 8 4 6 7 1 2 3
7 8 1 3 2 4 6 5

20
d1HbIkEL-40319852
5Dl7L6lZ-58176362
Q1kLd7Sy-59849746
mW45cZhX-37625547
MpLgqI5D-07061854
Rv6WDEb0-52734540
HlzAZZ3D-91256350
4_DGLygM-46362331
JOYy5dVr-96826599
mxs1rJan-24790604
1_kapk2h-31620377
bGydZq0Z-89408047
Utfa1lox-06286299
cJ07HWzD-41827809
DYeP2Sxh-46266295
ji0iDhnk-68691169
WZQQoHv1-37785104
QKbXTNQt-36291068
kZmAQ22l-84022667
9QlF8cEZ-35473707
7 6 13 4 3 20 19 9 5 17 15 10 8 14 18 16 12 11 2 1
20 8 5 3 1 14 7 10 15 4 17 12 18 19 11 16 2 9 13 6

19
pqmHHung-42478038
OzojCGEs-18527834
D3QHrsdv-75216077
GH18J19m-83997975
7ALm1SGU-01063594
AjWzPGLj-15618137
DLCbqqjz-44321635
N5OaXVRi-20379485
LPeEMHq6-56376586
BK0PCR3o-95335504
z0Tzgxqm-98090767
9v2go5Wc-51399282
fRhnTV3h-25124768
ZhE7vc0u-92992291
cCsBtOvE-96818970
g_zBLQ4Q-69026677
UztsUs5F-72990186
6A4UpM_j-85046121
jgV89tYV-15405357
1 8 6 4 5 2 10 3 7 9 11 12 15 14 13 16 18 17 19
7 2 3 4 5 6 15 9 8 12 11 10 13 14 1 16 17 18 19
7 17 1 10 19 16 11 2 8 5 3 13 6 12 14 18 4 15 9
7 16 14 9 8 12 2 3 1 4 11 17 18 6 15 19 13 10 5
7 2 3 4 18 8 12 1 9 10 6 11 13 17 15 16 14 5 19
4 13 17 3 7 6 19 5 12 2 14 8 15 18 16 10 9 1 11

20
V5bUTs4y-21479352
Wx_y5_Of-32503282
pi_Xh38v-96828411
rFaT67rI-92794135
2niiiyid-46122381
nTEdKVjc-38967424
6_QKt51l-91178346
g_ZOkBjW-98358558
LJYVqCs4-23490994
iriZdfBU-77393523
WCKOfYqz-47296622
e7pKuLQH-20178583
fd2hnG0m-74409235
P3P9ejgD-51816104
ZiD7p6hc-40653903
r4MdZrJq-05993320
lq8ILXEc-37582691
7WYeH8BI-32778769
6lAeJRXK-90546003
jKw_tN5I-40927560
18 15 2 12 4 3 10 13 20 19 7 1 16 8 17 11 5 9 14 6
8 16 12 1 19 3 4 10 6 7 14 18 2 15 17 9 13 5 11 20
11 8 16 12 7 13 3 17 10 9 2 4 19 18 5 6 14 15 20 1
8 4 2 7 6 12 1 14 18 11 15 5 13 10 16 3 20 9 19 17
11 2 12 4 18 10 7 8 9 13 1 3 6 14 15 5 17 16 19 20
16 10 1 2 7 14 19 20 5 17 11 4 13 9 6 3 12 18 8 15
17 2 3 9 5 8 13 19 11 10 18 1 7 15 14 20 16 6 12 4
7 12 13 14 5 9 16 6 3 2 4 8 1 10 17 20 11 15 18 19
6 3 14 2 13 12 8 16 4 11 10 18 20 1 9 15 19 17 5 7
1 2 3 4 5 6 7 17 9 10 15 12 13 14 18 16 8 11 19 20
15 7 9 4 18 11 17 10 3 8 19 12 13 5 6 1 16 14 2 20
18 6 15 14 8 20 7 4 9 2 3 5 13 11 12 16 17 19 1 10
13 10 12 8 16 18 15 9 19 7 11 4 17 3 2 1 5 14 20 6
11 10 3 1 20 8 17 12 16 2 14 19 4 9 15 5 7 18 6 13
8 14 3 11 6 18 5 1 9 7 2 10 12 17 15 16 4 13 19 20
18 16 14 3 19 9 11 4 5 17 12 15 6 10 7 8 20 1 2 13
11 9 14 19 18 8 3 5 17 1 15 16 4 7 10 13 6 20 2 12
8 2 6 7 5 17 4 10 12 13 3 1 20 18 15 16 11 19 9 14
4 17 15 19 5 13 9 14 1 10 20 6 12 8 3 16 18 2 7 11
16 19 11 9 18 7 4 10 1 20 6 13 17 3 8 15 14 12 5 2
9 2 6 4 10 1 15 13 16 8 20 11 19 18 5 7 17 12 3 14
20 17 6 9 19 16 12 11 10 15 14 18 4 2 7 3 5 13 8 1
11 20 7 15 4 16 6 19 13 1 8 18 2 5 10 12 14 3 17 9
15 7 16 14 3 4 5 2 10 12 19 17 9 1 6 13 8 11 20 18
11 16 7 20 18 14 5 13 10 8 17 15 19 2 12 3 4 1 9 6
11 2 18 7 16 6 5 8 9 12 1 10 17 14 15 3 4 13 19 20
1 2 19 4 8 6 7 17 14 5 13 15 10 11 16 20 9 12 3 18
12 2 10 13 11 3 1 15 5 7 20 9 16 14 8 19 4 17 18 6
19 15 6 16 1 20 18 17 3 13 11 4 5 14 7 10 9 12 8 2
7 9 13 16 4 20 1 11 12 15 3 8 14 19 2 10 17 18 6 5
9 18 14 12 6 3 17 20 5 13 8 4 10 11 15 7 2 1 19 16
17 6 16 18 7 14 11 10 13 19 4 1 12 15 20 3 5 8 2 9
12 20 13 19 15 2 18 3 16 6 8 7 10 9 14 11 17 4 5 1
18 17 9 1 8 4 13 19 12 10 20 5 6 15 11 7 14 2 3 16
18 2 16 12 9 4 13 15 17 1 19 8 7 6 11 20 5 14 3 10
16 19 12 8 2 9 7 15 17 1 18 11 6 5 20 10 3 14 13 4
7 17 6 16 8 19 4 10 2 5 1 18 11 20 3 12 13 14 9 15
20 9 7 3 17 1 14 8 5 12 6 13 10 11 16 2 19 15 4 18
15 5 6 10 4 7 12 13 20 18 2 9 1 3 16 11 14 8 19 17
14 20 7 15 18 9 19 5 8 6 10 11 4 16 2 3 13 1 12 17
5 20 11 9 17 14 18 12 19 13 6 4 15 1 8 7 3 10 2 16
15 11 5 13 7 1 10 16 9 20 2 8 3 6 19 12 14 18 4 17

10
BkzLBaii-80822722
sYb91qV4-77917852
aPOuOnQ7-01709000
3sJ4ccjq-48558811
NOupXNsH-43564658
LgSGF5yq-61806215
AMY9fff7-81518815
er_U6CjM-55095829
PbH_7mPU-57465171
9BGTbRAZ-44970409
8 2 10 3 7 1 4 5 9 6
3 7 2 5 8 4 9 6 10 1
9 1 3 10 7 8 5 4 6 2
6 5 1 3 7 9 8 4 2 10
1 2 3 4 5 6 7 8 9 10

16
XxiDPkoI-37705238
0VhsaoV3-95273692
9cw3ad7o-09641914
OGbIOl3_-94206042
8KFvkwkF-12109532
x3xqEAcB-66485361
ijvnGHhC-03406805
w7diyL1W-71242249
V9HJWQoI-35398551
Cre4BWYa-30030650
pNWqv_fs-68653448
Yw8uhS82-04508697
hx4jNrFd-55771075
6ktMHYag-35911977
NStWXXhx-70754101
o1095hLw-28487881
9 2 1 4 5 6 7 8 3 10 11 13 12 14 15 16
10 4 16 13 11 14 7 5 8 2 1 6 12 15 3 9

2
ySHZ3n2U-75099007
meCD2toQ-63812063
2 1
1 2
2 1
1 2
2 1
1 2
2 1
2 1
2 1
2 1
1 2
2 1
2 1
1 2
2 1
1 2
2 1
1 2
1 2
2 1
2 1
2 1
2 1
1 2
2 1
2 1
1 2
1 2
2 1
2 1
1 2
1 2
2 1
1 2
2 1
1 2
1 2
2 1
2 1
1 2

3
KCbz_jGe-73283116
MuK2UdTq-99538892
bk5syhiy-05739387
1 3 2
2 1 3
2 3 1
2 1 3
1 3 2
2 3 1
3 2 1
3 1 2
2 1 3
3 1 2
3 1 2
1 2 3
3 1 2
1 2 3

10
29Coihbb-41889880
KsxCOXdv-01936341
RIDkRyyu-88713990
62XpdJhf-31033763
NxPnR2uY-25883191
796FSyh0-20272806
_vgy2Xap-59676650
09iek_hw-89956248
60S86Zu2-61293644
XHy7G0sf-42531286
3 4 1 6 2 9 5 8 10 7
5 4 2 3 10 6 8 9 7 1
3 6 10 7 2 4 9 8 5 1
8 3 1 6 5 9 7 4 2 10
4 2 8 3 5 6 1 10 7 9
9 5 1 6 10 4 8 3 7 2
10 6 1 4 9 3 5 7 2 8
8 3 1 4 5 10 2 6 7 9
7 8 6 1 3 10 9 5 2 4
3 10 5 9 4 2 8 6 1 7

7
XRSamlJT-67250526
aai5wOjG-01959963
Jq1k80MA-56555576
J4sl92RL-99403506
6Amu5HxE-60721835
jCcN47mM-61859858
l5Ik0a7q-47749899
2 4 5 1 7 6 3
1 6 2 3 4 7 5
5 1 2 4 3 6 7
5 6 4 1 2 3 7
5 4 6 1 2 7 3
5 7 4 2 3 1 6
5 7 3 2 6 1 4
5 7 4 6 3 1 2
4 5 2 3 1 6 7
1 5 7 3 2 4 6
2 7 4 5 3 6 1
1 6 2 4 5 7 3
1 7 3 2 5 4 6
2 6 3 4 1 5 7
3 1 5 6 2 4 7
1 5 3 2 6 4 7
6 2 4 5 1 3 7
4 5 6 7 2 1 3
4 1 3 6 5 2 7
7 3 1 2 6 4 5
5 7 2 6 3 1 4
3 4 7 2 6 5 1
2 1 3 6 5 4 7
4 5 6 7 1 2 3
5 1 6 7 4 3 2
3 1 2 7 6 5 4
1 4 3 6 7 2 5
2 5 1 3 4 6 7
7 1 5 4 6 3 2
5 2 1 3 6 4 7
1 4 6 3 5 7 2
4 3 1 5 2 7 6
7 1 2 5 3 6 4

18
MF9joY2k-19341142
NjVsvg7Z-79771401
IiGoZJyV-83900628
QYUMTaTM-93586619
IRG0ZH9I-89934241
RiP911lh-56984677
ksb_c0zP-03362918
unmKsQ42-97346103
Okhvsccr-16765137
y0C8N35k-64179180
589LcGux-68592313
6CdOySRJ-70746026
7xJcZaP2-07165272
6XO1d6qJ-01708300
XCovpp8p-40519499
Z6mU0OCv-10670652
AEoGufzW-85642527
_hhh21B6-55312732
9 2 8 4 11 10 14 15 13 6 17 12 5 7 1 16 3 18
12 17 8 16 2 5 3 4 1 10 9 6 18 7 13 11 14 15
13 15 5 11 17 12 10 9 7 8 18 4 1 14 2 6 16 3
4 7 15 3 11 17 9 2 18 6 10 12 13 14 1 16 8 5
11 3 10 2 5 6 1 12 9 4 18 13 15 14 17 16 7 8
1 2 15 6 5 4 12 8 9 10 11 18 17 14 3 7 13 16
7 13 1 6 17 15 18 2 4 8 10 14 3 5 9 11 12 16
13 10 14 5 3 15 1 11 4 6 9 8 2 16 18 17 7 12
6 17 13 18 11 9 1 7 15 12 3 4 14 8 2 5 10 16
3 7 14 1 10 16 13 9 11 5 17 18 8 2 4 6 15 12
2 6 12 5 9 15 10 8 4 3 17 7 14 11 1 16 13 18
10 9 14 11 8 3 1 2 12 5 18 4 7 15 13 17 6 16
16 8 18 11 3 7 14 1 4 10 13 9 12 6 5 15 17 2
11 4 3 9 5 16 14 1 15 12 18 2 10 13 8 7 17 6
8 15 7 16 1 13 3 5 6 14 4 18 17 2 12 9 11 10
11 17 3 9 8 10 16 13 4 12 14 18 7 1 15 6 2 5
9 5 6 8 13 10 1 14 15 11 2 12 7 17 18 4 3 16
14 18 10 2 8 1 15 11 9 17 16 6 13 7 5 12 4 3
7 6 12 13 9 17 11 14 1 10 2 16 4 15 5 18 8 3
15 8 12 7 4 18 1 3 6 16 10 14 9 5 13 17 2 11
18 3 6 5 15 8 10 16 13 9 12 1 11 17 7 2 4 14
14 9 4 11 12 13 15 8 5 18 1 7 10 17 16 3 6 2

2
DOrNDdFu-40380927
vsoTdpCI-21245252
2 1
2 1
2 1
1 2
1 2
2 1
2 1
2 1
2 1
2 1
2 1
2 1
1 2
2 1
2 1
1 2
1 2
1 2
2 1
1 2
2 1
1 2
2 1
2 1
2 1
2 1
1 2
2 1

15
ppUmNiSZ-09147513
oddXRBKA-81207348
uoTX_ckQ-83925445
Z97GFvV3-23970522
KW9n8eBp-81402713
evFYs2vt-98410378
8Mm_rRDO-64002261
2DyJWzet-23078068
d06GHOAF-55747176
zWQXdI7j-37849810
OSCCdEbz-35436328
SJ2wpysw-98280411
1LypjaV_-95149333
WIOdxt7h-01894238
ygVgFGd8-97019486
13 5 9 14 15 7 2 4 12 1 10 11 8 3 6
7 9 13 1 8 2 6 3 5 14 15 10 12 11 4
11 6 15 10 1 3 5 14 7 13 8 9 12 4 2
12 14 8 5 13 1 2 9 15 6 4 10 11 7 3
5 3 7 12 4 11 15 13 9 8 10 6 2 1 14
8 2 1 12 14 15 6 9 10 3 4 5 7 13 11
1 2 3 4 5 6 15 8 13 11 10 9 12 14 7
12 5 11 7 10 14 6 1 4 2 9 13 8 15 3
7 14 4 3 9 13 1 10 8 15 5 11 6 2 12
15 1 4 12 8 2 9 5 13 6 11 7 3 10 14
4 5 3 8 1 15 11 10 14 7 2 12 13 9 6
4 8 9 6 10 3 7 12 2 11 1 5 14 13 15
9 13 3 4 15 5 1 2 11 8 7 6 14 10 12
12 8 15 5 3 13 10 14 1 6 4 2 11 9 7
11 2 10 13 12 14 7 8 9 5 1 3 4 6 15
1 4 8 7 2 14 15 10 6 12 9 11 5 3 13
12 10 9 1 5 3 11 4 14 15 13 6 8 7 2
8 9 13 6 10 11 1 3 5 12 7 15 14 2 4
12 9 5 11 8 7 3 13 1 4 14 2 6 15 10
10 4 15 6 11 2 7 14 13 8 1 9 5 3 12
15 12 3 13 10 6 11 14 2 1 5 4 9 8 7
1 13 8 2 14 9 3 10 15 7 12 11 5 4 6
3 1 15 12 2 14 6 7 10 13 5 9 11 4 8
15 10 13 3 14 5 7 6 11 1 2 12 4 8 9
5 10 12 3 13 6 1 8 9 15 7 4 2 14 11
14 13 9 10 2 15 3 1 7 6 12 11 8 5 4
1 4 14 3 5 12 11 6 8 2 15 13 10 7 9
10 13 2 5 7 3 15 12 4 1 9 14 11 8 6
1 2 3 7 6 10 14 8 9 4 5 13 12 11 15
13 4 6 14 9 12 5 1 10 8 15 2 3 7 11

9
bKK0pk3G-79941897
HSODKKHs-56739097
Of6NKFJL-49623086
6t9Z_MFR-77653371
i2MZFvtw-76696845
8XQecZci-07366688
AT88TfGJ-39712474
SY6Yv04R-90803742
IURe5Umq-41754524
9 7 4 3 2 6 8 5 1
8 6 7 2 5 9 1 3 4
9 2 5 3 4 8 6 7 1
7 2 4 1 9 6 8 3 5
7 5 1 2 8 9 6 3 4
3 8 5 4 1 2 7 6 9
7 4 8 3 9 5 2 1 6
7 3 2 4 6 5 1 8 9
8 7 3 4 2 1 6 9 5
1 7 2 5 8 6 3 9 4
4 3 2 5 9 6 7 8 1
5 7 1 4 3 6 2 8 9
1 7 2 3 4 8 6 9 5
5 7 4 8 6 2 1 9 3
6 2 7 8 5 1 4 3 9
9 7 5 2 6 4 1 3 8
7 1 8 6 2 4 9 5 3
1 9 5 4 8 3 6 7 2
4 2 3 7 9 6 1 8 5
3 1 6 8 7 5 4 2 9
4 5 1 7 3 9 2 8 6
2 5 4 7 8 9 6 1 3
1 6 7 9 5 3 2 8 4
5 9 8 4 3 2 1 7 6
1 4 9 3 8 7 5 6 2
4 6 2 5 9 7 8 1 3
5 6 9 7 3 4 8 2 1
3 4 8 9 7 5 6 2 1

12
WbkCZHTL-63957583
FG54DyDC-52247942
UcLJ7a6h-54515286
8BiaH8C2-02874270
WciWYync-11975814
yJKV5asp-71788866
HxT8huko-54050283
qTniiBrL-79026401
za97DL29-46450678
Lgt3ZWn_-14162323
267Put9D-27046076
vLkvmjZu-96013335
8 11 1 5 4 6 9 2 7 3 10 12
6 12 7 10 4 1 5 2 3 9 11 8
10 4 1 11 7 6 12 2 9 3 8 5
12 3 4 6 1 2 5 10 8 9 7 11
1 12 10 6 2 4 11 5 9 7 3 8
10 9 8 3 5 6 1 12 2 4 11 7
6 1 4 5 10 12 7 9 11 8 2 3
4 6 12 8 10 2 9 7 11 5 3 1
4 12 3 7 9 6 1 8 5 10 11 2
2 1 4 10 5 8 12 6 3 9 7 11
12 2 3 4 5 11 7 1 10 9 8 6
9 2 6 1 5 3 12 4 10 8 7 11
4 1 2 10 8 11 6 7 5 3 12 9
8 7 3 11 2 5 1 12 10 9 6 4
9 4 6 12 3 8 5 10 1 2 11 7
2 11 3 7 6 4 1 10 9 8 12 5
6 5 12 3 7 10 4 1 2 9 11 8
10 8 2 11 5 3 9 12 6 1 7 4
7 8 11 4 1 12 3 2 6 5 9 10
9 11 1 3 2 10 8 12 5 7 6 4
8 11 2 6 10 9 1 7 5 12 3 4

4
y9W5jcHZ-02629079
rA8RVCMR-90773781
Q5doy6Ve-43006434
lYcXP0Jq-30954286
2 3 1 4
2 3 1 4
3 2 4 1
1 3 2 4
2 1 3 4
2 1 3 4
1 4 3 2
3 2 4 1
4 3 1 2
3 4 2 1
2 1 4 3
4 1 2 3
3 2 1 4
1 3 4 2
4 3 1 2
1 2 3 4
2 1 3 4
4 2 3 1
1 4 3 2

1
DFHD1bg6-63580585
1
1
1
1
1
1
1
1
1
1
1
1
1
1
1
1
1
1
1
1
1
1
1
1
1
1
1
1
1
1
1
1
1
1
1
1
1
1
1
1
1
1
1
1
1
1
1
1

16
LPtPH1h7-95224977
_38k_8sH-17551204
Wp6415RK-41515199
0LvScPZ2-04419964
8qp2vqw4-67858185
zoRdgoJE-43237550
Oyja3fHN-12191604
RNUOf1Mj-30901011
UpCVNVyV-78985500
rPkVuuiE-04622744
_z6NY9fj-63778759
2acLc74x-10705294
I2_e4YAY-67960285
8ZIRDOxP-60400974
biABpWS0-92555669
ohkW7ArX-39495062
13 12 14 6 10 8 3 11 5 2 4 7 1 15 16 9
3 1 5 2 6 9 7 11 4 15 10 13 12 16 14 8
2 8 15 14 5 3 4 6 10 1 12 11 16 13 9 7
1 9 2 5 4 6 13 11 7 10 14 3 12 16 8 15
9 5 16 1 8 14 4 15 10 3 11 13 7 6 2 12
4 2 16 12 3 6 15 8 11 10 9 1 13 7 14 5
13 2 6 8 15 11 5 9 4 7 14 10 3 16 1 12
4 5 6 15 14 10 8 9 1 7 11 3 2 16 12 13
1 12 15 4 5 6 7 8 9 10 11 2 13 14 16 3
6 1 12 4 11 8 9 16 5 2 13 7 10 3 15 14
15 6 1 11 9 2 7 3 8 10 4 13 12 14 5 16
10 4 7 1 14 15 5 16 9 13 8 6 3 2 12 11
10 13 12 4 15 9 8 14 1 3 2 11 5 6 16 7
5 13 1 12 11 10 8 15 7 14 2 6 4 9 16 3
14 4 8 2 13 1 10 3 12 5 15 6 16 11 7 9
9 16 12 2 13 5 8 6 15 7 4 11 3 10 1 14
4 9 8 10 16 14 1 6 12 3 11 2 15 13 7 5
1 2 3 4 10 6 7 8 9 5 11 13 16 14 15 12
16 1 12 2 9 11 8 13 7 4 5 3 14 10 6 15
7 2 3 12 10 15 13 11 9 8 1 14 5 16 6 4
1 5 13 14 3 15 8 10 4 9 12 2 6 16 11 7
6 1 4 7 9 12 15 10 16 8 2 14 3 13 5 11
12 6 13 5 10 15 1 9 14 3 11 8 16 4 2 7
12 9 4 3 11 2 15 1 7 6 5 8 10 13 16 14
10 14 7 8 13 11 12 6 15 4 16 9 5 2 1 3
16 4 8 3 6 2 9 11 14 10 5 1 15 13 12 7
11 2 10 8 7 16 5 12 4 3 14 1 6 9 13 15
1 14 12 4 9 15 7 8 5 11 13 10 6 3 2 16
14 6 8 13 16 12 5 7 3 15 10 11 2 4 9 1
6 3 9 12 2 13 4 10 16 7 14 15 11 5 1 8
11 4 14 3 16 8 2 15 5 1 13 7 10 6 9 12
11 7 4 9 1 3 13 2 12 8 6 5 15 14 16 10
1 2 3 4 5 6 7 13 9 10 11 12 8 14 15 16
8 9 3 15 16 12 14 6 1 2 10 11 7 13 4 5
2 16 3 10 11 7 15 4 1 12 13 5 8 6 9 14
7 1 9 4 2 11 5 6 13 10 3 12 15 14 8 16
13 9 1 3 10 7 2 4 6 5 11 16 15 14 8 12
3 16 6 12 11 14 9 15 8 5 13 4 7 2 10 1
11 6 5 1 12 14 7 2 3 15 9 16 13 4 8 10
15 6 16 8 2 4 1 13 3 9 5 11 14 10 7 12

17
F2slMZ2W-77549867
5G23hO3B-40745980
iXca0XzQ-41512653
7IccpElk-14195585
4hY7AxO4-61398622
ZGYqBghL-37838841
N_K5jSHH-59949741
GsQx4yCH-27618154
uBI6ceUJ-60286500
JwsJxik_-95752859
7rRQ1xwh-89083336
h_xuIinX-34730957
0llDG3gx-27953551
cDAZfxWt-13180692
O9MLSHeb-44172373
o3u5HrLI-03378686
mnxSg8SF-94091354
10 12 11 5 9 6 13 15 7 8 2 3 14 16 1 4 17
3 8 1 4 5 12 7 17 9 10 11 6 13 14 15 16 2
1 2 14 11 5 6 7 17 9 10 4 12 13 3 15 16 8
3 2 11 1 10 7 4 13 5 16 6 12 14 9 15 17 8
17 7 2 16 1 13 12 14 3 8 11 9 4 10 6 5 15
13 8 11 3 12 2 17 1 6 14 7 16 10 5 4 9 15
11 15 14 13 12 17 9 5 3 1 2 7 16 10 8 4 6
16 7 15 1 8 11 14 2 13 6 5 3 4 10 17 9 12
12 3 15 2 8 6 7 5 9 16 11 1 4 14 17 10 13
2 15 3 4 14 5 17 8 1 16 11 9 13 10 7 12 6
7 13 14 4 6 5 1 17 11 9 2 15 12 10 8 16 3
10 14 2 9 1 4 13 3 12 7 8 16 5 6 15 11 17
6 5 14 1 2 11 12 8 3 10 4 13 7 9 15 16 17
15 9 11 2 6 7 14 8 1 4 17 3 10 12 5 13 16
1 11 2 13 17 8 15 7 5 3 14 9 4 16 6 10 12
1 10 15 7 13 2 5 8 9 12 14 11 17 3 4 6 16
14 17 3 10 1 15 16 11 6 8 13 9 4 5 7 2 12
8 13 3 4 6 10 7 5 16 17 11 15 9 14 1 2 12
10 8 3 13 14 7 15 2 6 1 9 17 12 11 5 4 16
13 14 17 6 11 15 10 1 7 9 12 4 3 2 5 16 8
13 12 2 10 17 9 7 15 16 14 1 8 6 11 4 5 3
2 6 10 16 15 13 7 11 9 14 8 12 1 3 5 4 17
7 2 6 16 10 9 4 13 8 12 15 5 1 14 3 17 11
1 2 3 4 5 6 7 8 9 10 11 12 13 14 15 16 17
1 2 3 4 5 6 7 8 9 10 11 12 13 14 15 16 17
4 17 15 7 12 11 9 13 14 6 10 8 1 2 3 5 16
3 8 6 5 7 15 2 14 10 12 9 1 4 17 13 16 11
6 17 8 10 15 2 3 12 9 4 5 1 11 13 7 16 14
7 10 11 17 13 15 2 6 1 5 3 4 16 14 12 8 9
5 3 4 12 16 2 1 17 9 14 6 13 10 7 15 8 11
2 1 3 14 8 15 6 16 5 9 10 7 13 12 17 4 11
11 8 3 14 5 6 17 2 9 10 1 15 13 4 12 16 7
12 13 5 6 14 7 9 4 1 17 16 10 11 8 2 3 15
9 11 8 3 15 17 12 2 6 4 7 1 14 5 13 10 16
5 11 10 15 4 6 16 2 1 8 3 12 9 14 17 7 13
8 16 11 9 1 3 12 13 4 14 2 7 6 15 17 10 5
15 12 3 11 10 6 5 8 14 2 16 13 17 9 4 7 1
15 12 4 14 7 6 11 3 10 5 9 17 1 8 13 2 16

19
cNpkSTsD-02488898
w8Q9sgtL-40782146
kse6j18h-94325836
lQ6nljHc-71652357
jXAHISFq-68050236
nzG3RZf1-14792543
oQUEHBDW-57493391
HNa_eQJI-80629999
ujKqMMrD-29390599
HvQrppiB-98736611
a5KJhNy9-10052980
IB3Zx4oS-66753538
ArJOzqEt-18398159
qCU8oXem-18722958
FsV43Dg_-19340011
GUCuxo7Y-99260574
m4z7XHs0-45590550
G6RWbH33-19055018
5GThnUpJ-16457830
14 10 19 3 12 18 7 4 16 1 11 13 17 2 15 9 5 6 8
6 9 18 12 1 5 17 15 10 13 19 3 8 11 16 14 4 7 2
13 18 9 14 7 11 12 10 3 1 4 6 19 17 16 5 15 8 2
2 12 8 15 6 16 19 5 10 7 14 11 9 17 18 1 3 13 4
8 11 17 4 6 14 18 16 5 9 12 13 19 2 1 10 7 15 3
3 19 16 7 18 8 13 4 1 17 10 9 11 14 5 6 2 15 12
1 2 14 9 6 17 7 8 4 10 11 5 15 3 13 16 12 18 19
10 3 6 4 13 17 12 9 5 7 18 15 1 8 14 2 11 16 19
2 5 7 17 15 1 12 11 4 9 8 16 14 3 18 6 10 19 13
18 1 14 16 13 3 15 2 9 10 12 7 17 8 6 5 19 11 4
2 10 17 8 7 3 19 18 13 5 1 4 14 15 16 9 6 11 12
5 3 12 2 16 13 7 15 14 10 8 11 6 18 4 19 17 9 1
7 1 2 19 18 14 11 16 15 12 17 3 10 8 6 9 13 5 4
15 1 13 2 14 3 17 4 7 19 9 5 18 8 10 6 11 12 16
16 2 7 11 17 10 13 1 9 4 5 15 8 3 18 19 14 12 6
11 13 2 1 4 15 16 14 3 5 18 7 10 12 9 6 19 17 8
19 2 3 4 5 6 7 8 9 10 11 12 13 14 15 16 17 18 1
15 2 14 4 8 6 13 10 9 11 17 12 1 5 7 16 3 18 19
18 19 17 13 11 16 10 2 15 12 14 4 6 7 1 3 9 8 5
10 2 19 14 6 12 7 4 17 8 3 5 11 1 13 16 9 15 18
19 3 12 15 13 17 1 18 2 8 16 10 14 4 11 6 9 5 7
7 2 11 16 6 19 10 9 1 13 17 8 18 4 15 3 12 5 14
8 4 12 15 17 7 10 1 16 18 14 11 2 3 5 9 19 13 6
5 16 10 19 2 8 18 14 9 13 11 6 12 17 4 7 15 3 1

15
Za4TeObw-73358050
_ms5Xj1M-62737268
CjndJn5c-33917998
n2_wiBWu-27241230
rwg4_Rj8-31726786
UEAeKAsX-19771659
vqzSm1Pm-48373995
tVJJCmIT-50490983
gMjFuiqF-02203139
Ku00aZLw-23240085
o_HnK6kf-45894073
qZvkYQPX-28007439
QfOBY8E0-25546309
Xtsj9w43-28391274
q1kMrCVL-52902214
12 10 8 14 7 15 13 1 6 4 2 5 9 11 3
12 9 15 7 8 13 2 3 1 14 4 5 6 10 11
4 10 6 12 11 7 8 9 5 2 15 3 13 1 14
11 12 7 14 4 3 1 15 6 9 8 10 2 5 13
1 5 15 4 11 6 14 12 9 7 13 2 10 8 3
13 9 2 5 4 7 11 15 12 3 8 10 1 6 14
13 9 14 10 15 3 11 2 12 5 8 4 1 6 7
15 14 9 11 5 6 4 13 3 10 7 12 1 2 8
6 5 15 7 10 8 12 13 3 14 11 2 1 4 9
7 14 1 2 11 13 3 6 5 15 9 8 12 10 4
8 6 4 11 14 5 12 15 9 2 10 13 7 1 3
12 3 11 13 14 8 5 1 2 9 4 15 7 6 10
14 2 12 11 5 6 4 15 3 10 8 1 13 7 9
5 8 13 1 4 6 12 2 9 10 11 3 7 14 15
5 1 11 4 6 8 2 10 14 12 3 7 13 9 15
8 1 9 6 14 13 2 11 7 5 15 10 4 12 3
9 10 3 6 5 11 14 1 12 7 2 15 13 4 8
9 1 2 10 3 13 7 12 8 15 11 4 14 6 5
3 11 6 10 7 13 5 15 4 14 12 8 2 1 9
5 3 9 1 6 14 2 4 12 8 11 13 10 7 15
12 14 1 2 15 4 13 7 9 11 6 5 10 8 3
7 13 15 12 8 9 3 10 11 4 1 6 14 5 2
15 2 13 10 1 9 8 3 7 12 4 11 6 14 5
7 2 10 5 8 3 11 15 14 1 4 9 6 13 12
15 14 2 10 1 13 12 4 3 5 8 11 9 6 7
10 13 15 3 7 4 5 8 9 14 12 6 11 1 2
1 12 6 14 8 11 5 3 13 2 7 10 9 4 15
11 13 1 15 5 10 6 7 9 3 8 4 2 12 14
11 3 4 2 1 8 6 15 14 5 7 9 13 12 10
9 2 8 11 6 12 4 15 7 1 10 13 14 5 3
1 2 4 9 5 3 7 11 12 6 14 15 13 8 10
2 5 7 10 9 11 3 13 8 4 15 12 14 1 6
8 6 13 9 11 12 14 4 2 10 15 7 3 1 5
15 2 13 9 8 6 11 7 10 3 4 14 1 12 5
8 9 5 14 11 15 7 6 13 4 1 3 2 10 12
1 12 8 10 6 9 4 14 15 11 3 13 7 2 5
1 2 8 4 5 6 3 7 9 10 11 12 13 14 15
14 12 2 7 10 13 15 5 9 3 8 4 11 1 6
2 12 13 7 15 8 1 6 9 11 3 5 4 14 10
14 13 3 10 6 4 7 2 5 11 15 8 9 1 12
2 8 10 1 4 13 5 12 15 7 11 6 9 3 14
7 10 15 1 12 11 4 9 2 5 14 3 8 6 13
6 4 7 9 11 2 10 13 5 3 12 1 8 15 14
5 14 3 4 11 13 9 1 8 6 10 12 2 15 7
6 10 12 11 14 1 5 13 3 9 7 15 4 2 8
6 15 9 11 8 3 14 12 13 5 1 2 7 10 4
3 1 9 14 11 6 12 5 13 2 8 4 15 10 7

4
NtvCZVT1-92192171
d0xrwK1D-89945098
eGad0JM4-35263233
5hMEqRP8-75468354
3 4 2 1
2 4 1 3
4 2 1 3
1 4 2 3
2 4 1 3
4 2 3 1
3 4 1 2
2 3 4 1
4 1 2 3
2 1 4 3
3 1 2 4
4 3 1 2
4 2 1 3
4 2 1 3
1 2 3 4
3 1 2 4
2 3 4 1
2 1 3 4
1 2 3 4
4 3 2 1
4 3 2 1
1 3 4 2
2 4 3 1
4 1 3 2
2 1 4 3
2 3 4 1
3 1 4 2
1 3 2 4
3 4 2 1
4 3 1 2
2 3 4 1
2 4 3 1
2 3 4 1
1 4 3 2
4 3 2 1
3 1 4 2

20
ynVRD3DE-07319774
jYY3dVqd-23293073
hPsrCViF-13443605
6eGh1X_W-52203362
zN2CedUN-24903456
wj65JwLU-86509873
lwl7SnbV-40992168
weO2YzfA-28263448
5rm9WSCj-94353456
bII4ZZSb-29145809
3ln3kVRC-87597279
TUbhmogl-80542611
NznMdlet-35586639
9jr7YZo9-94623665
Q5G_aY_v-03422647
K8jN_0iF-85498200
dRR2lNPp-49362701
Z_2UMoCX-60500608
0vs_SvBF-61247020
8O1kB39Q-99523546
15 1 10 6 5 16 11 3 19 14 17 18 8 2 12 9 4 7 20 13
7 20 6 15 14 16 1 17 8 2 13 9 19 18 5 3 12 11 4 10
9 12 1 10 17 20 18 16 3 2 19 8 15 14 5 6 11 4 7 13
7 13 16 8 4 18 14 6 1 12 19 9 20 3 5 10 11 2 17 15
20 13 10 12 1 16 2 6 17 7 3 11 18 9 19 5 4 14 15 8
8 20 15 12 5 6 9 18 10 3 19 4 2 14 1 16 11 7 17 13
6 15 19 2 9 11 20 10 4 7 8 3 14 18 1 17 16 5 12 13
15 17 12 3 11 8 14 10 2 6 7 4 19 18 20 13 1 9 5 16
5 18 2 13 9 7 16 20 4 12 11 6 1 10 15 17 14 3 8 19
9 14 3 7 17 18 4 2 15 13 10 8 11 1 6 12 5 19 20 16
16 10 13 17 4 9 11 14 20 7 1 5 8 12 6 2 3 15 19 18
5 6 16 8 2 19 15 4 12 17 11 13 3 14 9 20 7 18 1 10
17 16 20 5 3 15 4 6 7 19 18 12 14 10 9 8 11 1 2 13
18 14 7 16 19 3 11 13 1 15 2 10 20 8 4 9 12 5 6 17
1 7 6 9 5 11 15 19 3 4 10 17 16 18 20 13 12 2 8 14
15 2 3 19 11 20 7 4 9 18 8 12 6 16 14 17 1 5 13 10
13 16 18 17 15 12 7 8 3 9 6 4 5 2 1 14 19 11 10 20
6 2 17 5 19 13 8 4 16 9 3 20 7 15 10 12 1 18 11 14
3 6 10 8 7 19 16 1 15 18 20 17 14 11 13 5 2 12 4 9
1 8 16 7 4 5 14 15 19 10 12 6 13 17 20 9 3 11 18 2
6 5 3 20 14 13 7 2 19 17 12 1 18 10 15 11 9 4 8 16
1 2 16 7 5 6 4 8 9 10 11 12 14 13 15 3 17 18 19 20
19 2 3 13 1 10 6 7 5 17 8 12 15 9 11 16 4 14 20 18
4 12 18 3 8 6 11 5 13 10 1 14 19 16 20 17 7 2 15 9
5 15 3 2 6 20 14 4 11 18 1 10 8 17 12 16 7 13 19 9
5 3 18 2 17 12 7 20 15 6 10 4 13 19 9 16 11 14 1 8
5 10 8 19 14 13 16 2 4 11 1 9 15 18 3 12 17 7 20 6
1 2 18 4 3 6 7 20 17 5 11 10 13 14 15 16 9 12 19 8
8 15 17 14 11 19 12 7 1 13 3 18 10 4 6 5 9 16 20 2
1 12 3 7 20 6 5 13 9 16 2 11 8 14 15 10 19 18 17 4
4 14 7 13 16 17 15 12 9 1 6 3 11 5 19 18 20 2 10 8
20 15 4 8 1 14 7 13 11 6 10 12 16 5 19 9 17 18 3 2
13 7 3 4 11 6 2 17 9 12 19 1 10 14 15 16 8 18 5 20
18 4 19 3 17 13 16 1 5 2 11 7 9 20 12 6 8 15 10 14
16 17 15 14 7 6 8 9 2 1 11 12 5 4 19 20 3 10 13 18
9 3 13 12 5 15 6 1 17 8 7 2 4 11 19 14 18 16 10 20
3 18 8 5 6 13 19 7 15 14 12 20 9 11 10 4 16 2 17 1
17 8 5 15 10 9 14 1 13 6 19 3 18 4 12 11 2 20 16 7
18 14 20 11 8 5 16 6 19 2 12 17 13 3 9 15 1 10 4 7
7 2 12 4 20 17 10 3 13 6 8 5 14 11 19 16 1 15 9 18
3 19 17 7 20 4 9 8 12 1 13 11 15 10 14 16 18 2 6 5
3 19 9 1 4 11 12 14 6 16 8 5 13 18 10 7 15 2 20 17

14
LNCAaEeF-80880666
8ucOUKM9-57147211
jQOfUqN5-40534430
a_nq3uFJ-33263667
itE9rmBj-85933901
gugRnCEN-70495689
bSo946ZF-19647368
w2YPMoJZ-02066262
yDskatnN-07146978
w4JLs5FQ-68966141
MragX96J-26142167
fvcqCDSO-70256432
hXc6fqEf-14292424
bsbLEP55-89290351
1 2 6 4 5 11 7 8 9 10 3 12 13 14
13 11 7 6 10 1 8 5 12 4 2 3 14 9
13 7 10 8 9 12 5 4 2 1 3 14 6 11
14 3 11 10 9 4 2 13 1 6 8 7 12 5
13 8 3 2 6 7 14 11 12 5 9 1 10 4
9 4 8 3 11 12 14 7 10 2 5 13 6 1
3 6 12 8 13 7 2 11 1 14 4 5 9 10
6 13 7 4 11 1 10 8 9 12 5 3 2 14

1
vvpA0AcY-82055140
1
1
1
1
1
1
1
1
1
1
1
1
1
1
1
1
1
1
1
1

8
uEWw7vIU-32163322
TfChhumA-48974901
MxoOsMxQ-67310682
pFp4zNiT-82425122
CGtEZyU_-00563287
nYpD5KR2-90088248
w1AvmvOP-47376937
D8c5pxKP-84370824
6 3 4 2 1 5 7 8
2 5 6 7 1 4 3 8
2 7 8 5 1 3 4 6
2 5 7 3 8 6 1 4
5 6 2 1 4 8 3 7
5 7 8 6 1 3 2 4
1 2 3 5 7 6 8 4
5 8 4 2 6 3 7 1
7 3 2 5 6 4 8 1
7 2 6 3 8 5 1 4
2 7 8 3 5 4 6 1
7 3 5 2 1 8 4 6
5 7 6 2 8 4 1 3
7 1 6 8 2 4 5 3
1 2 4 5 6 3 8 7
1 2 5 6 7 8 4 3
5 6 8 4 7 1 3 2

9
MrOpUBKV-05354623
TZukgGkv-62997497
1D7ZdQ31-78350545
jQcqMngJ-88129579
ApY3c5ag-19948361
qr9FCBVg-25833556
pMMOffhf-58016821
BqBu6vwr-69722497
dNgaBR7m-64022969
7 5 6 3 1 4 2 9 8
2 7 6 3 8 9 1 4 5
9 3 1 2 8 7 6 4 5
3 4 1 6 8 5 7 2 9
7 5 4 2 9 1 6 3 8
6 3 8 1 7 4 2 9 5
6 8 1 4 7 2 9 5 3
1 3 4 9 5 6 7 8 2
1 2 5 4 6 7 3 8 9
4 3 6 7 5 2 9 8 1
7 5 6 3 1 9 8 4 2
6 9 2 5 3 1 7 4 8
2 8 7 3 9 1 4 6 5
4 8 9 7 5 6 3 1 2
5 4 3 8 7 2 9 1 6
1 7 6 5 4 3 9 8 2
1 5 4 6 3 7 8 2 9
6 3 1 2 7 5 8 4 9
1 2 5 3 6 7 4 8 9
2 9 5 1 7 6 4 3 8
7 9 1 5 6 3 4 2 8
2 6 8 5 1 3 7 4 9
1 9 3 6 2 7 4 8 5
3 2 6 8 4 1 7 5 9
7 6 3 9 1 5 4 8 2
1 7 5 9 3 4 6 8 2
3 1 4 5 9 6 8 7 2
7 2 4 8 3 5 1 9 6
4 2 9 1 6 5 8 3 7
7 2 1 9 5 8 3 6 4
3 7 5 8 6 9 1 2 4
7 3 1 4 5 2 9 8 6
1 3 6 8 5 7 4 2 9
5 4 6 3 1 2 9 7 8
7 5 8 2 1 9 6 3 4
5 1 9 8 7 2 3 6 4
8 2 3 5 4 9 1 7 6
5 9 3 8 1 4 7 6 2

8
dy88x7R2-30628850
DkWApIef-60635333
zw1rIJIb-24941778
XeioMWYQ-16041686
Lv9r_Ce_-39009393
HjFcU6Sq-70286254
ZDKNAVL3-01323690
8lvPQWWl-31213738
2 4 6 7 3 8 5 1
1 5 4 7 2 8 3 6
5 3 1 2 8 7 4 6
2 1 7 5 4 3 6 8

18
_Y8Ek6Ib-67729828
GkXsl6JQ-89472948
bClauaL_-09136207
Gvolg4SN-02745261
36THlvpj-72228776
YGv9kjQz-03943802
wu5JQCFy-81282868
oZugIOkx-17640007
kET6T0e_-27369836
zM0ppVxR-89866778
O4yiRsMh-19877764
N3egpsMS-26266277
Jq2s48JW-54499035
_BzwH9LI-87669679
8zoJC5Fk-93305183
zP5f3GrZ-02662647
M6OOVbiJ-66237435
6ixAcGNO-46253674
7 3 12 15 18 5 2 9 14 11 4 10 13 8 6 17 16 1
2 16 17 3 8 5 15 11 18 6 4 10 9 1 7 13 14 12
18 4 6 17 5 2 10 16 11 12 13 9 15 14 3 1 7 8
18 3 2 4 5 6 7 8 9 14 11 12 13 10 15 16 17 1
11 9 17 2 6 14 18 13 4 8 5 1 3 7 15 16 10 12
12 14 9 8 15 10 13 17 7 1 3 6 4 5 2 16 18 11
12 1 4 5 3 11 7 13 2 15 6 9 18 14 10 16 17 8
1 12 15 4 5 6 16 8 9 3 17 2 13 14 10 7 11 18
9 6 4 16 11 18 10 14 13 5 17 8 2 15 7 3 12 1
1 3 2 4 5 6 7 12 9 10 11 8 13 14 15 16 17 18
1 17 3 11 13 18 12 16 7 10 2 9 5 14 15 8 6 4
1 14 5 9 7 15 3 8 12 13 2 18 4 16 6 17 11 10
9 6 13 7 5 15 11 3 4 10 16 18 17 12 8 1 14 2
6 10 12 8 5 18 9 17 11 4 2 16 1 15 7 13 3 14
5 2 6 17 18 1 9 13 12 4 10 16 8 11 15 14 3 7
8 18 4 6 3 13 2 16 14 1 12 5 11 17 7 15 10 9
15 2 3 4 1 8 18 10 16 14 6 9 17 5 11 12 7 13

8
kzxvhucP-59891469
HQt5n4YK-38364535
JCFbtanJ-63077385
I6q7QlG7-92232097
wwq7uym7-84466173
ne_CU3YW-29406196
dHI79UMe-81516086
EN76KoUi-02837833
8 6 3 5 2 7 4 1
6 8 2 7 5 1 4 3
3 5 8 2 4 1 7 6
4 6 2 3 5 8 1 7
5 2 3 4 1 6 7 8
3 2 7 1 6 8 5 4
6 8 5 2 7 4 1 3
1 4 3 7 6 5 8 2
4 7 5 3 6 2 8 1
7 2 6 8 3 4 1 5
3 8 7 2 4 1 5 6
3 1 2 6 8 5 4 7
7 5 8 6 2 1 3 4
7 2 1 5 8 3 6 4
6 1 4 2 5 8 3 7
2 5 3 4 8 7 6 1
1 5 3 8 6 2 4 7
8 2 1 4 7 5 6 3
6 7 1 4 3 2 5 8
1 2 3 7 5 6 4 8
1 8 5 2 3 6 7 4
7 6 2 1 8 4 5 3
2 8 7 4 6 3 5 1
5 8 2 4 3 7 1 6
1 4 7 2 8 5 6 3
6 4 3 2 1 8 7 5
5 1 4 2 6 3 7 8
6 5 2 1 7 4 8 3
7 6 1 2 5 3 4 8
2 8 4 7 6 3 5 1
6 2 8 4 5 1 7 3
3 4 1 7 2 8 6 5
4 6 3 5 7 1 2 8
7 2 3 8 6 5 1 4
3 4 8 5 1 6 2 7
8 5 2 7 4 3 1 6

14
R9NucFNX-65771914
8AFZLEfg-69190081
2odeQM5G-43314675
SrksInAO-24626106
msXYuqPM-34040676
8oRG1Fi6-14631119
DvrDAV2C-12543071
tLtKod3D-11024838
IqdNg229-19847320
h57LPNMo-65409241
rT5qwLes-46462819
Xl7DG0js-46173556
w5A8csCE-83560325
9svGBnDO-60663149
5 8 7 9 14 13 2 10 12 6 3 4 11 1
6 2 3 12 1 11 13 4 7 9 5 8 14 10
13 1 3 5 4 2 6 7 12 9 8 11 14 10
9 8 2 12 3 5 10 14 13 4 7 6 11 1

11
S8czZZ7y-17885659
9Yy6ioVC-38378730
2bhx6emU-66165399
2L2WUC0Z-46821695
2OKvdHuq-22745490
FqSnm23O-72928890
OvMuGnV9-71190616
H_1FGKkn-90072789
67jaNNKq-70403222
QnsZcaJS-93433888
iQ8G7VZL-12371765
9 8 2 7 4 1 6 3 10 11 5
10 5 1 9 3 6 2 8 11 4 7
6 7 5 3 1 8 2 4 11 9 10
3 8 5 9 2 6 11 10 1 7 4
9 4 2 6 11 5 10 3 7 1 8
2 5 7 9 6 1 3 8 11 4 10
4 5 6 8 2 10 7 9 11 3 1
10 5 9 4 3 6 2 7 8 11 1
1 9 5 6 11 2 7 10 8 4 3
7 4 6 9 10 5 3 2 11 8 1
11 9 7 8 4 2 6 10 1 3 5
1 2 6 4 5 3 7 8 9 10 11
9 4 6 2 1 10 3 7 11 5 8
9 11 7 3 5 4 2 6 1 10 8
6 1 10 11 4 3 8 2 7 9 5
5 8 10 4 2 11 6 1 7 9 3
9 2 4 6 1 7 10 11 5 3 8
4 3 2 5 8 11 6 10 9 7 1
7 4 6 8 5 1 11 9 10 3 2
4 8 1 11 2 6 9 7 5 10 3
8 4 3 9 5 1 6 10 2 7 11
7 4 2 3 11 6 9 1 10 8 5
1 2 3 4 5 6 7 8 9 10 11
2 5 7 10 3 11 9 8 1 4 6
9 6 7 8 11 3 1 2 4 5 10
11 7 3 4 1 5 8 6 10 9 2
6 11 5 3 2 8 1 9 4 7 10
11 10 7 6 1 8 3 4 2 5 9
9 3 6 11 4 10 7 5 1 2 8
9 11 8 10 3 7 5 6 2 4 1
3 7 6 2 10 11 5 8 4 1 9
10 2 3 11 5 1 7 6 9 8 4
2 7 6 4 8 10 11 9 1 5 3
1 6 5 7 10 3 9 4 2 11 8
8 5 4 6 2 9 7 10 3 11 1
6 1 2 11 7 4 10 5 9 3 8
4 3 11 7 8 1 2 5 10 6 9
2 3 7 5 8 6 4 9 10 11 1
1 8 7 6 5 10 3 9 2 4 11

18
AYC0pOdI-48816789
8LL18Gbb-98302528
uyccevEA-47400888
pgnsJOtS-98805005
rzQ5beg1-51091643
BLBVo5IU-06714056
yKZ97XAi-34219213
oatshU6a-81945735
J6SpbO7k-43962943
McApL3xr-85285560
9WtKxgO9-63252425
6Ux4z3pS-91393304
Irry2GMj-55331712
k2BkeqXd-39784440
semRtTmv-90807925
Ek0t5MN1-82142328
KoPb7RpY-49565794
ea117mZz-81048823
7 17 1 2 14 18 3 5 10 6 9 12 15 8 13 11 16 4
9 2 17 4 15 6 7 8 1 11 10 3 13 14 5 16 12 18
15 7 6 18 3 12 1 4 13 11 10 8 14 9 16 5 17 2
16 17 8 1 9 6 18 2 14 12 15 3 11 5 7 10 13 4
5 3 11 7 15 4 9 14 2 17 8 13 10 12 6 18 16 1
10 13 6 1 4 17 11 18 12 15 2 8 5 7 16 9 3 14
13 2 6 7 5 1 14 18 3 11 4 15 10 12 8 16 17 9
10 2 17 4 3 6 7 5 9 16 11 1 13 14 8 15 12 18
3 17 2 15 8 11 14 7 13 1 9 12 18 4 10 5 6 16
15 14 13 18 8 6 12 3 16 1 10 9 7 5 11 17 2 4
6 13 8 7 17 5 14 12 10 1 2 4 15 11 16 9 3 18
14 16 17 7 5 8 3 18 15 13 9 4 12 6 1 2 10 11
16 8 13 12 7 14 17 9 15 11 10 4 5 2 1 18 3 6
6 10 15 13 2 14 16 11 17 1 3 9 18 8 12 7 5 4
12 18 11 8 14 7 6 13 9 10 2 15 16 5 4 3 17 1
1 10 7 2 4 17 12 9 14 18 11 5 13 6 3 8 16 15
17 2 9 7 11 5 15 8 6 13 16 3 10 18 12 14 4 1
16 11 2 13 5 8 17 9 3 4 12 1 6 15 7 14 10 18
11 12 14 6 16 5 7 2 13 3 4 9 15 1 8 17 10 18
13 8 12 4 16 10 9 7 1 15 2 6 5 17 3 11 14 18
6 15 13 14 5 16 18 7 3 1 10 8 9 2 4 11 17 12
10 6 8 15 4 12 2 18 9 14 7 16 17 1 11 13 5 3
13 17 6 15 8 10 4 18 14 12 1 9 11 7 2 16 3 5
6 17 14 9 3 10 15 1 2 18 7 5 16 13 12 8 4 11
11 3 9 1 4 8 10 18 5 6 15 17 7 2 12 14 16 13
11 8 6 1 18 2 14 10 7 9 13 3 17 4 15 16 12 5
11 8 6 1 10 9 15 17 7 14 4 13 18 12 5 3 2 16
16 10 14 6 12 4 17 7 15 11 1 13 3 18 2 8 9 5
14 3 1 17 8 10 18 15 2 7 6 16 4 11 12 9 13 5
9 1 5 4 16 18 11 8 12 17 15 10 14 6 7 2 13 3
11 10 17 8 2 3 9 15 14 1 18 12 6 4 7 16 13 5
9 8 18 15 17 4 10 16 3 7 14 1 13 6 5 11 2 12
4 16 14 15 11 12 2 7 8 10 3 6 13 5 18 9 17 1
1 5 4 3 10 8 2 6 13 12 11 16 7 9 14 17 15 18
12 17 7 14 15 2 3 10 4 9 18 1 6 8 16 13 5 11
17 6 15 11 2 3 5 1 18 13 7 10 14 9 16 12 4 8
14 2 3 18 5 6 7 17 9 10 11 12 13 1 15 16 8 4
18 15 13 10 6 17 5 8 14 16 1 4 12 9 7 3 11 2
10 16 1 13 4 17 3 12 2 5 14 9 8 18 11 6 7 15
8 14 1 3 6 12 18 4 13 7 11 2 15 5 16 10 9 17
11 2 16 17 6 7 12 14 5 10 3 13 4 1 9 15 8 18
5 6 7 2 13 4 1 16 11 3 9 14 12 17 8 15 18 10
12 10 7 17 15 6 1 14 4 2 18 8 9 16 13 11 5 3

1
Ey8uYV0c-45614657
1
1
1
1
1
1
1
1
1
1
1
1
1
1
1
1
1
1
1
1
1
1
1
1
1
1
1
1
1
1
1
1
1
1
1
1
1
1
1
1
1
1
1
1
1
1
1
1
1
1

3
vLiCbTCB-49994067
bNfOYl0V-04556701
D5lSMTzy-75048840
2 3 1
3 1 2
3 1 2
1 2 3
1 3 2
1 2 3
1 3 2
3 1 2
2 1 3
2 1 3
3 2 1
1 3 2
1 3 2
1 2 3
3 2 1
2 3 1
1 2 3
2 1 3
1 3 2
1 2 3
3 2 1
2 3 1
1 3 2
2 1 3
2 3 1
3 1 2
3 2 1
1 2 3
2 3 1
1 3 2
3 1 2
1 2 3
2 3 1
3 2 1
3 1 2
2 1 3
3 1 2
2 1 3
3 2 1
3 1 2
1 2 3
3 2 1
2 3 1
3 1 2
2 3 1
1 3 2
1 2 3

9
48C_w3mw-24331513
8AJdLzTS-86429136
GfSkb3_g-08037793
w_MorNC8-38638064
h97rqcy3-24599086
YKi4ODHK-67824664
MhuSKfIo-00894270
SmmyijMX-10835294
_dDVilgJ-56278625
1 7 4 6 3 9 2 8 5
5 8 6 9 3 1 4 7 2
5 8 2 3 4 9 1 6 7
2 9 6 8 4 7 1 5 3
7 2 3 1 5 9 4 8 6
2 5 8 1 4 3 6 9 7
6 9 3 5 7 4 8 1 2
5 8 6 1 4 9 2 3 7
8 7 4 3 6 2 5 9 1
3 8 7 5 4 9 6 2 1
4 2 1 6 5 3 9 7 8
1 3 9 2 7 5 8 6 4
7 2 6 3 9 5 4 1 8
7 1 6 2 5 3 9 8 4
9 2 3 5 1 7 8 6 4
4 9 1 7 5 2 3 8 6
7 2 6 3 8 9 5 4 1
6 2 8 4 3 5 7 1 9
7 6 3 4 5 9 2 1 8
5 1 6 8 9 3 2 7 4
1 2 3 4 5 7 9 8 6

4
i3WLoZb6-36562808
XBsDn5lu-24732300
s5_wpsbB-31511183
FeV_TAsH-19042070
1 3 4 2
1 4 3 2
1 2 4 3
2 1 3 4
3 2 4 1
2 3 4 1
4 1 2 3
3 4 1 2
4 3 2 1
1 4 2 3
2 1 4 3
3 2 4 1
4 2 1 3
3 1 2 4
1 3 4 2
2 3 1 4

16
xH4Q5gvL-58665024
on6ICKdL-21769725
qWdExQHH-17194622
gcH3ptB_-25789269
cFqjKmUN-53082263
fvDHQa5d-21436256
bCQ1BeB_-14645013
VS0oR20D-02949496
ZRhjO5UY-06961712
rg6idWIg-16689717
NbbkzhSq-04521299
K9p5ilRc-61882599
qMj1Y7vK-59929135
5sZXyjD3-99077805
MLvL0jd4-47650584
rVr3FOOb-31112491
2 3 6 13 4 9 15 16 8 12 11 5 7 14 1 10
7 10 6 5 15 3 11 1 12 14 9 16 2 4 13 8
1 2 3 4 5 9 7 8 6 10 11 12 13 14 15 16
2 13 5 12 10 1 15 16 7 11 9 3 6 8 4 14
1 4 7 13 5 6 8 2 16 10 11 14 12 3 15 9
4 9 7 15 14 11 2 6 12 13 8 10 16 1 5 3
10 5 4 3 11 1 9 7 2 15 16 8 13 6 12 14
12 11 9 6 1 7 13 14 2 10 3 4 15 8 16 5
4 6 3 7 9 5 11 16 14 10 1 12 8 2 13 15
2 11 3 13 6 14 10 9 1 16 15 12 7 5 4 8
1 11 15 16 3 7 12 2 4 14 6 8 13 5 10 9
2 15 10 3 14 12 9 6 4 16 8 7 13 1 11 5
12 9 8 16 10 5 13 2 1 14 6 4 7 11 3 15
2 1 16 4 13 6 7 8 9 10 11 3 5 14 15 12
10 4 5 1 13 15 14 6 11 3 9 8 16 7 2 12
3 5 12 15 8 6 4 2 13 14 7 11 1 16 10 9

17
J8HdniEM-71918508
bv7djgNS-06604966
5jHC3Mot-98610713
C38RW_zX-39529501
RvYm_Rz6-88805111
DSbtvkBD-12414668
HeXNKq24-86575492
54Ca_r29-58869910
pF7cSg5m-80317598
K30KEmYz-86383888
Tv8UnLjQ-30306138
TSoVDGKF-61575222
663xxlM0-90065059
7DP3GaL1-96033397
9I_nshQl-05172226
xAJqtneq-83535954
EyS_dvzo-76644415
14 8 13 16 15 5 2 17 12 10 11 7 1 3 9 6 4
3 10 4 16 2 7 11 14 5 13 6 8 12 1 15 17 9
13 14 10 8 5 6 15 17 1 11 2 12 4 9 3 7 16
14 7 1 8 11 9 15 2 4 16 17 12 6 13 5 3 10
16 1 4 17 6 8 10 3 2 12 13 15 5 14 7 11 9
16 6 14 10 9 1 7 5 3 4 11 13 15 17 12 8 2
7 3 5 14 16 6 10 12 4 2 15 8 13 9 11 1 17
13 11 7 15 5 6 2 16 1 17 3 8 10 14 9 12 4
11 17 5 16 10 14 1 6 15 4 2 9 3 7 13 8 12
14 1 17 9 15 8 16 4 6 2 13 3 12 10 7 11 5
4 6 17 7 9 3 15 2 12 10 14 16 11 13 5 8 1
16 2 6 17 4 10 1 11 9 14 7 13 5 8 15 3 12
13 4 17 14 15 3 1 16 2 6 9 8 11 7 12 10 5
17 7 1 10 15 2 8 12 5 4 13 14 16 11 9 6 3
1 15 16 6 13 3 9 11 7 5 14 2 10 4 17 12 8
1 15 5 4 12 13 2 17 16 9 8 7 6 3 11 10 14
6 16 3 5 4 7 14 10 8 13 9 12 1 11 15 2 17
11 15 2 4 5 8 12 9 3 13 7 1 10 14 16 6 17
11 2 7 9 1 6 17 3 15 10 5 12 8 14 4 16 13
8 4 1 11 14 2 5 12 6 13 10 3 9 15 7 16 17
3 1 8 2 11 7 15 14 13 17 9 10 4 12 16 6 5
1 15 8 10 14 2 13 3 11 17 6 7 12 5 9 16 4
2 14 9 4 10 13 3 11 16 6 15 5 12 8 17 7 1
14 2 3 4 15 17 16 6 9 10 11 12 5 8 13 7 1
7 12 4 11 16 5 1 13 14 2 9 8 17 6 3 15 10
5 1 6 14 12 17 4 15 16 10 8 3 13 11 2 9 7
1 2 14 11 5 7 15 8 3 12 9 10 6 13 4 16 17
1 2 3 4 5 6 7 8 9 10 11 12 13 14 15 16 17
10 14 9 4 16 6 17 13 12 11 8 1 5 3 7 2 15
12 7 4 6 5 2 10 13 11 15 1 14 3 16 17 8 9
14 1 13 15 11 5 6 8 9 12 16 10 17 2 4 7 3
10 1 14 9 6 17 8 12 2 16 7 3 15 5 11 13 4
3 16 17 13 4 10 6 14 7 12 1 5 15 9 2 8 11
17 2 13 16 3 11 9 15 8 1 5 4 10 6 12 14 7
15 5 12 9 3 11 7 1 6 10 4 14 17 2 13 16 8
2 15 13 6 17 7 4 5 11 9 10 14 16 8 1 3 12
12 5 9 17 16 7 2 10 3 1 8 14 4 6 11 15 13
11 9 14 8 15 4 6 10 7 17 16 3 1 5 12 13 2
14 11 3 15 7 5 2 10 1 17 16 6 4 9 12 8 13
12 14 11 15 17 9 10 4 6 2 7 16 13 1 3 5 8

15
KCFbef7p-25273649
C7vj48n1-01585282
A5cJh30t-96696628
er7J4HG8-09527084
WP1_OXPF-19272905
Oeq2SaI4-35200287
JbrQdCzA-28238110
wMfjrjBt-15461529
I5K32CCv-50744304
uacjla04-14197659
v0edguJo-06600550
I4rNvjI5-77483961
1VB4unkY-46002313
S1sTEI2U-65603412
hoN4uUMA-65933305
10 2 11 8 13 6 12 15 14 7 9 5 4 3 1
3 10 12 1 15 9 8 14 13 2 6 5 11 7 4
9 12 10 3 6 11 13 8 14 7 4 2 15 5 1
14 3 4 15 12 9 1 7 13 10 8 11 5 2 6
15 7 12 9 4 11 13 8 5 1 14 6 3 10 2
2 7 10 12 1 9 3 15 8 5 6 14 11 13 4
13 4 7 5 14 12 11 10 15 6 2 9 3 1 8
15 3 1 11 9 5 10 12 7 6 2 8 13 14 4
12 5 11 2 9 14 4 8 1 13 3 10 15 7 6
14 6 15 12 13 11 9 2 3 4 7 8 5 1 10
14 13 8 5 2 11 10 1 7 12 6 3 15 4 9
5 13 11 15 8 1 10 4 6 14 2 3 12 7 9
11 3 12 8 6 2 13 7 1 10 4 15 9 5 14
3 7 13 8 14 15 11 1 6 4 5 10 9 12 2
12 5 10 3 4 11 14 1 9 7 8 15 13 2 6
11 4 12 3 5 7 9 13 8 2 14 10 1 15 6
11 5 12 9 7 3 8 13 1 15 4 2 14 10 6
9 5 13 3 10 14 15 1 2 7 11 8 4 12 6

19
2HVdrCRs-61012944
IUYqdf2m-04084341
4IVU0BK0-50237180
aF1Gl1lT-86208367
beVDXuNP-74422713
xuxSSbjv-63312353
URFwr7nJ-76351035
qVRFnh7D-89854212
36bXSYmT-65906226
xX7fLhxZ-58280419
mD2pWhFq-20301570
6AIB9qwf-73903760
9T7tM7iB-90441215
CB72erL6-12013943
ZGaJqE4u-02241846
Jn1fu13W-17103098
g9GrLRF3-58003192
eDcWtuag-05680073
INzic9_8-83123256
3 18 11 9 15 19 8 12 5 6 4 17 10 13 2 16 7 1 14
10 2 9 13 14 11 6 8 17 3 1 18 7 16 19 15 5 4 12

13
8QX5LPXo-34822806
vp1HWnyO-32949335
piH9Nwjr-06051014
M7XJGrfB-46277098
8atJJWnm-62993916
yyHDB7mL-86255075
2si7hoPR-90942044
8YAFGbXw-47767829
ySH8Jucb-78370972
VVayvLON-63398256
76nDdlGy-86123180
MX8rWBl9-89570751
NyI5TdWq-52302760
11 8 3 13 1 9 12 6 10 5 4 2 7
8 11 5 13 3 9 4 12 7 2 10 6 1
4 6 7 1 10 11 9 5 3 8 13 12 2
1 5 10 12 4 6 7 11 3 8 13 9 2
13 9 7 5 4 8 10 6 2 12 11 3 1
2 3 11 6 4 10 5 8 12 9 13 1 7
9 11 10 7 12 2 6 4 8 1 13 5 3
10 4 3 6 9 2 8 5 13 7 12 1 11
11 6 1 3 8 9 7 2 4 5 12 10 13
8 13 12 2 5 3 7 1 6 10 11 9 4
2 11 13 1 12 4 7 3 9 10 8 5 6
13 4 1 8 2 3 10 12 6 5 11 9 7
5 1 12 9 3 13 2 10 6 4 8 11 7
1 2 6 4 9 5 12 3 8 7 11 10 13
5 1 6 11 12 2 8 3 7 10 4 9 13
1 2 11 3 6 13 8 5 7 10 9 4 12
3 12 4 11 6 13 2 8 10 5 1 9 7
1 13 11 12 10 3 8 5 6 7 9 4 2
6 8 4 12 13 11 1 10 3 2 9 7 5
1 9 7 13 6 3 5 10 2 8 11 12 4
1 5 2 6 8 9 13 3 10 4 7 12 11
2 1 8 11 9 3 7 12 10 5 6 13 4
1 2 3 4 5 6 13 8 9 10 11 12 7
2 7 9 11 4 10 8 5 6 3 12 1 13
5 2 4 3 10 12 7 11 13 6 1 8 9
1 5 3 6 2 4 7 8 13 10 12 9 11
2 1 5 9 10 12 8 6 11 13 3 4 7
13 12 7 6 4 3 2 9 1 5 8 10 11
12 2 10 3 9 1 5 6 8 13 11 4 7
1 10 3 4 5 13 7 6 9 2 11 12 8
4 10 6 9 2 7 5 11 12 8 13 3 1
3 10 9 7 6 13 11 1 12 8 2 4 5
2 10 5 7 11 4 12 9 6 1 3 8 13
13 11 5 2 7 4 10 1 8 9 3 6 12
13 10 7 3 8 2 1 11 9 6 4 12 5
5 3 12 10 9 11 8 1 13 6 4 7 2
3 7 2 5 1 13 6 12 9 4 10 8 11
10 1 3 4 12 6 7 8 2 11 9 5 13
12 4 13 10 1 6 3 11 9 8 2 5 7
4 8 2 6 3 13 10 1 9 5 12 11 7
11 6 9 12 8 5 4 7 13 1 3 10 2
2 1 3 7 4 6 8 11 9 5 10 13 12
10 13 1 8 7 6 3 2 4 9 5 12 11
9 11 10 7 6 8 3 12 13 5 1 4 2
6 3 13 12 7 11 8 1 10 2 5 4 9
12 6 1 4 8 9 13 10 11 2 7 3 5
11 12 4 2 6 3 8 10 1 7 13 9 5
1 2 3 4 5 6 7 8 9 10 11 12 13

17
gwcLCt_m-38512989
UioC5mza-11015765
pQtY1MR2-55720087
lMidKoXI-01621457
zq8z0Db4-04919978
vYxKqRIw-13727674
69Y60Qi0-20536449
2oJ8e8Ln-77817005
6sb6Y5_k-30493489
eHTk0SRm-10061749
irkFnrGY-41212801
9yF2SBFv-42231781
vah8C9Dl-66065115
77HMaN52-40562325
PD3JQpLJ-69286222
RV1IHSbe-01538014
01aVpnJB-71554287
3 1 2 7 14 16 12 11 9 17 4 13 15 8 5 6 10
9 4 3 13 6 11 10 12 16 1 2 15 17 5 14 7 8
1 6 14 5 15 7 4 12 17 13 2 9 16 3 11 10 8
8 12 14 7 5 15 3 17 9 2 11 4 6 10 13 16 1
9 11 2 15 1 13 16 6 17 4 14 3 8 12 7 10 5
4 11 10 2 1 12 7 8 9 17 14 3 13 6 16 15 5
2 14 3 12 7 10 9 13 16 5 15 8 4 17 11 6 1
15 17 7 9 1 6 11 10 8 13 3 5 14 4 12 16 2
8 16 1 13 15 4 5 2 11 12 7 14 6 9 10 3 17
17 4 14 16 2 8 10 15 11 6 1 7 3 5 9 12 13
12 15 6 14 9 17 2 11 5 13 16 10 1 3 8 7 4
10 1 11 4 8 5 3 14 13 17 15 16 7 12 9 6 2
12 13 3 2 1 6 11 10 9 15 14 8 7 4 16 17 5
15 7 9 2 8 14 4 11 1 13 16 12 3 10 17 6 5
1 2 3 4 5 6 17 8 7 10 11 12 13 14 15 16 9
1 3 9 4 2 6 17 8 5 10 7 12 13 16 11 14 15
14 8 4 9 5 16 1 17 12 15 3 13 7 10 6 2 11
12 5 4 11 8 17 14 16 9 2 10 7 6 15 1 3 13
1 15 3 4 5 6 17 2 9 10 11 12 7 14 8 16 13
6 17 10 5 9 2 11 4 3 16 1 8 12 13 7 14 15
6 10 13 15 14 17 5 8 3 1 11 9 7 2 4 16 12
7 16 15 9 11 14 3 1 10 8 12 17 5 4 2 13 6
1 12 16 13 4 9 3 8 7 6 17 15 10 14 5 2 11
1 2 3 4 6 16 13 8 9 10 11 12 7 14 15 5 17
1 2 3 4 5 6 7 8 15 10 16 12 13 14 9 11 17
1 2 3 4 5 6 7 8 9 10 11 12 13 14 15 16 17
13 6 1 10 5 4 9 12 11 3 2 14 8 17 7 15 16
15 11 5 6 2 9 12 4 17 8 13 7 14 3 10 1 16
12 14 1 13 6 9 10 8 17 5 11 15 16 3 7 4 2
4 12 5 2 10 7 3 15 17 16 11 6 1 13 8 14 9
6 15 16 13 7 4 12 14 8 2 11 9 1 3 17 5 10
1 12 4 3 5 8 16 6 9 10 11 15 7 14 2 13 17

8
i98WqTrc-79205430
AiwrisTW-61620964
60Y7ApYC-43172972
6uCCsUAF-11767350
IugNPnsi-60051023
OPdb10vZ-18403892
YRn04RP_-53844957
aruiKodW-90991430
1 3 5 4 8 6 7 2
3 2 4 7 6 8 5 1
5 2 4 6 1 7 3 8
2 3 5 7 1 6 4 8
7 8 6 4 3 5 1 2
5 4 3 1 8 2 7 6
7 1 4 5 8 2 3 6
3 2 6 1 8 4 7 5
4 8 1 3 5 7 2 6
2 8 1 5 3 6 7 4
4 2 7 3 6 1 5 8
5 2 8 3 4 6 1 7
7 4 1 6 8 3 5 2
6 1 4 5 3 7 2 8
4 6 7 5 8 2 1 3
3 7 6 2 5 1 8 4
6 4 8 3 5 7 1 2
4 5 2 6 1 7 8 3
8 2 1 6 7 4 3 5
8 6 7 1 2 4 5 3
5 8 4 7 6 2 3 1
3 1 4 8 5 2 7 6
2 4 7 3 8 5 1 6
1 2 4 6 7 3 5 8
1 4 3 6 7 8 5 2
3 8 5 7 4 6 1 2
8 3 6 7 2 5 1 4
1 5 7 6 4 3 2 8
5 6 4 7 8 2 1 3
6 1 4 7 8 3 2 5
3 6 7 4 2 8 5 1
4 1 3 8 2 7 5 6
8 6 3 4 1 7 2 5
7 2 4 1 8 3 6 5
1 3 4 2 7 8 5 6
6 4 8 5 1 2 7 3
7 5 4 8 2 3 6 1
7 8 1 4 3 5 6 2
2 3 4 6 8 1 5 7
4 7 3 6 2 5 8 1
4 3 5 8 1 6 7 2
6 3 4 1 7 2 8 5
2 5 4 7 8 3 1 6
1 4 7 8 6 2 3 5
7 8 1 3 4 6 5 2
3 7 1 4 6 8 2 5
7 3 1 4 6 8 2 5
5 1 4 7 6 8 2 3
8 7 3 1 5 4 6 2

9
Gf6yJoj7-14758187
Xakj0BFa-10997930
54Ma4oDH-66519839
RzYj5QEX-55463183
ht6OleWG-31599200
7i6iXSjA-73270200
sPRpASJN-98040576
wjUHNLoq-36834446
UMoYT2eN-77259068
7 2 8 1 3 9 4 5 6
2 5 3 7 4 1 6 9 8
4 2 6 8 9 1 5 7 3
4 5 9 2 1 7 8 3 6
8 1 3 4 6 9 5 7 2
6 7 9 2 3 8 1 4 5
5 9 6 7 2 8 4 1 3
8 2 9 1 7 4 5 3 6
9 6 5 1 8 3 2 7 4
2 5 6 1 3 8 7 9 4
2 5 9 6 4 1 8 3 7
8 3 7 2 9 4 5 1 6
1 7 6 8 4 3 9 5 2
1 5 2 7 8 4 6 9 3
1 2 5 9 3 4 7 8 6
8 2 5 4 3 6 7 1 9
1 3 2 4 5 6 7 8 9
5 3 8 7 6 9 1 2 4
4 6 3 9 8 7 2 5 1
7 2 8 4 1 9 5 3 6
5 4 6 2 8 1 9 3 7
3 9 6 2 8 4 7 5 1
1 4 7 9 2 3 5 8 6
3 7 8 9 4 6 2 1 5
7 4 5 6 9 1 2 3 8
6 7 5 8 1 2 3 4 9
6 8 1 4 5 9 2 7 3
1 2 3 4 5 6 7 8 9
9 8 2 3 7 4 6 1 5
5 9 2 8 3 4 6 7 1
1 9 2 6 7 8 4 3 5
4 7 3 9 1 2 8 5 6
9 1 7 6 3 4 5 2 8
8 5 7 6 3 4 2 1 9
7 8 1 9 6 5 3 4 2
7 2 4 9 1 8 5 6 3
3 7 4 5 9 6 8 2 1
5 6 8 3 1 4 7 9 2
6 8 7 4 2 3 9 1 5
4 1 8 2 9 3 6 5 7
6 3 8 1 9 7 2 4 5
8 3 5 9 4 6 7 1 2

10
wxng1S3D-38939241
k_kTiWAO-14688099
NNpNDDu0-65422373
Y4u3XTSu-50071940
5EZKsVz3-64186768
UZHPFN2B-59331207
kvSP6Jco-07070374
jC3iLe10-00454891
HNvODa86-35409761
Rre5vdSo-59067594
4 10 1 5 7 9 3 2 6 8
7 6 10 4 3 2 9 1 5 8
8 9 3 6 1 7 4 10 2 5
6 4 2 9 8 7 10 3 1 5
1 9 7 4 5 10 8 2 3 6
6 3 4 7 8 9 5 1 10 2
6 10 7 4 5 9 1 3 8 2
5 6 7 1 8 2 4 9 10 3
1 4 3 6 10 2 8 9 7 5
1 6 2 7 8 3 10 9 5 4
1 10 2 3 8 7 6 5 9 4
9 6 7 3 2 5 1 4 10 8
10 7 5 6 9 1 4 3 8 2
6 5 10 2 3 8 9 1 4 7
2 9 8 1 4 3 5 7 6 10
4 3 10 7 8 2 6 5 1 9
4 6 2 3 7 1 10 9 5 8
6 1 9 3 8 10 5 7 4 2
6 8 9 7 10 3 4 2 1 5
9 7 6 10 3 2 8 4 1 5
7 6 9 1 8 10 3 4 5 2
4 10 9 6 1 3 5 2 8 7
10 1 9 5 3 8 2 7 6 4
10 6 3 2 4 5 7 9 1 8
9 1 6 10 2 7 8 3 4 5
6 2 8 10 3 4 5 1 7 9
5 9 2 3 4 10 1 6 8 7
3 8 1 5 6 10 9 7 2 4
1 2 9 6 5 4 10 8 3 7
1 2 8 10 4 5 7 6 9 3
9 8 3 4 5 6 7 2 10 1
5 8 1 7 4 6 2 3 9 10
1 5 7 8 4 6 2 9 10 3
1 2 7 10 3 6 5 4 8 9
1 2 4 3 10 6 7 8 9 5
4 1 3 8 10 7 5 9 6 2
3 10 4 1 7 9 8 6 2 5
1 10 5 2 8 9 3 4 7 6
1 10 9 2 3 5 7 6 4 8
5 10 7 6 1 4 8 2 3 9
1 9 2 10 4 5 6 8 7 3
6 3 4 2 8 5 7 1 10 9

4
o1xhS1Se-62774151
a_4bOxCB-76763530
Xpzo1O3n-99992103
oYTf1PJ4-91117661
4 1 3 2
4 2 3 1
3 1 4 2
3 2 4 1
1 2 4 3
3 1 2 4
3 1 2 4
4 1 3 2
3 2 4 1
3 2 4 1
1 4 3 2
2 1 4 3
2 3 1 4
3 2 4 1
1 3 4 2
1 3 4 2
2 3 4 1
1 3 2 4
2 3 1 4
1 4 2 3
1 2 4 3

6
Mq24tDyY-09614168
2layDkva-08064151
GLiXK1hs-91754570
2bmLsNsq-99623474
HEjAjH6r-83570903
fshDv4Kk-20067906
6 5 3 4 1 2
2 3 6 5 4 1
6 3 1 4 5 2
5 4 1 2 6 3
5 6 1 4 2 3
3 1 2 5 4 6
1 4 6 3 2 5
3 2 1 6 5 4
2 1 3 6 5 4
6 2 1 3 4 5
3 1 5 2 6 4
5 1 3 4 2 6
4 1 6 2 5 3
5 6 2 3 1 4
2 6 5 1 4 3
3 1 6 2 5 4
2 5 1 3 4 6
5 1 2 4 6 3
2 6 1 3 4 5
1 3 4 5 6 2
4 2 3 6 1 5
2 3 6 5 4 1
6 4 2 1 3 5
4 5 2 6 1 3
3 6 1 4 5 2
6 5 4 3 1 2
1 5 6 4 3 2
2 5 6 4 3 1
3 2 4 5 6 1
6 1 5 2 4 3
1 4 2 3 5 6
3 5 6 4 2 1
1 6 2 5 4 3
5 1 3 6 4 2
6 2 3 4 5 1
1 6 5 2 4 3
2 6 5 3 4 1
5 1 4 6 2 3
1 3 4 2 5 6

20
nwGSwEHj-98278067
cylnXZyG-44477564
XqoBQG75-22912522
Pihr0TWO-65868572
m2Sz3i9Y-46017290
OOyLzLcz-55857279
2xSQ8m7P-07256383
tQ90JwDS-69042241
8QhJT1lU-44847929
Dn4nof87-57949537
wAhdrKQh-03410949
iZhc0D4g-93558146
77guNYFr-48289177
FNJz5BUr-22316410
l5hsrp8M-40483223
aPouVdMh-14386142
e4dOuDrg-55865179
vB4dEbst-42716831
YZxNwqJ5-54764541
ztpNFF0W-81484895
16 15 12 17 7 13 3 9 5 19 10 14 6 8 2 4 11 20 1 18
16 8 6 17 2 14 19 10 5 1 9 4 7 15 3 13 11 18 20 12
16 18 3 2 20 9 5 7 1 8 15 13 4 14 6 17 12 10 19 11
1 16 3 4 5 6 7 8 9 10 11 12 13 14 15 2 17 18 19 20
1 2 3 8 5 6 7 4 9 10 11 12 20 17 15 16 14 18 19 13
1 2 10 4 5 6 7 8 9 3 11 12 13 14 15 16 17 18 19 20
8 2 18 7 19 6 5 16 9 11 15 4 20 14 10 1 17 12 3 13
15 4 2 12 10 14 17 19 13 9 7 1 8 11 20 18 5 16 6 3
18 1 15 4 7 9 20 8 12 14 13 3 5 19 10 17 6 16 11 2
12 1 17 3 5 14 9 13 2 10 18 8 15 11 19 16 20 7 4 6
1 20 3 14 9 19 4 7 17 10 11 6 2 16 12 15 13 18 8 5
7 2 3 19 5 6 4 8 1 12 11 10 9 17 20 16 15 13 18 14
2 3 18 17 4 14 5 19 6 8 9 7 15 11 1 16 20 12 10 13
7 9 19 12 1 4 5 16 17 15 8 13 14 20 10 3 18 11 2 6
15 13 11 2 7 5 1 8 9 14 3 6 18 4 12 16 19 17 20 10
4 19 18 12 9 14 6 8 13 20 16 7 15 10 3 17 11 2 5 1
1 16 14 19 10 8 5 17 6 15 2 3 12 9 20 11 18 13 7 4
11 17 6 20 15 1 13 2 10 9 5 8 7 12 14 3 18 19 16 4
6 14 11 19 15 12 5 1 8 13 20 2 18 17 9 10 16 3 4 7
16 20 10 14 8 12 11 2 15 5 17 18 19 6 4 9 1 3 7 13
15 16 20 7 1 11 19 12 6 18 2 8 17 13 5 10 4 9 3 14
19 2 18 20 17 9 6 14 13 11 8 12 5 3 4 1 15 16 7 10
14 2 13 5 1 18 7 16 4 10 19 12 9 3 15 11 20 6 8 17
1 2 3 13 8 15 5 10 16 17 11 12 7 14 6 9 4 18 19 20
5 2 3 10 7 4 9 11 13 19 20 16 6 14 8 12 18 17 1 15
15 2 20 11 14 5 12 8 18 17 6 7 3 19 9 13 16 10 1 4
13 6 2 11 4 12 19 20 15 18 14 9 16 10 3 8 17 1 7 5
8 10 9 19 13 4 16 12 6 2 1 7 18 5 15 14 20 11 3 17
16 13 1 19 3 10 17 11 4 14 15 8 12 7 5 20 6 18 2 9
5 7 17 2 14 16 3 11 9 6 13 12 19 4 15 18 8 20 1 10
17 8 11 10 7 13 1 3 5 19 15 20 6 4 16 2 12 14 9 18
6 1 12 4 15 2 16 3 5 13 18 20 14 9 19 17 10 7 11 8
1 2 3 9 16 18 11 8 4 10 20 6 13 14 15 5 17 7 12 19
9 8 10 14 18 16 5 4 12 6 3 15 17 13 1 2 20 7 11 19
14 5 16 13 20 15 1 11 3 12 17 8 7 9 4 6 2 10 18 19
1 9 3 4 7 2 10 8 6 5 13 12 19 14 11 16 17 18 15 20
19 5 8 12 3 14 2 1 7 10 11 16 20 15 6 13 4 18 17 9

8
_jZilSWy-91650891
KZ02RdMo-01625122
SzY2vzss-10827000
ODFQ75nh-78899413
DTKmDtPI-28665542
7lm5TSxW-39821374
QcH8xdfS-48419473
Q9nswN1I-57284507
4 6 7 8 2 3 1 5
7 3 5 4 2 8 6 1
6 7 2 8 4 5 3 1
7 3 5 4 6 1 8 2
2 3 5 6 8 7 1 4
7 8 6 4 5 3 1 2
1 2 5 7 6 3 8 4
8 3 7 1 2 4 5 6
4 7 2 3 6 1 5 8
8 1 4 3 2 5 6 7
8 2 7 4 6 5 3 1
2 8 4 7 3 5 6 1
7 3 8 4 1 6 2 5
5 8 3 4 6 1 7 2
7 8 1 4 5 6 2 3
1 7 8 3 5 2 6 4
3 2 8 1 5 6 7 4
6 1 5 4 8 3 7 2
1 6 5 8 3 7 2 4
7 4 6 5 1 3 2 8
3 4 8 1 5 6 7 2
4 1 6 7 2 5 8 3
8 2 3 5 1 4 6 7
1 6 4 5 8 7 2 3
8 2 5 1 3 6 7 4
4 7 1 8 5 2 3 6
8 5 3 4 2 6 7 1
8 5 4 7 1 3 6 2
7 2 5 3 4 6 1 8

18
g6iE3SqA-23210524
we_CZ0C9-83439916
QE7kqftX-61121627
ifzRiIF0-43794686
2UAncwqI-15477397
0mkKbTEc-45776262
h9RoeSsu-82246800
QQoTLXjU-22254491
fpY8oYfw-94013289
O4xHjgsh-17700740
he47mxJr-94631554
Rs_cHXIV-35359528
zhsnYBa4-26064634
hgu0UvOk-32225055
JbPGFeGW-92360581
AgBhXMyv-80141093
6_po_WDs-76228789
DSq10lW7-03912840
9 10 7 16 5 8 18 13 2 15 4 6 12 14 17 1 11 3
2 17 9 7 5 4 6 3 10 14 18 12 16 13 11 8 1 15
12 2 4 18 6 5 8 15 3 1 7 17 9 13 10 14 16 11
4 16 13 8 9 15 3 5 12 1 18 17 2 7 10 11 6 14
14 4 12 6 13 16 5 11 15 3 10 8 7 1 18 2 17 9
15 7 1 3 5 4 17 8 9 10 16 13 12 2 11 6 14 18
4 13 11 10 17 5 18 2 8 14 9 6 15 16 7 3 1 12
9 18 1 7 6 5 17 13 4 16 15 3 14 11 2 10 8 12
10 1 17 4 12 16 9 7 6 8 18 11 14 5 2 3 15 13
15 7 17 6 1 14 9 12 8 10 5 18 11 2 3 16 4 13
15 3 6 11 4 1 18 5 10 17 9 7 13 16 8 2 12 14
3 14 18 12 5 2 17 1 16 15 6 11 8 10 7 9 4 13
2 13 15 4 9 14 5 18 12 6 3 1 10 17 11 8 16 7
4 1 15 14 9 2 5 6 10 18 11 8 7 3 13 17 16 12
2 17 14 12 1 8 4 7 9 3 16 18 10 15 6 5 11 13
4 14 16 8 9 2 12 11 6 7 5 1 10 17 15 3 13 18
4 3 11 2 18 1 10 5 6 17 9 12 13 15 7 8 14 16
3 15 2 6 14 12 1 16 4 17 5 9 8 11 13 7 10 18
12 11 10 18 13 7 4 5 14 15 2 6 16 8 3 1 17 9
10 6 12 14 4 2 9 15 17 18 7 11 3 5 16 8 13 1
8 13 10 9 5 16 2 3 11 4 17 7 6 18 15 14 12 1
5 14 10 9 11 4 13 17 8 2 15 1 3 18 7 6 12 16
12 4 8 7 2 3 9 13 15 11 18 5 16 17 14 1 6 10
13 2 5 17 16 6 1 10 14 15 8 12 3 9 18 7 11 4
5 2 3 4 1 6 7 8 9 10 11 12 13 14 15 16 17 18

13
6j0v85ww-56448547
5CWk_DQ_-44644359
OUb7bJC0-66884563
VXvZDbO1-53623220
XdbkhUiW-04598797
UQjRbrUZ-60179976
Be1epqX7-41156223
W19YBFX_-57244071
0LR2MEUO-80467020
SmKKccaw-45232896
yOTA18Tc-33492144
cSMtt_cA-01962861
ai4gv6f5-72621900
12 4 5 9 10 1 7 8 2 6 11 13 3
6 4 13 1 5 10 7 3 11 8 9 12 2
9 5 12 13 11 1 7 2 6 3 8 10 4
1 7 2 4 8 10 6 5 9 11 13 12 3

6
3PFLB74x-28427015
ZxYHbSW9-66565565
dvzs9n73-95924619
qL9aeDTB-54225990
SxwHtdlZ-27548639
_HPBIMed-00640100
4 6 2 1 5 3
6 2 1 5 3 4
3 1 2 4 6 5
2 4 5 3 6 1
2 6 3 5 4 1
1 6 3 2 4 5
3 2 6 1 5 4
4 3 1 5 6 2
4 3 1 6 2 5

10
l12MN_9h-34939154
HsYnjuU5-73519190
BAGYNhMk-13868353
5e_fjuB0-99035313
npjyIQXr-44143156
trXC_KPV-72057523
e6mhSMcQ-28521320
pATaulUA-21035454
HwRpesQV-27111286
0xNOAVpp-44649963
1 9 3 5 8 4 7 6 2 10
1 4 2 9 3 10 5 6 8 7
1 7 5 2 9 10 3 6 8 4
2 3 5 8 10 7 1 4 9 6
1 10 8 7 3 6 2 4 9 5
1 4 2 10 9 5 3 7 6 8
7 10 4 1 8 3 6 9 5 2
6 4 5 9 7 2 10 3 1 8
2 9 7 3 10 4 1 5 6 8
1 5 10 9 7 8 4 6 3 2
8 9 7 5 1 4 6 2 10 3
2 8 7 4 3 5 9 6 1 10
8 10 5 2 1 9 6 3 4 7
1 2 7 4 10 6 5 8 9 3
2 10 3 9 8 4 7 6 5 1
3 9 10 2 6 7 8 5 1 4
9 2 10 6 1 3 4 5 8 7
4 2 9 8 1 3 5 10 6 7
1 3 2 7 4 5 6 10 9 8
7 10 5 8 3 1 6 9 4 2
5 10 8 7 4 2 1 9 3 6
4 1 3 6 9 7 5 8 10 2
8 3 2 5 10 1 7 6 9 4
1 3 6 4 7 9 10 2 5 8
10 9 5 6 1 4 8 7 3 2
4 2 1 6 5 7 10 8 9 3
6 7 4 9 10 8 2 5 3 1
9 10 3 4 6 7 8 2 5 1
6 10 9 5 4 7 3 8 2 1
1 6 10 7 2 3 5 9 8 4
3 5 7 2 6 8 1 9 10 4
8 7 2 1 9 10 6 4 3 5
2 5 8 7 6 10 1 3 4 9

4
bwDB5JgW-46433675
aArRkeRj-64873333
VSEPmURq-81894831
0C22LOwh-39927639
1 4 3 2
4 1 2 3
3 2 4 1
1 2 3 4
3 2 1 4
3 2 1 4
3 2 1 4
4 3 2 1
3 2 4 1
4 3 2 1
4 2 1 3
1 3 4 2
1 2 3 4
4 2 1 3
2 1 4 3
4 1 3 2
4 1 2 3
2 3 4 1
2 3 1 4
2 3 1 4
4 1 3 2
1 2 3 4
2 1 4 3
2 1 3 4

13
ezC8qa0y-04614357
RvPjsp3f-10969200
VZGUcCkx-03818965
kDGqoxGf-61042389
GrvjuWpV-14185338
D3hqTH7a-57465477
JUENoTht-69112876
zUaHI361-29686725
qpo0B8eJ-16273228
9wflsH7M-28675870
XH229stG-12581851
G8NEDDgH-47307796
Jprsv6Wk-94441601
2 5 1 9 6 8 10 3 13 7 12 4 11
4 13 10 6 2 5 12 3 7 1 9 8 11
9 3 11 2 6 4 13 7 5 10 12 1 8
9 2 12 10 13 8 6 1 4 5 7 11 3
11 12 3 5 10 6 9 4 13 7 8 1 2

19
vMwmHsM5-50917531
Ud3zSJEG-32659005
Po_gmPur-49692529
Y6NDFKc7-23478565
haytOQ7X-74711375
_ZQpcodu-62389564
kc_CLPHZ-23100653
rHpLBHob-10040993
fuRclWhe-29859494
7RNhNNVl-66133222
bykAcCDY-06040288
71wxFBJw-08236765
7DUxPg5i-39176617
Lq4y0kRs-26503542
evhV4Ru1-70709262
eRWTslED-92237239
lOB15I3Q-27749295
5RM9QQaJ-96938532
Ja6O0pL3-10933428
12 14 1 7 6 18 3 8 9 4 17 13 10 5 15 16 2 11 19
9 19 15 2 5 4 10 12 13 3 11 6 18 14 7 8 17 1 16
19 17 11 5 18 8 15 16 3 6 9 7 14 10 1 2 4 13 12
1 16 13 5 6 4 17 10 15 12 9 14 18 8 19 11 7 2 3
1 11 18 4 5 15 7 8 9 3 6 12 13 14 2 16 17 19 10
4 13 8 11 9 14 16 19 17 12 10 2 7 18 6 1 5 15 3
19 6 1 16 9 12 14 15 2 5 7 17 4 18 3 11 8 10 13
15 11 6 3 17 13 4 16 19 7 12 18 2 8 10 5 9 14 1
18 8 13 4 14 7 6 15 1 9 10 11 17 3 2 16 12 5 19
17 14 5 18 16 13 2 10 1 3 8 11 15 4 12 7 9 6 19
11 9 18 19 12 10 5 7 4 17 2 13 15 16 8 14 3 6 1
18 16 8 4 9 3 19 13 11 5 6 2 1 7 17 15 14 10 12
17 16 3 18 6 2 15 13 10 11 9 19 1 7 8 14 5 12 4
14 17 5 18 4 2 1 10 6 19 3 15 9 16 8 12 11 13 7
1 16 5 4 3 13 7 9 2 10 11 8 6 14 15 18 17 19 12
1 4 3 10 5 12 17 8 11 7 19 9 13 2 15 16 6 18 14
6 16 4 7 11 18 14 15 2 5 10 1 9 17 3 13 12 19 8
3 11 10 5 6 16 18 4 9 8 15 2 7 1 19 17 12 14 13
1 2 6 3 14 16 7 8 5 10 17 12 13 4 15 9 11 18 19
3 11 16 2 4 6 7 9 1 17 13 8 19 18 15 14 12 10 5
12 7 3 4 5 17 2 18 10 15 16 9 1 6 13 11 14 8 19
7 3 2 13 1 18 8 17 6 12 4 14 16 5 10 9 15 11 19
1 2 3 4 5 6 7 8 9 10 11 12 13 14 15 19 17 18 16

12
SWxPZJZB-13806861
vhMBDFV4-21993980
dsQnHz0s-09878749
zY9kcZkJ-21762878
TzRFmSTZ-19252530
yjfSLUjt-51257897
wF_wiYw0-85785443
Y98Vv_8W-81860420
pnDd8MGH-26811732
5t0fpJoS-44032657
Oe83pSUG-44645431
QjIUsEq8-19278191
10 12 6 5 2 1 3 11 8 7 9 4
1 4 3 6 2 9 10 11 5 7 12 8
1 2 3 4 5 6 7 8 9 10 11 12
9 7 8 2 10 11 12 4 1 6 3 5
7 5 1 6 4 3 9 10 12 8 11 2
3 7 5 8 1 2 6 4 11 12 9 10
1 2 3 4 5 6 7 8 9 10 11 12
12 11 2 9 10 6 4 1 3 8 7 5
10 12 5 2 4 11 1 9 3 7 8 6
12 1 4 7 9 6 10 11 3 5 8 2
6 2 3 10 4 9 11 8 7 1 5 12
6 8 10 5 2 9 1 3 11 4 12 7
5 4 6 11 10 1 8 7 12 3 9 2
6 8 2 10 3 5 11 12 9 1 7 4
12 3 9 7 11 1 2 5 8 6 4 10
7 10 3 9 6 4 2 12 11 1 5 8
3 6 9 12 11 10 7 5 4 1 8 2
11 7 9 8 4 5 3 10 2 12 1 6
9 6 2 7 8 1 5 10 3 12 4 11
2 10 6 4 12 8 9 7 11 5 3 1
7 10 2 9 12 4 11 3 8 5 6 1
2 1 8 10 9 11 12 7 3 5 4 6
3 5 10 4 7 12 8 9 2 1 6 11
5 3 11 4 9 8 1 10 7 6 2 12
2 11 9 8 10 4 6 1 7 12 3 5
5 9 11 10 8 6 12 7 3 1 4 2
1 5 3 8 10 12 7 6 11 4 2 9
10 4 5 3 9 7 11 2 1 6 8 12
1 7 5 6 10 3 4 2 12 8 11 9
7 11 9 8 10 2 5 1 3 12 6 4
10 12 5 7 4 1 3 2 11 6 9 8
1 2 3 9 12 5 7 8 4 10 11 6
3 9 11 1 12 4 7 5 10 6 8 2
4 11 12 6 3 9 5 7 1 2 8 10
8 2 1 3 5 9 11 10 4 7 6 12
4 10 1 8 6 11 5 2 3 12 9 7
2 11 5 6 7 4 10 1 9 3 8 12
3 1 10 8 5 11 4 7 2 12 6 9
3 12 4 5 1 6 7 9 11 10 8 2
10 1 3 6 5 2 9 8 4 11 7 12
2 9 6 10 5 7 4 3 1 11 8 12
6 3 9 4 7 1 11 2 5 8 12 10
6 3 7 2 8 1 9 11 4 12 5 10
7 11 6 3 5 12 2 4 9 10 8 1
7 2 4 9 1 5 11 6 8 3 12 10
8 9 3 4 1 10 7 11 5 6 12 2
11 9 6 8 7 10 4 12 1 2 3 5
5 10 11 7 2 12 1 9 8 6 3 4

15
PKhQGgoC-06529118
JYZQ2LdC-94859775
oqxDFF67-73384672
yTaNQs33-36995305
XPhrTNtd-00488382
on_Bo53p-12156386
0DbN0o6e-47465876
HiP7jlMl-78642990
Ec94_qM8-69911456
jWX_99NI-94291086
2xEk6EeH-37008310
2r8pO8sT-76119560
3zrln8Yt-80059594
6IMaHStf-77965612
R0EECibf-91705514
12 3 13 7 4 5 1 8 10 14 11 6 2 9 15
2 12 7 4 9 15 3 14 5 10 11 6 1 8 13
4 6 10 8 1 9 15 7 11 14 3 13 12 2 5
1 2 3 4 5 13 7 8 9 10 11 12 6 14 15
15 11 2 1 3 6 8 5 13 7 12 4 14 9 10
9 4 8 7 3 10 2 5 14 15 1 12 11 13 6
1 2 3 4 9 6 7 8 5 10 11 12 13 14 15
11 13 7 3 6 12 8 9 4 15 1 14 2 10 5
8 7 3 5 4 14 12 2 1 10 9 13 15 6 11
13 9 15 3 10 2 5 4 1 12 7 8 11 14 6
15 1 13 12 11 7 4 3 2 9 5 6 10 14 8
1 14 3 6 13 9 7 12 8 10 11 4 5 2 15
1 11 14 5 12 4 13 7 2 9 6 8 15 3 10
15 7 5 1 4 3 11 12 9 6 14 2 13 8 10
5 13 15 6 2 12 11 4 10 14 9 7 8 3 1
7 2 5 14 10 1 15 9 13 8 11 12 3 4 6
8 11 10 13 15 1 4 3 5 6 2 12 14 9 7
13 4 10 12 15 1 7 9 3 14 8 11 6 2 5
2 12 13 4 9 15 6 7 14 11 1 5 8 10 3
13 7 12 4 15 1 10 6 3 8 14 9 2 5 11
2 9 13 1 5 12 10 8 6 7 11 3 4 14 15
3 5 14 11 1 8 13 12 7 9 10 6 2 4 15
3 2 1 4 5 6 7 8 9 14 11 12 13 10 15
13 1 14 2 15 4 7 9 11 12 5 3 6 8 10
6 2 14 4 5 13 1 8 9 7 11 3 15 10 12
7 4 14 8 9 13 6 1 15 11 2 3 12 10 5
5 3 8 6 15 13 7 11 9 14 2 1 12 10 4
15 1 5 13 2 11 4 14 7 10 3 6 12 8 9
15 9 10 8 5 3 1 4 12 11 14 6 7 2 13
8 2 6 11 14 12 7 9 4 1 15 13 10 5 3
15 9 14 3 5 12 8 4 7 2 13 11 6 10 1
15 11 1 14 2 8 3 6 5 9 12 7 4 13 10
1 15 3 4 5 8 7 14 11 10 9 2 12 6 13
9 15 12 10 8 13 14 6 3 2 5 7 1 4 11
9 6 2 8 10 3 14 15 12 5 13 7 1 4 11
11 12 7 6 3 14 5 9 4 10 8 15 2 1 13
11 14 12 4 13 10 6 9 15 7 2 3 8 5 1
10 5 3 4 2 6 14 8 7 15 11 12 13 9 1
14 10 8 12 9 1 3 7 6 4 5 11 13 2 15
13 6 5 2 10 15 14 9 12 1 11 3 7 4 8
3 1 2 10 4 11 13 12 14 9 6 7 15 8 5
5 2 9 6 14 8 12 10 15 7 13 11 3 1 4
8 12 7 5 2 14 11 10 3 6 4 1 13 9 15
8 1 4 15 9 10 13 6 7 5 12 2 3 14 11
11 12 3 4 7 6 13 1 9 15 14 5 10 2 8
11 5 15 10 13 12 6 2 8 14 4 3 1 9 7
7 13 3 5 9 15 11 2 4 10 1 12 14 6 8

13
E2GOdKTM-29797893
u4XpF4t7-60067722
j7SfVXmW-09983520
twO5t6cE-70188671
JDrfAGRA-42335784
hQ8GQ3rf-28159987
LQSyLIqW-00786584
hcyRhb5y-82258898
pvv_UXvp-85020614
bujCzFBw-32714421
NH6jRd9W-15452800
cbikDjKN-17030549
ptldXhCw-95168900
11 4 2 9 5 7 1 13 8 6 12 10 3
12 5 8 2 7 3 13 9 6 11 10 1 4
1 7 3 10 12 5 2 4 9 8 13 11 6
1 2 3 4 5 6 7 8 9 12 11 10 13
7 13 8 4 1 9 3 12 6 10 2 11 5
6 10 12 4 7 5 1 2 9 3 11 13 8
1 2 7 8 11 12 6 10 5 3 9 13 4
4 8 13 3 6 2 11 12 5 7 9 1 10
12 7 5 8 1 3 10 11 6 9 2 13 4
13 1 7 5 6 4 10 12 9 8 2 3 11
3 10 1 6 4 8 11 2 13 5 7 9 12
11 13 3 1 6 12 9 8 4 2 5 10 7
13 4 10 5 1 12 7 11 8 6 3 9 2
7 2 10 4 8 1 13 9 5 12 6 3 11
2 12 9 11 5 1 3 8 6 10 4 13 7
4 2 8 13 12 6 9 1 7 5 11 3 10
6 13 8 5 1 7 3 10 2 11 9 4 12
10 12 9 7 3 11 8 5 1 6 13 4 2
13 4 1 2 8 10 12 3 11 7 5 9 6

4
J9XakjDg-38101531
2oHs8pQI-00385729
01zPmfNT-68641854
L3P46bGZ-91713088
2 4 1 3
4 2 1 3
4 2 3 1
4 3 1 2
2 1 4 3
2 3 1 4
3 1 2 4
3 2 1 4
3 2 1 4
1 3 2 4
4 2 1 3
4 3 1 2
3 2 1 4
3 4 1 2
4 1 2 3
3 2 1 4
4 2 3 1
2 1 4 3
4 2 3 1
3 1 2 4
1 2 3 4
3 2 4 1

15
FnOVt_69-38275021
Y5jvh8f0-30129235
yu2PDH17-48925857
MoLdcrno-14641608
IveeYkk_-87416260
IwiyeqH2-37679884
_r9qwM_D-42406291
8zhdG_bU-27331696
UPSCue1W-28657754
SJf1WQ31-31955908
1P_Kjd9q-76824660
aFx5Gmlf-95833219
3sC2r0Ui-94117553
6c3HKt1I-05952807
BthQnbSW-87650341
6 2 1 11 3 15 8 7 5 10 13 4 12 14 9
6 1 4 8 14 12 2 11 13 3 7 9 5 15 10
1 5 6 15 12 7 11 14 9 8 3 4 2 10 13
15 11 7 14 4 5 1 3 12 10 13 2 9 6 8
12 14 15 6 5 7 8 9 13 10 1 3 11 4 2
13 15 9 8 3 2 14 10 12 1 7 5 4 11 6
12 2 3 4 5 6 7 8 15 1 11 10 9 14 13
2 1 13 4 5 3 7 8 14 10 11 12 6 9 15
4 14 5 15 12 10 11 3 2 13 9 7 8 6 1
12 2 13 6 5 8 9 4 15 10 7 11 1 14 3
3 10 2 6 11 13 1 12 4 5 7 15 8 14 9
11 3 14 4 5 2 9 8 12 10 13 6 15 7 1
12 11 4 5 7 3 6 1 9 15 13 10 2 8 14
13 15 3 7 11 6 10 1 14 2 9 5 12 8 4
8 11 5 4 7 15 12 1 9 13 10 3 14 6 2
9 5 6 11 15 8 10 3 12 7 13 2 14 4 1
1 4 14 15 13 6 3 9 2 7 8 11 5 10 12
5 2 10 3 15 6 11 8 1 14 9 12 13 7 4
7 12 6 2 10 8 11 9 3 5 14 13 1 15 4
1 11 3 15 13 7 10 6 9 4 2 5 14 12 8
11 2 6 5 13 10 9 3 1 7 4 8 12 14 15
2 11 8 3 13 12 6 1 10 5 14 7 9 15 4

13
Vs_loVgQ-25056408
qx2ihkTM-57050878
Tm1YG1gt-70369750
jvEplpAA-83783185
C5fIrEID-33347088
aRIuGOde-66088009
UTnYfD97-61481920
JsSDwyLh-21323683
oMCSaLbK-86132200
4cI79sR8-49103013
uq5Q_h0s-23696679
9so6RyFX-94958179
VQMngq3b-79906100
2 10 1 11 12 8 13 3 5 7 9 6 4
8 7 11 5 3 9 2 4 10 13 1 6 12
6 13 3 7 8 9 2 1 12 10 4 11 5
12 2 10 1 6 9 11 7 8 4 13 5 3
10 7 5 13 4 2 3 12 8 1 9 6 11
2 8 7 1 10 12 11 9 3 13 4 5 6
6 7 2 10 13 3 9 5 8 11 12 4 1
10 13 2 6 5 1 12 4 7 9 8 11 3
6 7 11 1 8 3 10 12 5 13 2 9 4
3 9 8 5 13 1 6 11 10 4 2 7 12
11 5 7 6 3 2 9 12 13 4 1 10 8
2 11 9 4 8 7 1 3 10 6 5 12 13
5 2 3 9 10 13 1 7 11 4 12 6 8
11 5 4 2 8 9 3 1 6 10 7 12 13
4 1 7 8 13 12 11 2 10 5 6 9 3
4 11 12 1 10 7 8 3 9 6 2 13 5
1 13 3 4 5 9 10 11 2 7 8 12 6
1 11 3 4 9 6 7 10 5 8 2 12 13
1 7 4 13 8 11 9 5 6 12 3 2 10
10 13 1 5 6 11 3 7 9 4 8 12 2
12 2 5 4 8 6 7 13 3 9 11 10 1
5 10 6 12 1 7 2 13 4 3 8 11 9
11 2 3 6 8 12 10 5 9 4 7 1 13
12 13 2 5 11 8 7 9 10 3 6 4 1
2 9 3 11 4 8 7 5 13 12 1 6 10
10 7 6 5 2 13 3 8 1 11 12 4 9
1 2 11 5 12 6 7 3 13 4 8 9 10
8 6 4 10 12 5 1 13 2 9 11 7 3
2 1 8 11 6 3 7 10 4 12 5 9 13
1 2 6 10 4 11 13 3 5 12 8 9 7
3 4 12 7 9 8 5 10 6 2 1 13 11
1 2 8 10 11 6 7 4 3 5 9 12 13
5 12 9 2 1 8 6 7 4 3 11 10 13
1 3 6 2 4 8 10 9 11 5 7 13 12
5 2 7 12 3 9 13 10 11 6 1 8 4
6 11 2 12 13 1 8 7 4 5 9 3 10
6 2 12 1 10 11 7 5 9 3 8 4 13
3 8 10 13 7 4 6 11 2 5 1 9 12
13 1 6 8 2 11 12 9 3 4 7 5 10
6 7 3 13 1 2 4 5 10 9 12 8 11
10 6 7 2 8 5 12 13 11 9 3 4 1
1 4 6 3 11 10 2 8 12 7 9 5 13
1 3 11 7 4 12 13 6 8 2 9 5 10
5 7 8 9 13 11 1 3 6 2 10 4 12
4 10 13 11 5 9 12 7 8 2 3 1 6
12 5 9 6 1 4 3 7 11 2 10 13 8

9
lOQJNvqL-07930186
IL3WKwOp-72338621
uxp1Ash_-41199131
CDn2aSfz-43155174
3scFriPd-33852828
u2qo_Bgo-87625205
sJ7CaiMA-71935826
Dlgti3QT-87525388
wVyhl4BF-10145405
5 9 2 1 4 6 3 8 7
6 9 1 3 4 8 2 7 5
8 6 9 7 2 4 5 1 3
2 5 1 4 9 8 6 7 3
1 4 7 3 8 2 9 6 5
1 5 3 7 4 2 6 8 9
7 3 8 2 4 5 1 9 6
9 1 7 3 8 6 2 5 4
2 5 4 6 7 1 9 3 8
6 5 9 7 3 2 4 8 1
8 6 9 5 2 4 7 3 1
4 3 7 8 2 1 5 6 9
5 6 7 3 2 9 4 1 8
5 4 2 8 9 1 6 7 3
8 4 6 2 1 9 3 7 5
1 9 7 3 4 5 6 8 2
6 4 2 9 3 8 5 1 7
1 7 6 8 9 3 5 2 4
2 4 6 7 1 8 3 9 5
2 7 3 4 9 8 5 6 1
6 9 7 2 4 8 1 3 5
1 8 3 5 6 9 4 7 2
1 8 6 3 4 7 9 2 5
8 6 7 5 9 4 1 2 3
3 2 1 5 4 9 6 8 7
1 7 6 8 4 9 3 2 5
4 1 7 8 5 6 3 9 2
4 6 2 1 7 3 8 5 9
6 2 8 3 4 5 9 7 1
3 4 5 9 7 8 1 2 6
6 5 2 4 7 1 9 3 8
5 1 2 7 8 3 9 6 4
7 2 6 1 8 3 5 4 9
7 8 9 6 5 3 4 1 2
9 5 8 4 1 6 7 3 2
9 5 7 1 3 2 6 8 4
6 4 1 8 2 3 5 9 7
7 3 9 4 1 8 2 5 6
5 2 7 1 6 4 3 8 9
5 9 1 3 4 8 2 6 7
6 1 3 5 9 8 7 2 4
8 4 3 2 5 6 9 7 1
7 1 4 9 5 6 3 2 8
9 6 5 7 2 4 1 3 8
3 6 8 9 4 2 7 5 1

4
ZaYSGt_3-36965616
iu2TXdPr-55060283
GlIC8t3Y-77890978
PA5m2Vsy-64919059
1 2 4 3
4 1 2 3
3 1 4 2
3 4 2 1
1 3 2 4
4 1 3 2
3 2 4 1
2 1 4 3
1 2 3 4
1 2 3 4
2 3 4 1
3 4 1 2
1 4 3 2
3 2 4 1
4 1 2 3
4 1 2 3
3 4 2 1
4 2 3 1
4 2 3 1

2
JzWwUo1I-84214699
4LsaYT1o-47385583
1 2
1 2
2 1
2 1
1 2

18
S_DvcKYP-27525021
aCelNlPK-56727269
Xb3ZcyX9-45350932
ga0xwDKz-51774560
1n0MRMWK-08037926
6uwY4rgK-07292823
WuwxdCZE-36745559
deDqqDeS-51289534
tW8fjVVj-18949140
hrq89CWU-26104560
_Berfmd6-98465559
BojjAKL1-08686239
JnKvkKMH-58024420
qexFRR95-65993042
NIbfWqQw-98103216
QVMzQ239-26222107
EGlHLfeK-91261052
aUeDtZp5-95912219
16 9 2 5 11 14 6 17 13 1 10 15 3 12 7 4 8 18
1 9 3 5 10 7 16 8 14 12 18 15 13 17 6 4 2 11
7 17 6 14 5 11 8 13 2 10 4 16 18 1 3 15 12 9
14 5 1 7 8 10 17 16 2 11 6 15 12 9 18 13 4 3
12 2 18 17 3 6 8 4 13 7 11 14 1 10 15 16 5 9
13 9 2 18 12 14 4 8 16 1 10 6 5 11 3 7 17 15
1 3 14 17 16 6 15 7 2 5 4 13 18 9 11 12 10 8
1 2 3 16 12 6 7 8 11 10 15 9 5 4 14 13 17 18
13 5 14 4 11 1 18 2 9 7 6 12 3 10 15 8 17 16
18 15 7 10 17 6 11 16 2 3 8 1 14 4 5 9 12 13

10
E7D0fCH0-08618264
yekSuZMA-52187679
DQ92ABWJ-32980718
Tz0vFFc4-60354561
pY4Eq7iJ-58423311
rZQuquqQ-54881004
UyusZxuz-89759439
PaCtCl6w-62301396
3nvqZfqW-03805463
i80C70tU-87458364
9 1 2 8 5 10 3 7 4 6
3 7 8 10 6 9 4 1 2 5
5 9 6 3 7 8 4 2 10 1
7 10 5 9 6 3 2 1 8 4
10 1 6 8 9 3 4 5 2 7
8 7 9 5 6 10 1 4 2 3
4 10 1 7 3 8 5 6 2 9
6 8 5 4 7 3 10 2 1 9
6 7 3 8 5 1 2 10 9 4
1 8 2 4 3 7 10 6 5 9
8 6 5 1 2 3 10 4 9 7
9 7 1 2 3 8 5 4 6 10
4 7 1 6 5 3 10 9 2 8
1 3 2 4 8 7 5 6 9 10
6 1 5 3 9 8 10 7 2 4
2 1 7 10 5 4 9 3 8 6
1 6 3 8 9 7 10 2 4 5
8 4 2 6 5 7 3 1 9 10

2
rd2J2BKV-42147958
59wM3l2Z-16482826
2 1
1 2
1 2
1 2
1 2
2 1
1 2
1 2
2 1
1 2
1 2
2 1
1 2
2 1
2 1

5
jcDPCfx_-97397952
7zPNAY5H-42619618
XpoyAVEf-90949705
pswxMVlD-30245169
tthJ9Eje-68816595
3 2 4 5 1
3 2 4 5 1
5 3 2 4 1
3 5 4 1 2
5 3 1 4 2

2
V4aVgbjM-62930317
tKCtpauc-99027371
2 1
1 2
2 1
1 2
2 1
1 2
1 2
2 1
2 1
2 1
1 2
1 2
1 2
1 2
2 1
2 1
1 2
1 2
2 1
1 2
1 2
1 2
1 2
1 2
1 2
1 2
2 1
2 1
1 2
1 2
2 1
1 2
1 2
1 2
1 2
1 2
1 2
2 1
2 1
2 1
2 1
2 1

9
YIgMjQDz-51015999
oF0IOx94-33886162
Fr1FQ80B-95244969
mKeuCqJJ-43431180
KBXMLTVr-91976263
Jjq6cKcB-16094496
kEqEfccf-69753411
G6bL4Pqk-08840092
WoypGujq-49104460
2 5 6 7 4 9 3 1 8
1 6 2 9 3 5 7 4 8
3 2 4 6 8 9 1 5 7
3 9 6 8 2 1 7 4 5
7 9 4 8 2 1 5 6 3
4 8 7 5 1 3 6 9 2
8 9 3 2 7 5 1 6 4
6 9 1 7 5 2 8 4 3
3 4 7 9 8 6 2 5 1
2 3 8 7 4 6 9 1 5
3 4 8 1 2 7 5 9 6
1 7 6 3 2 8 4 9 5
1 2 7 4 8 5 3 6 9
3 7 2 5 1 4 9 8 6
5 2 8 4 1 7 3 9 6
1 7 3 4 8 2 5 9 6
2 5 3 6 1 8 4 9 7
3 7 5 9 6 4 8 1 2
8 5 3 4 1 2 7 6 9
1 7 3 4 5 9 2 6 8
4 2 1 8 7 9 3 6 5
4 6 8 7 5 1 9 2 3

17
kBXso2Lb-88128341
gYQY0jsC-90454692
9q52Q83i-39545634
MtcAvZc6-72566227
ldoSDQyO-35650040
uz2_njOb-66112762
iZMHsVJa-48359569
6Yer_H7S-72722943
9Ye84Hjg-83331789
QW0pgFu2-72481506
6HgoYWHR-86522159
rGR8MYXO-33172857
uMAAC7eQ-80004929
8Ax0JESw-13544137
GV5vOqYE-32388115
EsHqLZDs-25753943
v8_Qk3zh-58337400
4 6 3 7 16 15 11 17 2 14 1 9 13 10 12 5 8
16 3 9 17 4 1 11 10 2 7 8 15 13 14 5 6 12
9 13 3 8 11 17 16 10 12 6 4 7 2 1 14 15 5
2 9 11 12 4 8 7 3 10 14 13 1 5 6 17 15 16
17 1 7 2 9 11 8 15 3 16 12 6 4 10 13 14 5
4 8 9 16 15 1 10 17 6 14 12 7 3 13 11 5 2
12 17 16 9 1 5 4 3 15 14 13 8 7 6 2 11 10
16 13 15 2 1 11 17 5 9 14 6 7 12 3 10 4 8
4 12 2 5 10 1 8 6 7 17 14 13 15 9 11 3 16
1 2 5 4 9 17 7 8 3 10 12 11 13 14 15 16 6
13 1 3 14 2 6 7 8 10 4 11 12 9 16 15 5 17
13 2 12 14 15 8 5 3 11 4 16 10 17 6 9 1 7
5 14 3 17 2 1 12 4 7 13 9 16 11 6 8 10 15
7 8 6 17 10 4 15 5 3 12 13 1 9 14 2 11 16
10 13 16 6 7 5 15 1 11 3 9 14 4 12 17 2 8
4 16 15 13 1 7 10 5 11 6 3 12 8 9 2 17 14
11 4 17 6 14 16 8 10 9 15 2 5 13 12 7 3 1
2 10 17 1 7 15 11 12 14 6 16 4 13 5 9 8 3
1 2 3 4 5 6 7 8 9 10 11 12 13 14 15 16 17
15 12 11 8 13 7 16 5 17 3 14 6 4 10 1 9 2

1
YbN0GsJx-10453076
1
1
1
1
1
1
1
1
1
1
1
1
1
1
1

3
Jm5HDZpY-38516752
jPLTwLnP-50515349
GsayyICQ-61348606
3 2 1
1 2 3
2 3 1
3 2 1
2 3 1
1 2 3
2 1 3
1 3 2
1 2 3
1 2 3
2 3 1
2 3 1
1 2 3
1 2 3
1 2 3
2 3 1
2 1 3
3 1 2
1 2 3
3 2 1
1 2 3
3 1 2
3 1 2
2 1 3
1 3 2
2 3 1
1 2 3
2 3 1
2 3 1
2 3 1

7
QTixWxan-75303918
OaaaQzmB-81894674
SJPgh30d-43890083
v1uNDY_N-21217126
Dep85rM_-29790612
dZttxF6X-05435830
JkN3PEeh-26165946
2 5 6 4 1 3 7
4 2 6 7 3 5 1
3 5 1 6 7 4 2
