20

11 6
14
r 5 5 e
t 5 1 n
f 6 1 w
h 1 0 w
f 7 1 n
t 9 5 e
f 1 5 w
r 1 4 e
t 2 2 s
h 4 3 s
h 8 2 e
r 9 1 n
h 9 4 s
r 4 2 w
17 7

4 8
11
f 0 7 s
f 1 6 e
h 1 2 w
f 3 0 n
h 1 1 e
f 2 3 w
t 0 4 w
r 0 3 n
r 0 2 w
r 2 2 w
h 2 1 n
12 12

6 7
5
r 5 0 w
t 0 4 e
r 4 4 e
r 0 5 n
f 3 0 e
16 16

2 7
7
r 0 5 n
r 1 1 s
f 1 2 n
r 1 0 n
t 1 4 n
t 0 3 e
f 0 1 w
19 7

3 3
3
t 0 0 s
r 1 2 e
h 0 2 n
5 4

2 9
9
f 0 3 n
h 1 2 w
t 0 7 e
r 1 0 w
t 1 6 w
t 1 7 n
f 0 2 e
f 0 4 n
r 0 8 w
11 5

8 7
11
f 3 5 n
r 1 5 s
t 4 5 n
h 6 6 n
r 3 1 s
t 5 1 w
t 2 6 s
t 6 1 s
f 6 2 e
r 4 2 n
h 6 3 w
16 6

7 2
3
t 2 0 s
t 1 1 s
f 6 0 n
20 19

4 7
5
t 3 6 s
r 2 1 e
h 1 5 s
h 0 0 e
h 3 0 s
14 7

7 11
30
t 6 2 w
r 2 2 w
r 1 1 w
r 0 1 w
h 5 6 s
r 1 9 s
t 3 5 e
h 1 3 e
h 5 1 n
r 3 10 n
r 6 6 n
h 1 7 e
r 1 5 w
t 2 9 n
f 4 5 w
h 0 6 n
r 6 8 e
f 5 9 e
t 6 10 s
h 4 6 s
r 6 0 s
t 4 7 n
f 3 0 e
r 3 3 e
f 4 2 s
h 1 10 s
r 5 4 e
t 6 4 e
f 2 7 e
r 4 3 n
12 8

7 4
11
r 5 0 w
f 0 0 e
t 4 1 s
t 0 2 e
h 6 0 s
h 6 1 n
f 1 1 s
t 1 0 e
h 3 0 s
f 6 3 e
t 2 1 n
11 5

4 3
1
r 1 0 e
3 2

2 5
1
r 0 0 e
1 1

5 2
3
h 1 0 w
h 2 0 e
h 3 0 w
1 1

10 6
3
h 2 1 n
r 4 0 s
f 5 3 s
4 4

5 10
6
h 3 3 n
t 0 5 s
f 4 1 s
f 3 1 s
f 0 7 w
t 1 8 s
11 10

4 6
7
f 1 3 n
r 3 2 s
t 0 3 s
t 2 1 s
r 1 1 n
h 2 3 s
r 3 1 n
8 3

11 7
25
t 6 0 n
t 10 5 n
f 5 0 w
t 1 1 e
t 1 0 s
t 2 5 w
h 6 6 e
h 0 3 w
h 2 3 s
f 10 0 s
r 10 1 s
h 0 2 s
f 8 3 w
f 1 5 n
t 5 1 w
f 10 4 n
t 7 1 w
f 9 1 n
f 6 5 e
r 8 5 e
r 6 3 w
h 3 1 s
f 7 2 w
f 6 4 w
r 0 6 n
8 1

4 9
1
t 0 1 w
13 2

2 7
3
f 1 0 s
f 1 4 s
f 1 5 w
11 8
