*** Darwin 4x16 ***
Turn = 0.
  0123456789012345
0 ................
1 .....t..........
2 ..r.............
3 ................

Turn = 7.
  0123456789012345
0 ................
1 .....t..........
2 ................
3 r...............

Turn = 14.
  0123456789012345
0 ...r............
1 .....t..........
2 ................
3 ................

*** Darwin 10x6 ***
Turn = 0.
  012345
0 ......
1 ......
2 ......
3 ......
4 ......
5 ......
6 ...r..
7 ......
8 ......
9 ......

Turn = 3.
  012345
0 ......
1 ......
2 ......
3 ...r..
4 ......
5 ......
6 ......
7 ......
8 ......
9 ......

Turn = 6.
  012345
0 ...r..
1 ......
2 ......
3 ......
4 ......
5 ......
6 ......
7 ......
8 ......
9 ......

Turn = 9.
  012345
0 .....r
1 ......
2 ......
3 ......
4 ......
5 ......
6 ......
7 ......
8 ......
9 ......

Turn = 12.
  012345
0 .....r
1 ......
2 ......
3 ......
4 ......
5 ......
6 ......
7 ......
8 ......
9 ......

*** Darwin 15x13 ***
Turn = 0.
  0123456789012
0 .............
1 .....h.......
2 .............
3 .............
4 .............
5 .............
6 .............
7 .............
8 .............
9 .............
0 .............
1 .............
2 .............
3 .............
4 .............

Turn = 1.
  0123456789012
0 .............
1 ....h........
2 .............
3 .............
4 .............
5 .............
6 .............
7 .............
8 .............
9 .............
0 .............
1 .............
2 .............
3 .............
4 .............

Turn = 2.
  0123456789012
0 .............
1 ...h.........
2 .............
3 .............
4 .............
5 .............
6 .............
7 .............
8 .............
9 .............
0 .............
1 .............
2 .............
3 .............
4 .............

Turn = 3.
  0123456789012
0 .............
1 ..h..........
2 .............
3 .............
4 .............
5 .............
6 .............
7 .............
8 .............
9 .............
0 .............
1 .............
2 .............
3 .............
4 .............

Turn = 4.
  0123456789012
0 .............
1 .h...........
2 .............
3 .............
4 .............
5 .............
6 .............
7 .............
8 .............
9 .............
0 .............
1 .............
2 .............
3 .............
4 .............

Turn = 5.
  0123456789012
0 .............
1 h............
2 .............
3 .............
4 .............
5 .............
6 .............
7 .............
8 .............
9 .............
0 .............
1 .............
2 .............
3 .............
4 .............

Turn = 6.
  0123456789012
0 .............
1 h............
2 .............
3 .............
4 .............
5 .............
6 .............
7 .............
8 .............
9 .............
0 .............
1 .............
2 .............
3 .............
4 .............

Turn = 7.
  0123456789012
0 .............
1 h............
2 .............
3 .............
4 .............
5 .............
6 .............
7 .............
8 .............
9 .............
0 .............
1 .............
2 .............
3 .............
4 .............

Turn = 8.
  0123456789012
0 .............
1 h............
2 .............
3 .............
4 .............
5 .............
6 .............
7 .............
8 .............
9 .............
0 .............
1 .............
2 .............
3 .............
4 .............

Turn = 9.
  0123456789012
0 .............
1 h............
2 .............
3 .............
4 .............
5 .............
6 .............
7 .............
8 .............
9 .............
0 .............
1 .............
2 .............
3 .............
4 .............

Turn = 10.
  0123456789012
0 .............
1 h............
2 .............
3 .............
4 .............
5 .............
6 .............
7 .............
8 .............
9 .............
0 .............
1 .............
2 .............
3 .............
4 .............

Turn = 11.
  0123456789012
0 .............
1 h............
2 .............
3 .............
4 .............
5 .............
6 .............
7 .............
8 .............
9 .............
0 .............
1 .............
2 .............
3 .............
4 .............

*** Darwin 5x16 ***
Turn = 0.
  0123456789012345
0 ......t....h....
1 ..h...f.......r.
2 .hf....htf......
3 ......t......r..
4 ........f.......

Turn = 2.
  0123456789012345
0 ......th...h....
1 h.....f........r
2 h.f.....tt......
3 ......t........r
4 ........f.......

Turn = 4.
  0123456789012345
0 ......th...h....
1 h.....t.........
2 h.f.....tt.....r
3 ......t........r
4 ........f.......

Turn = 6.
  0123456789012345
0 ......tt...h....
1 h.....t.........
2 h.f.....tt...r..
3 ......t.........
4 ........f......r

Turn = 8.
  0123456789012345
0 ......tt...h....
1 h.....t.........
2 h.f.....tt.r....
3 ......t.........
4 ........f.....r.

Turn = 10.
  0123456789012345
0 ......tt...h....
1 h.....t.........
2 h.f.....trr.....
3 ......t.........
4 ........f...r...

Turn = 12.
  0123456789012345
0 ......tt...h....
1 h.....t.........
2 h.f....rr.......
3 ......t...r.....
4 ........f.r.....

Turn = 14.
  0123456789012345
0 ......tt...h....
1 h.....t.........
2 h.f...tr........
3 ......t....r....
4 ........rr......

Turn = 16.
  0123456789012345
0 ......tt...h....
1 h.....t.........
2 h.f...tt........
3 ......t..r...r..
4 ........r.......

Turn = 18.
  0123456789012345
0 ......tt...h....
1 h.....t..r......
2 h.f...tt........
3 ......t........r
4 ..........r.....

Turn = 20.
  0123456789012345
0 ......tt.r.h....
1 h.....t.........
2 h.f...tt........
3 ......t.........
4 ............r..r

Turn = 22.
  0123456789012345
0 ......trr..h....
1 h.....t.........
2 h.f...tt........
3 ......t.........
4 ..............rr

Turn = 24.
  0123456789012345
0 ......rr...h....
1 h.....tt........
2 h.f...tt.......r
3 ......t.......r.
4 ................

Turn = 26.
  0123456789012345
0 ......rr...h...r
1 h....r.r......r.
2 h.f...tt........
3 ......t.........
4 ................

Turn = 28.
  0123456789012345
0 ......r.r..h..rr
1 h..r.r..........
2 h.f...tt........
3 ......t.........
4 ................

Turn = 30.
  0123456789012345
0 ....r.....rhr.r.
1 hr.r............
2 h.f...tt........
3 ......t.........
4 ................

Turn = 32.
  0123456789012345
0 ..r.......rrrr..
1 rrr.............
2 h.f...tt........
3 ......t.........
4 ................

*** Darwin 18x18 ***
Turn = 0.
  012345678901234567
0 .....f............
1 .......r..........
2 ..................
3 ........f.....t...
4 ............f.....
5 .........h........
6 t.................
7 .................r
8 ..................
9 ..................
0 ..................
1 h.................
2 ..................
3 r.................
4 ..h..............r
5 ..........h.......
6 ............t.....
7 ..................

Turn = 8.
  012345678901234567
0 .....f............
1 ..................
2 ..................
3 ........f.....t...
4 ............f.....
5 .................h
6 t.................
7 ..................
8 ..................
9 .......r..........
0 ..................
1 ........h.........
2 ..................
3 ..................
4 h................r
5 .................r
6 ............t.....
7 ...r.........r....

Turn = 16.
  012345678901234567
0 .....f............
1 ..................
2 ..................
3 ........f.....t...
4 ............f.....
5 .................h
6 t.................
7 ..................
8 ..................
9 ..................
0 ..................
1 ................h.
2 ..................
3 ..................
4 h........rr.......
5 ........r.........
6 ............t.....
7 .......r....r.....

*** Darwin 20x15 ***
Turn = 0.
  012345678901234
0 ...............
1 ...............
2 ...............
3 ...............
4 ............h..
5 ...............
6 ...............
7 ...............
8 ...............
9 ..t............
0 ...............
1 ...............
2 ...............
3 ...............
4 ...............
5 f..............
6 .............t.
7 .......r....h..
8 ...............
9 ...............

Turn = 4.
  012345678901234
0 ...............
1 ...............
2 ...............
3 ...............
4 ..............h
5 ...............
6 ...............
7 ...............
8 ...............
9 ..t............
0 ...............
1 ...............
2 ...............
3 .......r.......
4 ...............
5 f..............
6 .............t.
7 ..............h
8 ...............
9 ...............

Turn = 8.
  012345678901234
0 ...............
1 ...............
2 ...............
3 ...............
4 ..............h
5 ...............
6 ...............
7 ...............
8 ...............
9 ..t....r.......
0 ...............
1 ...............
2 ...............
3 ...............
4 ...............
5 f..............
6 .............t.
7 ..............h
8 ...............
9 ...............

Turn = 12.
  012345678901234
0 ...............
1 ...............
2 ...............
3 ...............
4 ..............h
5 .......r.......
6 ...............
7 ...............
8 ...............
9 ..t............
0 ...............
1 ...............
2 ...............
3 ...............
4 ...............
5 f..............
6 .............t.
7 ..............h
8 ...............
9 ...............

Turn = 16.
  012345678901234
0 ...............
1 .......r.......
2 ...............
3 ...............
4 ..............h
5 ...............
6 ...............
7 ...............
8 ...............
9 ..t............
0 ...............
1 ...............
2 ...............
3 ...............
4 ...............
5 f..............
6 .............t.
7 ..............h
8 ...............
9 ...............

Turn = 20.
  012345678901234
0 .........r.....
1 ...............
2 ...............
3 ...............
4 ..............h
5 ...............
6 ...............
7 ...............
8 ...............
9 ..t............
0 ...............
1 ...............
2 ...............
3 ...............
4 ...............
5 f..............
6 .............t.
7 ..............h
8 ...............
9 ...............

Turn = 24.
  012345678901234
0 .............r.
1 ...............
2 ...............
3 ...............
4 ..............h
5 ...............
6 ...............
7 ...............
8 ...............
9 ..t............
0 ...............
1 ...............
2 ...............
3 ...............
4 ...............
5 f..............
6 .............t.
7 ..............h
8 ...............
9 ...............

Turn = 28.
  012345678901234
0 ..............r
1 ...............
2 ...............
3 ...............
4 ..............h
5 ...............
6 ...............
7 ...............
8 ...............
9 ..t............
0 ...............
1 ...............
2 ...............
3 ...............
4 ...............
5 f..............
6 .............t.
7 ..............h
8 ...............
9 ...............

Turn = 32.
  012345678901234
0 ...............
1 ...............
2 ...............
3 ..............r
4 ..............r
5 ...............
6 ...............
7 ...............
8 ...............
9 ..t............
0 ...............
1 ...............
2 ...............
3 ...............
4 ...............
5 f..............
6 .............t.
7 ..............h
8 ...............
9 ...............

Turn = 36.
  012345678901234
0 ...............
1 ...............
2 ...............
3 ...........r...
4 ...............
5 ...............
6 ...............
7 ...............
8 ..............r
9 ..t............
0 ...............
1 ...............
2 ...............
3 ...............
4 ...............
5 f..............
6 .............t.
7 ..............h
8 ...............
9 ...............

Turn = 40.
  012345678901234
0 ...............
1 ...............
2 ...............
3 .......r.......
4 ...............
5 ...............
6 ...............
7 ...............
8 ...............
9 ..t............
0 ...............
1 ...............
2 ..............r
3 ...............
4 ...............
5 f..............
6 .............t.
7 ..............h
8 ...............
9 ...............

Turn = 44.
  012345678901234
0 ...............
1 ...............
2 ...............
3 ...r...........
4 ...............
5 ...............
6 ...............
7 ...............
8 ...............
9 ..t............
0 ...............
1 ...............
2 ...............
3 ...............
4 ...............
5 f..............
6 .............tt
7 ..............h
8 ...............
9 ...............

Turn = 48.
  012345678901234
0 ...............
1 ...............
2 ...............
3 r..............
4 ...............
5 ...............
6 ...............
7 ...............
8 ...............
9 ..t............
0 ...............
1 ...............
2 ...............
3 ...............
4 ...............
5 f..............
6 .............tt
7 ..............t
8 ...............
9 ...............

Turn = 52.
  012345678901234
0 ...............
1 ...............
2 ...............
3 ...............
4 ...............
5 ...............
6 ...............
7 r..............
8 ...............
9 ..t............
0 ...............
1 ...............
2 ...............
3 ...............
4 ...............
5 f..............
6 .............tt
7 ..............t
8 ...............
9 ...............

*** Darwin 19x13 ***
Turn = 0.
  0123456789012
0 .............
1 .............
2 .............
3 .............
4 .............
5 .............
6 .............
7 .............
8 .............
9 .......f.r...
0 .............
1 .............
2 hh...........
3 t............
4 .............
5 .............
6 .............
7 .............
8 .............

*** Darwin 13x19 ***
Turn = 0.
  0123456789012345678
0 ...................
1 ...th.....h........
2 f..................
3 ..r................
4 ..........r......f.
5 .....fr............
6 ...................
7 .............f.....
8 .......r........r..
9 .................t.
0 ...r...............
1 ..................h
2 ...................

Turn = 3.
  0123456789012345678
0 ....h..............
1 ...t...............
2 f..................
3 r..................
4 ..........h..r...f.
5 .....f...r......r..
6 ...................
7 .............f.....
8 ...................
9 .................t.
0 ...................
1 .......r..........h
2 ...r...............

Turn = 6.
  0123456789012345678
0 ....h..............
1 r..t...............
2 ................r..
3 .r.................
4 ................rf.
5 .....f.............
6 .........r.........
7 ..........r..f.....
8 ...................
9 .................t.
0 ...................
1 ..................h
2 ......rr...........

Turn = 9.
  0123456789012345678
0 r...h...........r..
1 ...t...............
2 ...................
3 ....r..............
4 ...................
5 .....f..........r..
6 .................r.
7 .............f.....
8 ...................
9 .........r.......t.
0 ..........r........
1 .......r..........h
2 ......r............

Turn = 12.
  0123456789012345678
0 ....h........r.....
1 r..t...............
2 ...................
3 .......r...........
4 ...................
5 .....f.............
6 ...................
7 .............f.....
8 .......r........rr.
9 ......r...........r
0 ...................
1 ..................h
2 .........rr........

Turn = 15.
  0123456789012345678
0 ....h.....r........
1 ...t...............
2 ...................
3 ..........r........
4 r..................
5 .....f.r...........
6 ......r............
7 .............f.....
8 ...................
9 ...................
0 ..................r
1 ................rrr
2 ...........r.r.....

Turn = 18.
  0123456789012345678
0 ....h..r...........
1 ...t...............
2 .......r...........
3 ......r......r.....
4 ...................
5 .....f.............
6 ...................
7 r............f.....
8 ...................
9 ...................
0 ................r..
1 ...................
2 ..............rrrrr

Turn = 21.
  0123456789012345678
0 ....rrrr...........
1 ...t...............
2 ...................
3 ................r..
4 ...................
5 .....f.............
6 ...................
7 .............f.....
8 ...................
9 ...................
0 r............rr....
1 ................rr.
2 ...............r..r

Turn = 24.
  0123456789012345678
0 ....r...r.r........
1 ...t...............
2 .....r.............
3 ..................r
4 ...................
5 .....f.............
6 ...................
7 .............fr....
8 ................rr.
9 ...................
0 ..........r........
1 ...................
2 r...........r..r...

Turn = 27.
  0123456789012345678
0 ...t.......r.r.....
1 ...t...............
2 ...................
3 ...................
4 .....r........r....
5 .....r..........rr.
6 ..................r
7 .............f.....
8 ...................
9 ...................
0 .......r...........
1 ...................
2 ...r.....r..r......

Turn = 30.
  0123456789012345678
0 ...t..........r.r..
1 ...t..........r....
2 ................rr.
3 ...................
4 .......r...........
5 ........r..........
6 ...................
7 .............f.....
8 ...................
9 ..................r
0 ....r..............
1 ...................
2 ......rr.r.........

Turn = 33.
  0123456789012345678
0 ...t.........r..rrr
1 ...t.............r.
2 ...................
3 ...................
4 ..........r........
5 ...........r.......
6 ...................
7 .............f.....
8 ...................
9 .......r...........
0 .r....r............
1 ...................
2 ......r...........r

Turn = 36.
  0123456789012345678
0 ...t......r.....r.r
1 ...t............r.r
2 ...................
3 ...................
4 .............r.....
5 ..............r....
6 .......r...........
7 ......r......f.....
8 ...................
9 r..................
0 ...................
1 ...................
2 ...r..............r

Turn = 39.
  0123456789012345678
0 ...t...r.....r.r...
1 ...t...........r...
2 ...................
3 .......r...........
4 ......r........rr..
5 .................r.
6 r..................
7 .............f.....
8 ...................
9 ...................
0 ...................
1 ...................
2 r..............r...

Turn = 42.
  0123456789012345678
0 ...tr..r..r.r......
1 ...t..r.....r..r...
2 ...................
3 r..................
4 ..................r
5 ...................
6 ...................
7 .............f..r..
8 ...................
9 ...................
0 r..................
1 ...................
2 ............r......

Turn = 45.
  0123456789012345678
0 r..r...rrr......r..
1 ...tt....rr.......r
2 ...................
3 ...................
4 ...................
5 ...................
6 ...................
7 r............f.....
8 ...................
9 ...................
0 ................r..
1 ...................
2 .........r.........

*** Darwin 13x7 ***
Turn = 0.
  0123456
0 .......
1 ..t.h..
2 .......
3 t.....h
4 .......
5 .......
6 ...h..t
7 .......
8 .......
9 .......
0 .r....h
1 .......
2 t......

*** Darwin 7x15 ***
Turn = 0.
  012345678901234
0 ...............
1 ...............
2 ...............
3 ..r.r..........
4 ........h......
5 ...............
6 ...............

Turn = 5.
  012345678901234
0 ........h......
1 ...............
2 ...............
3 r..............
4 ...............
5 ...............
6 .r.............

Turn = 10.
  012345678901234
0 ........h......
1 ...............
2 ...............
3 ...............
4 r..............
5 ...............
6 ..r............

*** Darwin 5x10 ***
Turn = 0.
  0123456789
0 ........t.
1 ..h.....ft
2 ..........
3 ..........
4 ......h...

Turn = 10.
  0123456789
0 ..h.....t.
1 ........tt
2 ..........
3 ..........
4 h.........

Turn = 20.
  0123456789
0 ..h.....t.
1 ........tt
2 ..........
3 ..........
4 h.........

*** Darwin 20x14 ***
Turn = 0.
  01234567890123
0 ..........r...
1 ........f.....
2 ...r....r.....
3 ..........f...
4 .............f
5 t.............
6 ..............
7 ..............
8 .........f....
9 ..............
0 ..............
1 .h............
2 ..............
3 ............h.
4 ..............
5 ..............
6 ..............
7 ..............
8 ..............
9 .....t........

Turn = 9.
  01234567890123
0 ...r..........
1 ..............
2 ..............
3 ..........f..r
4 ............rr
5 tt............
6 ..............
7 ..............
8 .........f....
9 ..............
0 ..............
1 ...r..........
2 ..............
3 .............h
4 ..............
5 ..............
6 ..............
7 ..............
8 ..............
9 .....t........

Turn = 18.
  01234567890123
0 ..........r...
1 ............r.
2 ..............
3 ..............
4 t.............
5 tt............
6 ..............
7 ..........r...
8 .........f....
9 ..............
0 ..............
1 ..............
2 ..............
3 ............rh
4 ..............
5 ..............
6 ..............
7 ..............
8 ..............
9 ...r.t........

Turn = 27.
  01234567890123
0 .r............
1 ..............
2 ..............
3 ..............
4 t.............
5 tt............
6 ..............
7 ..............
8 .........f...r
9 ..............
0 ..............
1 ..............
2 ..............
3 .............h
4 ..............
5 ..............
6 ..........r...
7 ..............
8 ...........r..
9 ..........r.r.

Turn = 36.
  01234567890123
0 ..............
1 ..............
2 ..............
3 t.............
4 t.............
5 tt............
6 ..............
7 ..............
8 .........f....
9 ...........r..
0 ..............
1 ..............
2 ..............
3 ..........r...
4 .............r
5 ..............
6 ..............
7 ...r..........
8 ...r..........
9 .......r......

Turn = 45.
  01234567890123
0 ...........r..
1 ..............
2 ..............
3 t.............
4 t.............
5 tt............
6 ..............
7 ..............
8 .........f....
9 ..............
0 ..............
1 ..............
2 r.............
3 rr............
4 ..............
5 ..............
6 ..............
7 ..............
8 ..............
9 r.........r...

*** Darwin 6x16 ***
Turn = 0.
  0123456789012345
0 ......h.......f.
1 f...............
2 .h....f.........
3 ........t.......
4 ..f..t..h.......
5 ................

Turn = 1.
  0123456789012345
0 ..............f.
1 f.....h.........
2 ..h...f.........
3 ........t.......
4 ..f..t..h.......
5 ................

Turn = 2.
  0123456789012345
0 ..............f.
1 f.....h.........
2 ...h..f.........
3 ........t.......
4 ..f..t..t.......
5 ................

Turn = 3.
  0123456789012345
0 ..............f.
1 f.....h.........
2 ....h.f.........
3 ........t.......
4 ..f..t..t.......
5 ................

Turn = 4.
  0123456789012345
0 ..............f.
1 f.....h.........
2 .....hf.........
3 ........t.......
4 ..f..t..t.......
5 ................

Turn = 5.
  0123456789012345
0 ..............f.
1 f.....h.........
2 .....hf.........
3 ........t.......
4 ..f..t..t.......
5 ................

Turn = 6.
  0123456789012345
0 ..............f.
1 f.....h.........
2 .....hf.........
3 ........t.......
4 ..f..t..t.......
5 ................

Turn = 7.
  0123456789012345
0 ..............f.
1 f.....h.........
2 .....hf.........
3 ........t.......
4 ..f..t..t.......
5 ................

Turn = 8.
  0123456789012345
0 ..............f.
1 f.....h.........
2 .....hf.........
3 ........t.......
4 ..f..t..t.......
5 ................

Turn = 9.
  0123456789012345
0 ..............f.
1 f.....h.........
2 .....hf.........
3 ........t.......
4 ..f..t..t.......
5 ................

Turn = 10.
  0123456789012345
0 ..............f.
1 f.....h.........
2 .....hf.........
3 ........t.......
4 ..f..t..t.......
5 ................

Turn = 11.
  0123456789012345
0 ..............f.
1 f.....h.........
2 .....hf.........
3 ........t.......
4 ..f..t..t.......
5 ................

Turn = 12.
  0123456789012345
0 ..............f.
1 f.....h.........
2 .....hf.........
3 ........t.......
4 ..f..t..t.......
5 ................

Turn = 13.
  0123456789012345
0 ..............f.
1 f.....h.........
2 .....hf.........
3 ........t.......
4 ..f..t..t.......
5 ................

Turn = 14.
  0123456789012345
0 ..............f.
1 f.....h.........
2 .....hf.........
3 ........t.......
4 ..f..t..t.......
5 ................

Turn = 15.
  0123456789012345
0 ..............f.
1 f.....h.........
2 .....hf.........
3 ........t.......
4 ..f..t..t.......
5 ................

Turn = 16.
  0123456789012345
0 ..............f.
1 f.....h.........
2 .....hf.........
3 ........t.......
4 ..f..t..t.......
5 ................

Turn = 17.
  0123456789012345
0 ..............f.
1 f.....h.........
2 .....hf.........
3 ........t.......
4 ..f..t..t.......
5 ................

Turn = 18.
  0123456789012345
0 ..............f.
1 f.....h.........
2 .....hf.........
3 ........t.......
4 ..f..t..t.......
5 ................

Turn = 19.
  0123456789012345
0 ..............f.
1 f.....h.........
2 .....hf.........
3 ........t.......
4 ..f..t..t.......
5 ................

Turn = 20.
  0123456789012345
0 ..............f.
1 f.....h.........
2 .....hf.........
3 ........t.......
4 ..f..t..t.......
5 ................

Turn = 21.
  0123456789012345
0 ..............f.
1 f.....h.........
2 .....hf.........
3 ........t.......
4 ..f..t..t.......
5 ................

Turn = 22.
  0123456789012345
0 ..............f.
1 f.....h.........
2 .....hf.........
3 ........t.......
4 ..f..t..t.......
5 ................

Turn = 23.
  0123456789012345
0 ..............f.
1 f.....h.........
2 .....hf.........
3 ........t.......
4 ..f..t..t.......
5 ................

Turn = 24.
  0123456789012345
0 ..............f.
1 f.....h.........
2 .....hf.........
3 ........t.......
4 ..f..t..t.......
5 ................

Turn = 25.
  0123456789012345
0 ..............f.
1 f.....h.........
2 .....hf.........
3 ........t.......
4 ..f..t..t.......
5 ................

Turn = 26.
  0123456789012345
0 ..............f.
1 f.....h.........
2 .....hf.........
3 ........t.......
4 ..f..t..t.......
5 ................

Turn = 27.
  0123456789012345
0 ..............f.
1 f.....h.........
2 .....hf.........
3 ........t.......
4 ..f..t..t.......
5 ................

Turn = 28.
  0123456789012345
0 ..............f.
1 f.....h.........
2 .....hf.........
3 ........t.......
4 ..f..t..t.......
5 ................

Turn = 29.
  0123456789012345
0 ..............f.
1 f.....h.........
2 .....hf.........
3 ........t.......
4 ..f..t..t.......
5 ................

Turn = 30.
  0123456789012345
0 ..............f.
1 f.....h.........
2 .....hf.........
3 ........t.......
4 ..f..t..t.......
5 ................

Turn = 31.
  0123456789012345
0 ..............f.
1 f.....h.........
2 .....hf.........
3 ........t.......
4 ..f..t..t.......
5 ................

Turn = 32.
  0123456789012345
0 ..............f.
1 f.....h.........
2 .....hf.........
3 ........t.......
4 ..f..t..t.......
5 ................

Turn = 33.
  0123456789012345
0 ..............f.
1 f.....h.........
2 .....hf.........
3 ........t.......
4 ..f..t..t.......
5 ................

Turn = 34.
  0123456789012345
0 ..............f.
1 f.....h.........
2 .....hf.........
3 ........t.......
4 ..f..t..t.......
5 ................

Turn = 35.
  0123456789012345
0 ..............f.
1 f.....h.........
2 .....hf.........
3 ........t.......
4 ..f..t..t.......
5 ................

Turn = 36.
  0123456789012345
0 ..............f.
1 f.....h.........
2 .....hf.........
3 ........t.......
4 ..f..t..t.......
5 ................

Turn = 37.
  0123456789012345
0 ..............f.
1 f.....h.........
2 .....hf.........
3 ........t.......
4 ..f..t..t.......
5 ................

Turn = 38.
  0123456789012345
0 ..............f.
1 f.....h.........
2 .....hf.........
3 ........t.......
4 ..f..t..t.......
5 ................

*** Darwin 4x2 ***
Turn = 0.
  01
0 .h
1 hf
2 hr
3 ft

*** Darwin 8x6 ***
Turn = 0.
  012345
0 ......
1 ......
2 ......
3 h.r...
4 ......
5 ......
6 ......
7 ......

Turn = 3.
  012345
0 ..r...
1 ......
2 ......
3 ......
4 ......
5 ......
6 h.....
7 ......

Turn = 6.
  012345
0 ....r.
1 ......
2 ......
3 ......
4 ......
5 ......
6 ......
7 h.....

Turn = 9.
  012345
0 .....r
1 ......
2 ......
3 ......
4 ......
5 ......
6 ......
7 h.....

Turn = 12.
  012345
0 ......
1 ......
2 .....r
3 ......
4 ......
5 ......
6 ......
7 h.....

Turn = 15.
  012345
0 ......
1 ......
2 ......
3 ......
4 ......
5 .....r
6 ......
7 h.....

Turn = 18.
  012345
0 ......
1 ......
2 ......
3 ......
4 ......
5 ......
6 ......
7 h....r

Turn = 21.
  012345
0 ......
1 ......
2 ......
3 ......
4 ......
5 ......
6 ......
7 h.r...

Turn = 24.
  012345
0 ......
1 ......
2 ......
3 ......
4 ......
5 ......
6 ......
7 rr....

Turn = 27.
  012345
0 ......
1 ......
2 ......
3 ......
4 ......
5 ......
6 ......
7 rr....

Turn = 30.
  012345
0 ......
1 ......
2 ......
3 ......
4 r.....
5 ......
6 ......
7 ....r.

Turn = 33.
  012345
0 ......
1 r.....
2 ......
3 ......
4 ......
5 ......
6 ......
7 .....r

Turn = 36.
  012345
0 r.....
1 ......
2 ......
3 ......
4 ......
5 ......
6 ......
7 ..r...

Turn = 39.
  012345
0 ......
1 ......
2 ......
3 r.....
4 ......
5 ......
6 ......
7 r.....

*** Darwin 16x20 ***
Turn = 0.
  01234567890123456789
0 ..............r.....
1 ...........t........
2 ..............r..r..
3 ..r.................
4 ....................
5 ....................
6 ....................
7 ............h.......
8 ....................
9 h................r..
0 ....................
1 ....................
2 ....................
3 ....................
4 ....................
5 .h.........h........

Turn = 5.
  01234567890123456789
0 ...................r
1 r..........t........
2 ....................
3 ....................
4 h...................
5 ....................
6 ....................
7 ..............r..r..
8 ....................
9 ....................
0 .h..................
1 ....................
2 ............h.......
3 ....................
4 .................r..
5 ......h.............

Turn = 10.
  01234567890123456789
0 h..r................
1 ...........t........
2 ...................r
3 ....................
4 ....................
5 .h..................
6 ....................
7 ....................
8 ....................
9 ....................
0 ....................
1 ....................
2 ..............r..r..
3 ....................
4 ....................
5 .h..........h.r.....

Turn = 15.
  01234567890123456789
0 hh......r...........
1 ...........t........
2 ....................
3 ....................
4 ....................
5 ....................
6 ....................
7 ...................r
8 ....................
9 ....................
0 ....................
1 ....................
2 ....................
3 ....................
4 ....................
5 h...........rr.rr...

Turn = 20.
  01234567890123456789
0 hh.........t........
1 ...........t........
2 ....................
3 ....................
4 ....................
5 ....................
6 ....................
7 ....................
8 ....................
9 ....................
0 .............r......
1 ...............r....
2 ...................r
3 ....................
4 ....................
5 h..............r...r

Turn = 25.
  01234567890123456789
0 hh.........t........
1 ...........t........
2 ....................
3 ....................
4 ....................
5 .............r......
6 ...............r....
7 ....................
8 ....................
9 ....................
0 ....................
1 ....................
2 ....................
3 ....................
4 ..................rr
5 h..................r

Turn = 30.
  01234567890123456789
0 hh.........t.r......
1 ...........t...r....
2 ....................
3 ....................
4 ....................
5 ....................
6 ....................
7 ....................
8 ....................
9 ..................r.
0 ....................
1 ....................
2 ....................
3 ....................
4 ................r...
5 h..............r....

Turn = 35.
  01234567890123456789
0 hh..........rr......
1 ...........r.r......
2 ....................
3 ....................
4 ..................r.
5 ....................
6 ....................
7 ....................
8 ....................
9 ....................
0 ....................
1 ....................
2 ....................
3 ....................
4 ...........r........
5 h.........r.........

*** Darwin 10x8 ***
Turn = 0.
  01234567
0 ....f...
1 .......f
2 ........
3 .......f
4 ...f....
5 ........
6 ........
7 ........
8 ........
9 ........

Turn = 10.
  01234567
0 ....f...
1 .......f
2 ........
3 .......f
4 ...f....
5 ........
6 ........
7 ........
8 ........
9 ........

Turn = 20.
  01234567
0 ....f...
1 .......f
2 ........
3 .......f
4 ...f....
5 ........
6 ........
7 ........
8 ........
9 ........

*** Darwin 14x2 ***
Turn = 0.
  01
0 ..
1 ..
2 r.
3 ..
4 ..
5 ..
6 ..
7 ..
8 ..
9 ..
0 ..
1 ..
2 ..
3 .t

Turn = 1.
  01
0 ..
1 r.
2 ..
3 ..
4 ..
5 ..
6 ..
7 ..
8 ..
9 ..
0 ..
1 ..
2 ..
3 .t

Turn = 2.
  01
0 r.
1 ..
2 ..
3 ..
4 ..
5 ..
6 ..
7 ..
8 ..
9 ..
0 ..
1 ..
2 ..
3 .t

Turn = 3.
  01
0 r.
1 ..
2 ..
3 ..
4 ..
5 ..
6 ..
7 ..
8 ..
9 ..
0 ..
1 ..
2 ..
3 .t

Turn = 4.
  01
0 .r
1 ..
2 ..
3 ..
4 ..
5 ..
6 ..
7 ..
8 ..
9 ..
0 ..
1 ..
2 ..
3 .t

Turn = 5.
  01
0 .r
1 ..
2 ..
3 ..
4 ..
5 ..
6 ..
7 ..
8 ..
9 ..
0 ..
1 ..
2 ..
3 .t

Turn = 6.
  01
0 .r
1 ..
2 ..
3 ..
4 ..
5 ..
6 ..
7 ..
8 ..
9 ..
0 ..
1 ..
2 ..
3 .t

Turn = 7.
  01
0 .r
1 ..
2 ..
3 ..
4 ..
5 ..
6 ..
7 ..
8 ..
9 ..
0 ..
1 ..
2 ..
3 .t

Turn = 8.
  01
0 ..
1 .r
2 ..
3 ..
4 ..
5 ..
6 ..
7 ..
8 ..
9 ..
0 ..
1 ..
2 ..
3 .t

Turn = 9.
  01
0 ..
1 ..
2 .r
3 ..
4 ..
5 ..
6 ..
7 ..
8 ..
9 ..
0 ..
1 ..
2 ..
3 .t

Turn = 10.
  01
0 ..
1 ..
2 ..
3 .r
4 ..
5 ..
6 ..
7 ..
8 ..
9 ..
0 ..
1 ..
2 ..
3 .t

Turn = 11.
  01
0 ..
1 ..
2 ..
3 ..
4 .r
5 ..
6 ..
7 ..
8 ..
9 ..
0 ..
1 ..
2 ..
3 .t

Turn = 12.
  01
0 ..
1 ..
2 ..
3 ..
4 ..
5 .r
6 ..
7 ..
8 ..
9 ..
0 ..
1 ..
2 ..
3 .t

Turn = 13.
  01
0 ..
1 ..
2 ..
3 ..
4 ..
5 ..
6 .r
7 ..
8 ..
9 ..
0 ..
1 ..
2 ..
3 .t

Turn = 14.
  01
0 ..
1 ..
2 ..
3 ..
4 ..
5 ..
6 ..
7 .r
8 ..
9 ..
0 ..
1 ..
2 ..
3 .t

Turn = 15.
  01
0 ..
1 ..
2 ..
3 ..
4 ..
5 ..
6 ..
7 ..
8 .r
9 ..
0 ..
1 ..
2 ..
3 .t

Turn = 16.
  01
0 ..
1 ..
2 ..
3 ..
4 ..
5 ..
6 ..
7 ..
8 ..
9 .r
0 ..
1 ..
2 ..
3 .t

Turn = 17.
  01
0 ..
1 ..
2 ..
3 ..
4 ..
5 ..
6 ..
7 ..
8 ..
9 ..
0 .r
1 ..
2 ..
3 .t

Turn = 18.
  01
0 ..
1 ..
2 ..
3 ..
4 ..
5 ..
6 ..
7 ..
8 ..
9 ..
0 ..
1 .r
2 ..
3 .t

Turn = 19.
  01
0 ..
1 ..
2 ..
3 ..
4 ..
5 ..
6 ..
7 ..
8 ..
9 ..
0 ..
1 ..
2 .r
3 .t

Turn = 20.
  01
0 ..
1 ..
2 ..
3 ..
4 ..
5 ..
6 ..
7 ..
8 ..
9 ..
0 ..
1 ..
2 .r
3 .r

Turn = 21.
  01
0 ..
1 ..
2 ..
3 ..
4 ..
5 ..
6 ..
7 ..
8 ..
9 ..
0 ..
1 ..
2 .r
3 .r

Turn = 22.
  01
0 ..
1 ..
2 ..
3 ..
4 ..
5 ..
6 ..
7 ..
8 ..
9 ..
0 ..
1 ..
2 r.
3 .r

Turn = 23.
  01
0 ..
1 ..
2 ..
3 ..
4 ..
5 ..
6 ..
7 ..
8 ..
9 ..
0 ..
1 ..
2 rr
3 ..

Turn = 24.
  01
0 ..
1 ..
2 ..
3 ..
4 ..
5 ..
6 ..
7 ..
8 ..
9 ..
0 ..
1 rr
2 ..
3 ..

Turn = 25.
  01
0 ..
1 ..
2 ..
3 ..
4 ..
5 ..
6 ..
7 ..
8 ..
9 ..
0 rr
1 ..
2 ..
3 ..

Turn = 26.
  01
0 ..
1 ..
2 ..
3 ..
4 ..
5 ..
6 ..
7 ..
8 ..
9 rr
0 ..
1 ..
2 ..
3 ..

Turn = 27.
  01
0 ..
1 ..
2 ..
3 ..
4 ..
5 ..
6 ..
7 ..
8 rr
9 ..
0 ..
1 ..
2 ..
3 ..

Turn = 28.
  01
0 ..
1 ..
2 ..
3 ..
4 ..
5 ..
6 ..
7 rr
8 ..
9 ..
0 ..
1 ..
2 ..
3 ..

Turn = 29.
  01
0 ..
1 ..
2 ..
3 ..
4 ..
5 ..
6 rr
7 ..
8 ..
9 ..
0 ..
1 ..
2 ..
3 ..

Turn = 30.
  01
0 ..
1 ..
2 ..
3 ..
4 ..
5 rr
6 ..
7 ..
8 ..
9 ..
0 ..
1 ..
2 ..
3 ..

Turn = 31.
  01
0 ..
1 ..
2 ..
3 ..
4 rr
5 ..
6 ..
7 ..
8 ..
9 ..
0 ..
1 ..
2 ..
3 ..

Turn = 32.
  01
0 ..
1 ..
2 ..
3 rr
4 ..
5 ..
6 ..
7 ..
8 ..
9 ..
0 ..
1 ..
2 ..
3 ..

Turn = 33.
  01
0 ..
1 ..
2 rr
3 ..
4 ..
5 ..
6 ..
7 ..
8 ..
9 ..
0 ..
1 ..
2 ..
3 ..

Turn = 34.
  01
0 ..
1 rr
2 ..
3 ..
4 ..
5 ..
6 ..
7 ..
8 ..
9 ..
0 ..
1 ..
2 ..
3 ..

Turn = 35.
  01
0 rr
1 ..
2 ..
3 ..
4 ..
5 ..
6 ..
7 ..
8 ..
9 ..
0 ..
1 ..
2 ..
3 ..

Turn = 36.
  01
0 rr
1 ..
2 ..
3 ..
4 ..
5 ..
6 ..
7 ..
8 ..
9 ..
0 ..
1 ..
2 ..
3 ..

Turn = 37.
  01
0 rr
1 ..
2 ..
3 ..
4 ..
5 ..
6 ..
7 ..
8 ..
9 ..
0 ..
1 ..
2 ..
3 ..

Turn = 38.
  01
0 ..
1 rr
2 ..
3 ..
4 ..
5 ..
6 ..
7 ..
8 ..
9 ..
0 ..
1 ..
2 ..
3 ..

Turn = 39.
  01
0 ..
1 ..
2 rr
3 ..
4 ..
5 ..
6 ..
7 ..
8 ..
9 ..
0 ..
1 ..
2 ..
3 ..

Turn = 40.
  01
0 ..
1 ..
2 ..
3 rr
4 ..
5 ..
6 ..
7 ..
8 ..
9 ..
0 ..
1 ..
2 ..
3 ..

Turn = 41.
  01
0 ..
1 ..
2 ..
3 ..
4 rr
5 ..
6 ..
7 ..
8 ..
9 ..
0 ..
1 ..
2 ..
3 ..

Turn = 42.
  01
0 ..
1 ..
2 ..
3 ..
4 ..
5 rr
6 ..
7 ..
8 ..
9 ..
0 ..
1 ..
2 ..
3 ..

Turn = 43.
  01
0 ..
1 ..
2 ..
3 ..
4 ..
5 ..
6 rr
7 ..
8 ..
9 ..
0 ..
1 ..
2 ..
3 ..

Turn = 44.
  01
0 ..
1 ..
2 ..
3 ..
4 ..
5 ..
6 ..
7 rr
8 ..
9 ..
0 ..
1 ..
2 ..
3 ..

Turn = 45.
  01
0 ..
1 ..
2 ..
3 ..
4 ..
5 ..
6 ..
7 ..
8 rr
9 ..
0 ..
1 ..
2 ..
3 ..

Turn = 46.
  01
0 ..
1 ..
2 ..
3 ..
4 ..
5 ..
6 ..
7 ..
8 ..
9 rr
0 ..
1 ..
2 ..
3 ..

Turn = 47.
  01
0 ..
1 ..
2 ..
3 ..
4 ..
5 ..
6 ..
7 ..
8 ..
9 ..
0 rr
1 ..
2 ..
3 ..

Turn = 48.
  01
0 ..
1 ..
2 ..
3 ..
4 ..
5 ..
6 ..
7 ..
8 ..
9 ..
0 ..
1 rr
2 ..
3 ..

Turn = 49.
  01
0 ..
1 ..
2 ..
3 ..
4 ..
5 ..
6 ..
7 ..
8 ..
9 ..
0 ..
1 ..
2 rr
3 ..

Turn = 50.
  01
0 ..
1 ..
2 ..
3 ..
4 ..
5 ..
6 ..
7 ..
8 ..
9 ..
0 ..
1 ..
2 ..
3 rr

Turn = 51.
  01
0 ..
1 ..
2 ..
3 ..
4 ..
5 ..
6 ..
7 ..
8 ..
9 ..
0 ..
1 ..
2 ..
3 rr

Turn = 52.
  01
0 ..
1 ..
2 ..
3 ..
4 ..
5 ..
6 ..
7 ..
8 ..
9 ..
0 ..
1 ..
2 ..
3 rr

Turn = 53.
  01
0 ..
1 ..
2 ..
3 ..
4 ..
5 ..
6 ..
7 ..
8 ..
9 ..
0 ..
1 ..
2 ..
3 rr

*** Darwin 4x3 ***
Turn = 0.
  012
0 fhr
1 .tr
2 t.r
3 .hf

Turn = 9.
  012
0 trr
1 t.r
2 t.r
3 .rr

Turn = 18.
  012
0 rrr
1 tt.
2 r.r
3 r.r

Turn = 27.
  012
0 rrr
1 rrr
2 r.r
3 .r.

Turn = 36.
  012
0 .rr
1 r.r
2 rr.
3 rrr

*** Darwin 11x8 ***
Turn = 0.
  01234567
0 .r......
1 ........
2 ........
3 .....f..
4 ........
5 .h......
6 ........
7 ........
8 ........
9 ........
0 ......t.

Turn = 7.
  01234567
0 ..r.....
1 ........
2 ........
3 .....f..
4 ........
5 .......h
6 ........
7 ........
8 ........
9 ........
0 ......t.

Turn = 14.
  01234567
0 ........
1 .......r
2 ........
3 .....f..
4 ........
5 .......h
6 ........
7 ........
8 ........
9 ........
0 ......t.

Turn = 21.
  01234567
0 ........
1 ........
2 ........
3 .....f.r
4 ........
5 ........
6 ........
7 ........
8 .......r
9 ........
0 ......t.

Turn = 28.
  01234567
0 ........
1 ........
2 .......r
3 .....f..
4 ........
5 ........
6 ........
7 ........
8 ........
9 ........
0 ......tt

Turn = 35.
  01234567
0 ........
1 ........
2 ........
3 .....f..
4 ........
5 ........
6 ........
7 ........
8 ........
9 .......r
0 ......tt

*** Darwin 18x10 ***
Turn = 0.
  0123456789
0 ..........
1 ..........
2 .h........
3 ........t.
4 ..........
5 ..........
6 ..........
7 ..........
8 ........f.
9 .......f..
0 ..........
1 .t........
2 ..........
3 ..........
4 ......h...
5 ........t.
6 f.........
7 ..........

*** Darwin 13x13 ***
Turn = 0.
  0123456789012
0 .............
1 ............h
2 .............
3 .............
4 .............
5 ..h..........
6 .............
7 .............
8 r............
9 .............
0 ...........h.
1 ..h.t....f...
2 r......tth...

Turn = 5.
  0123456789012
0 .............
1 ............h
2 .............
3 r............
4 .............
5 .......h.....
6 .............
7 .............
8 .............
9 .............
0 .............
1 r...t....t...
2 ..r....ttt.h.

Turn = 10.
  0123456789012
0 .r...........
1 ............h
2 .............
3 .............
4 .............
5 ............h
6 r............
7 .............
8 .............
9 .............
0 .............
1 ....t....t...
2 ......tttt.h.

Turn = 15.
  0123456789012
0 ......r......
1 r...........h
2 .............
3 .............
4 .............
5 ............h
6 .............
7 .............
8 .............
9 .............
0 .............
1 ....t....t...
2 ......tttt.h.

Turn = 20.
  0123456789012
0 ...........r.
1 ............h
2 r............
3 .............
4 .............
5 ............h
6 .............
7 .............
8 .............
9 .............
0 .............
1 ....t....t...
2 ......tttt.h.

Turn = 25.
  0123456789012
0 ............r
1 .............
2 .............
3 ............r
4 .............
5 ............h
6 .............
7 r............
8 .............
9 .............
0 .............
1 ....t....t...
2 ......tttt.h.

Turn = 30.
  0123456789012
0 .............
1 .............
2 .............
3 ............r
4 ..........r.r
5 .............
6 .............
7 .............
8 .............
9 .............
0 .............
1 ....t....t...
2 r.....tttt.h.

Turn = 35.
  0123456789012
0 ...........r.
1 ............r
2 .............
3 .............
4 .....r.......
5 .............
6 .............
7 .............
8 .............
9 .............
0 .............
1 ....t....t...
2 ....r.tttt.h.

Turn = 40.
  0123456789012
0 ......r......
1 .............
2 ............r
3 .............
4 r............
5 .............
6 .............
7 .............
8 .............
9 .............
0 .............
1 ....t....t...
2 .....ttttt.h.

Turn = 45.
  0123456789012
0 .r...........
1 .............
2 .............
3 .............
4 .............
5 .............
6 .............
7 ............r
8 r............
9 .............
0 .............
1 ....t....t...
2 .....ttttt.h.
