28

6 4
5
t 0 2 s
f 4 0 n
r 4 3 n
t 5 1 e
r 1 1 w
5 2

12 9
1
h 5 1 s
18 2

7 8
2
h 6 0 w
r 6 2 e
13 3

7 7
7
h 3 0 s
h 5 0 n
f 2 1 s
t 1 4 n
h 0 1 e
r 4 0 n
t 6 0 s
27 4

11 11
10
f 4 4 s
r 5 4 s
h 3 0 n
h 8 0 e
f 5 7 w
t 0 3 e
f 2 5 e
h 9 8 e
h 6 7 s
h 6 9 e
15 2

8 6
10
f 4 5 e
h 7 4 n
h 1 2 w
t 4 3 n
t 1 0 s
t 0 5 e
r 2 1 n
t 5 0 e
f 1 2 s
r 6 3 n
30 3

4 6
9
f 1 3 w
r 3 0 s
f 3 3 w
h 0 3 e
r 2 4 s
t 1 0 e
t 1 4 s
t 1 2 e
f 1 1 n
22 1

9 4
5
t 6 0 w
t 6 2 s
r 3 1 n
h 7 3 w
t 4 0 s
23 5

8 9
1
t 5 1 e
14 1

7 12
1
r 6 9 e
14 2

8 7
6
t 3 5 s
t 4 1 e
f 4 4 n
f 0 6 w
h 2 0 n
t 4 6 e
4 1

9 6
9
t 7 2 s
t 4 5 e
t 3 1 e
f 0 2 n
r 3 1 e
t 2 3 e
f 2 1 s
t 4 1 n
h 6 2 s
9 3

6 6
2
h 3 3 w
r 2 3 e
28 5

5 10
7
h 2 7 s
h 1 1 n
r 3 3 n
r 3 8 e
h 2 1 e
r 3 7 n
r 4 1 n
18 3

7 13
3
h 5 3 s
r 3 2 s
t 4 2 e
4 1

7 8
6
f 6 3 s
f 5 4 e
h 2 2 n
t 4 3 n
r 5 5 e
f 0 7 e
7 5

7 4
9
h 4 1 e
t 5 0 s
t 6 1 e
t 5 1 w
t 3 0 s
t 1 3 s
t 3 0 n
r 1 1 n
t 6 0 s
11 3

8 9
9
t 2 5 e
f 3 5 e
r 1 5 w
r 5 5 e
f 4 4 w
r 0 7 e
h 3 1 w
t 7 5 n
t 2 8 e
23 4

5 4
1
h 3 2 s
30 1

7 11
4
r 0 9 n
r 1 10 e
f 6 2 e
h 3 8 e
14 5

7 10
3
t 1 8 s
t 2 7 s
h 5 6 e
5 1

5 12
6
h 3 10 w
t 3 11 s
r 3 10 e
r 3 0 e
f 1 9 e
t 2 0 n
26 5

12 10
6
r 2 8 s
f 6 9 w
t 3 1 s
t 0 1 s
h 2 3 n
t 1 4 n
29 5

4 8
6
f 2 5 n
t 3 0 n
f 2 5 n
f 1 7 e
h 2 1 e
r 1 0 n
25 4

8 6
6
f 5 1 e
h 4 2 w
t 7 3 w
t 7 0 w
t 5 5 e
r 0 3 n
30 4

4 9
2
h 2 1 n
h 3 6 s
1 1

12 5
9
r 1 1 w
f 4 2 s
f 5 1 w
h 0 2 e
r 1 1 n
t 9 0 n
t 8 1 s
r 2 3 n
t 9 1 w
11 5

6 13
10
t 3 11 e
f 2 2 n
f 2 3 w
f 5 4 n
r 5 5 s
h 0 12 e
h 1 1 w
f 0 4 s
f 2 11 s
r 3 1 e
17 2
