20

20 14
19
r 16 7 w
t 19 10 n
h 19 13 s
t 7 13 s
h 19 1 e
r 0 11 e
f 16 4 e
r 8 11 n
r 13 4 s
h 16 4 w
r 1 0 s
t 17 12 s
f 11 7 n
f 15 2 s
t 2 5 e
t 3 10 n
f 12 12 n
h 2 4 s
r 18 9 e
5 4

20 17
3
f 0 5 n
h 6 8 w
f 12 2 s
1 1

8 5
5
h 0 4 s
r 2 4 s
r 6 1 w
h 2 2 e
f 0 1 s
16 15

7 16
10
f 3 5 s
t 1 1 s
t 5 2 w
f 5 13 n
h 0 3 n
r 2 1 e
t 6 5 w
t 5 2 s
t 6 1 w
r 0 13 e
11 1

7 8
5
t 4 4 s
r 1 4 s
h 4 3 n
r 1 0 s
f 1 0 s
3 1

10 6
7
h 4 1 e
f 2 3 n
r 3 0 n
f 4 2 n
f 3 4 s
r 3 1 n
r 0 5 w
4 2

6 7
15
t 2 3 w
r 0 0 s
r 4 1 s
r 2 2 n
f 5 6 w
f 4 6 e
h 2 6 w
f 3 6 n
h 3 1 w
t 2 3 s
h 0 4 n
r 4 0 n
h 0 4 n
f 3 0 s
r 5 1 n
8 5

4 17
3
f 1 14 e
h 1 4 n
f 2 14 w
4 3

6 11
10
r 4 4 e
f 5 7 w
h 0 3 w
t 3 10 n
h 1 6 n
f 0 4 s
f 5 2 s
r 1 8 w
h 2 6 n
f 5 1 e
4 4

4 16
17
f 3 5 s
r 3 8 n
t 2 4 w
h 3 10 w
h 2 8 s
f 3 9 e
f 1 2 s
t 1 15 s
h 1 3 e
t 2 8 n
h 3 15 w
h 3 2 w
t 3 8 n
h 0 10 s
f 1 13 s
h 3 0 n
r 3 8 w
20 6

19 19
13
f 18 0 s
t 17 9 e
r 18 17 n
h 12 8 n
t 18 8 s
t 17 14 w
t 1 16 w
f 7 0 s
r 7 12 n
h 6 15 e
f 16 0 s
h 13 11 w
h 10 6 s
8 5

8 10
4
t 0 9 e
f 1 8 s
f 4 7 n
t 0 2 e
2 1

2 12
9
f 0 5 e
h 1 1 n
t 1 6 s
f 1 4 s
h 0 2 w
f 0 0 e
r 1 6 s
r 1 1 n
h 0 5 s
9 3

5 14
1
f 1 0 s
2 2

8 16
4
h 5 0 n
r 4 10 n
h 4 6 e
h 3 0 e
17 6

17 18
15
h 7 11 w
h 5 12 n
h 5 6 w
t 2 0 n
t 11 2 w
f 4 8 e
t 7 15 e
h 3 8 w
f 11 5 s
h 14 5 n
t 8 12 w
f 10 16 s
t 9 0 s
h 11 11 s
h 4 15 n
7 7

15 3
7
f 10 0 e
f 14 2 n
h 5 2 w
h 7 0 s
r 0 1 s
f 13 2 n
h 5 2 n
10 2

3 10
17
t 1 2 w
t 2 9 n
r 2 1 e
h 1 1 s
r 1 2 n
h 2 0 e
t 2 4 w
f 2 6 n
t 0 6 s
f 2 1 w
r 0 6 e
t 2 3 n
h 1 0 n
r 0 8 e
f 1 5 s
t 2 7 e
t 0 6 n
14 13

14 17
16
h 10 3 w
r 1 16 n
t 10 7 n
f 9 3 s
f 0 1 s
r 13 0 n
r 6 11 w
f 11 8 s
f 9 1 n
f 11 16 s
f 8 12 e
t 13 13 n
t 8 1 s
t 9 8 n
h 0 3 s
f 0 5 s
2 2

13 13
9
r 6 7 s
h 8 9 n
f 12 2 w
r 12 8 e
t 8 4 w
f 0 12 s
r 7 9 n
r 12 11 w
r 8 0 w
13 5
