*** Darwin 9x27 ***
Turn = 0.
  012345678901234567890123456
0 ........t...h........h.....
1 .......................r...
2 ...........................
3 ..........t........f.......
4 ......h............t.......
5 .....r.....................
6 .......................h..r
7 ...........................
8 .................f........f

Turn = 3.
  012345678901234567890123456
0 ........t...h........h.....
1 ...........................
2 ...........................
3 ..........t........t.......
4 ...................t...r...
5 ..r........................
6 ..........................h
7 ......h...................r
8 .................f........r

*** Darwin 12x28 ***
Turn = 0.
  0123456789012345678901234567
0 ...............r............
1 ............................
2 ............h...............
3 ...f........................
4 .t..........................
5 ............................
6 .........h..................
7 ............................
8 .....................t......
9 ............................
0 ............................
1 .....................h......

Turn = 4.
  0123456789012345678901234567
0 ............................
1 ............................
2 ...............h............
3 ...f........................
4 .t.............r............
5 ............................
6 .....h......................
7 ............................
8 .....................t......
9 ............................
0 ............................
1 .....................h......

Turn = 8.
  0123456789012345678901234567
0 ............................
1 ............................
2 ...................h........
3 ...f........................
4 .t..........................
5 ............................
6 .h..........................
7 ............................
8 ...............r.....t......
9 ............................
0 ............................
1 .....................h......

Turn = 12.
  0123456789012345678901234567
0 ............................
1 ............................
2 .......................h....
3 ...f........................
4 .t..........................
5 ............................
6 h...........................
7 ............................
8 .....................t......
9 ............................
0 ............................
1 ...............r.....h......

*** Darwin 27x19 ***
Turn = 0.
  0123456789012345678
0 ....f..............
1 ...................
2 ...................
3 ..........h........
4 ...................
5 ...................
6 ...................
7 ...................
8 ...................
9 .....f.............
0 ..............r....
1 ...................
2 ................h..
3 ...................
4 ...................
5 ...................
6 ...................
7 ...................
8 ...................
9 .......f...........
0 ...................
1 ...................
2 ...................
3 ...................
4 ..............h....
5 .................f.
6 ...................

Turn = 2.
  0123456789012345678
0 ....f..............
1 ...................
2 ...................
3 ........h..........
4 ...................
5 ...................
6 ...................
7 ...................
8 ...................
9 .....f.............
0 ............r......
1 ...................
2 ..................h
3 ...................
4 ...................
5 ...................
6 ...................
7 ...................
8 ...................
9 .......f...........
0 ...................
1 ...................
2 ...................
3 ...................
4 ................h..
5 .................f.
6 ...................

Turn = 4.
  0123456789012345678
0 ....f..............
1 ...................
2 ...................
3 ......h............
4 ...................
5 ...................
6 ...................
7 ...................
8 ...................
9 .....f.............
0 ..........r........
1 ...................
2 ..................h
3 ...................
4 ...................
5 ...................
6 ...................
7 ...................
8 ...................
9 .......f...........
0 ...................
1 ...................
2 ...................
3 ...................
4 ..................h
5 .................f.
6 ...................

*** Darwin 8x23 ***
Turn = 0.
  01234567890123456789012
0 .......h....t........t.
1 t.r....................
2 rf...h.................
3 ............r..........
4 .......................
5 ..........f.....h......
6 ............h..........
7 .......r...............

Turn = 1.
  01234567890123456789012
0 ......h.....t........t.
1 tr.....................
2 rf..h.......r..........
3 .......................
4 .......................
5 ..........f............
6 ...........h....h......
7 ......r................

Turn = 2.
  01234567890123456789012
0 .....h......t........t.
1 rr..........r..........
2 rf.h...................
3 .......................
4 .......................
5 ..........f............
6 ..........h............
7 .....r..........h......

Turn = 3.
  01234567890123456789012
0 ....h.......r........t.
1 rr..........r..........
2 rfh....................
3 .......................
4 .......................
5 ..........f............
6 .........h.............
7 ....r...........h......

Turn = 4.
  01234567890123456789012
0 rr.h........r........t.
1 r...........r..........
2 .fh....................
3 .......................
4 .......................
5 ..........f............
6 ........h..............
7 ...r............h......

*** Darwin 16x30 ***
Turn = 0.
  012345678901234567890123456789
0 .............t................
1 ..............................
2 ..............................
3 .........h....................
4 .f............................
5 ..................f...........
6 ..............................
7 ........................h.....
8 ........r.....................
9 r.............................
0 ....................t.........
1 ......................f.......
2 ..............................
3 ............f.................
4 ..............................
5 .....h........................

Turn = 3.
  012345678901234567890123456789
0 .........h...t................
1 ..............................
2 ..............................
3 ..............................
4 .f......................h.....
5 ..................f...........
6 ..............................
7 r.............................
8 ..............................
9 ..............................
0 ....................t.........
1 ........r.............f.......
2 ..............................
3 ............f.................
4 ..............................
5 ..h...........................

Turn = 6.
  012345678901234567890123456789
0 .........h...t................
1 ........................h.....
2 ..............................
3 ..............................
4 rf............................
5 ..................f...........
6 ..............................
7 ..............................
8 ..............................
9 ..............................
0 ....................t.........
1 ......................f.......
2 ..............................
3 ............f.................
4 ........r.....................
5 h.............................

Turn = 9.
  012345678901234567890123456789
0 .........h...t..........h.....
1 r.............................
2 ..............................
3 ..............................
4 .f............................
5 ..................f...........
6 ..............................
7 ..............................
8 ..............................
9 ..............................
0 ....................t.........
1 ......................f.......
2 ..............................
3 ............f.................
4 ..............................
5 h........r....................

*** Darwin 29x19 ***
Turn = 0.
  0123456789012345678
0 ...................
1 ...r...............
2 ...................
3 ...................
4 ..........r.t......
5 ...................
6 ................t..
7 ...................
8 ...................
9 ...................
0 ...................
1 ...................
2 ............f......
3 ..............f....
4 ...................
5 ...................
6 ...................
7 ...................
8 ...................
9 f..................
0 .......f.....h.....
1 ...................
2 .......r...........
3 ...................
4 ...................
5 ...................
6 ...................
7 ...................
8 ...................

Turn = 2.
  0123456789012345678
0 ...r...............
1 ...................
2 ...................
3 ...................
4 ...........r.r.....
5 ...................
6 ................t..
7 ...................
8 ...................
9 ...................
0 ...................
1 ...................
2 ............f......
3 ..............f....
4 ...................
5 ...................
6 ...................
7 ...................
8 ...................
9 f..................
0 .......f...........
1 ...................
2 .............h.....
3 ...................
4 .......r...........
5 ...................
6 ...................
7 ...................
8 ...................

Turn = 4.
  0123456789012345678
0 .....r.............
1 ...................
2 ...................
3 ...................
4 .............r.r...
5 ...................
6 ................t..
7 ...................
8 ...................
9 ...................
0 ...................
1 ...................
2 ............f......
3 ..............f....
4 ...................
5 ...................
6 ...................
7 ...................
8 ...................
9 f..................
0 .......f...........
1 ...................
2 ...................
3 ...................
4 .............h.....
5 ...................
6 .......r...........
7 ...................
8 ...................

*** Darwin 34x18 ***
Turn = 0.
  012345678901234567
0 ..................
1 ..................
2 ..................
3 ..................
4 ..................
5 .................h
6 ..................
7 ..................
8 ..................
9 ..................
0 ...........r......
1 ..................
2 ..................
3 ..................
4 ..................
5 ..................
6 ..................
7 ..................
8 ..................
9 ...............r..
0 ..................
1 ..................
2 ..................
3 ..................
4 ..................
5 ..................
6 ..................
7 ..................
8 ..................
9 ..................
0 ..................
1 ..................
2 ..............t...
3 ..................

Turn = 4.
  012345678901234567
0 ..................
1 ..................
2 ..................
3 ..................
4 ..................
5 .................h
6 ..................
7 ..................
8 ..................
9 ..................
0 ..................
1 ..................
2 ..................
3 ..................
4 ...........r......
5 ..................
6 ..................
7 ..................
8 ..................
9 ...........r......
0 ..................
1 ..................
2 ..................
3 ..................
4 ..................
5 ..................
6 ..................
7 ..................
8 ..................
9 ..................
0 ..................
1 ..................
2 ..............t...
3 ..................

Turn = 8.
  012345678901234567
0 ..................
1 ..................
2 ..................
3 ..................
4 ..................
5 .................h
6 ..................
7 ..................
8 ..................
9 ..................
0 ..................
1 ..................
2 ..................
3 ..................
4 ..................
5 ..................
6 ..................
7 ..................
8 ...........r......
9 .......r..........
0 ..................
1 ..................
2 ..................
3 ..................
4 ..................
5 ..................
6 ..................
7 ..................
8 ..................
9 ..................
0 ..................
1 ..................
2 ..............t...
3 ..................

*** Darwin 24x11 ***
Turn = 0.
  01234567890
0 ...........
1 ...r...f...
2 ...........
3 ...........
4 ........h..
5 ...........
6 ...........
7 ...........
8 ...........
9 .t.........
0 ...........
1 ...........
2 ........t..
3 .........f.
4 ...........
5 ...........
6 f..........
7 ........h..
8 ...........
9 ...........
0 r..........
1 ...........
2 ...........
3 ...........

Turn = 2.
  01234567890
0 ...r.......
1 .......f...
2 ...........
3 ...........
4 ..........h
5 ...........
6 ...........
7 ...........
8 ...........
9 .t.........
0 ...........
1 ...........
2 ........t..
3 .........f.
4 ...........
5 ...........
6 f..........
7 ..........h
8 ...........
9 ...........
0 ..r........
1 ...........
2 ...........
3 ...........

Turn = 4.
  01234567890
0 .....r.....
1 .......f...
2 ...........
3 ...........
4 ..........h
5 ...........
6 ...........
7 ...........
8 ...........
9 .t.........
0 ...........
1 ...........
2 ........t..
3 .........f.
4 ...........
5 ...........
6 f..........
7 ..........h
8 ...........
9 ...........
0 ....r......
1 ...........
2 ...........
3 ...........

Turn = 6.
  01234567890
0 .......r...
1 .......f...
2 ...........
3 ...........
4 ..........h
5 ...........
6 ...........
7 ...........
8 ...........
9 .t.........
0 ...........
1 ...........
2 ........t..
3 .........f.
4 ...........
5 ...........
6 f..........
7 ..........h
8 ...........
9 ...........
0 ......r....
1 ...........
2 ...........
3 ...........

Turn = 8.
  01234567890
0 .........r.
1 .......f...
2 ...........
3 ...........
4 ..........h
5 ...........
6 ...........
7 ...........
8 ...........
9 .t.........
0 ...........
1 ...........
2 ........t..
3 .........f.
4 ...........
5 ...........
6 f..........
7 ..........h
8 ...........
9 ...........
0 ........r..
1 ...........
2 ...........
3 ...........

*** Darwin 30x5 ***
Turn = 0.
  01234
0 .....
1 .....
2 .....
3 .....
4 .....
5 .....
6 .....
7 .....
8 .....
9 .....
0 .....
1 .....
2 .....
3 .....
4 .....
5 ....t
6 .....
7 .....
8 .....
9 .....
0 .....
1 .....
2 .....
3 ..t..
4 .....
5 .....
6 ...r.
7 .....
8 .....
9 .....

Turn = 5.
  01234
0 .....
1 .....
2 .....
3 .....
4 .....
5 .....
6 .....
7 .....
8 .....
9 .....
0 .....
1 .....
2 .....
3 .....
4 .....
5 ....t
6 .....
7 .....
8 .....
9 .....
0 .....
1 .....
2 .....
3 ..t..
4 .....
5 r....
6 .....
7 .....
8 .....
9 .....

*** Darwin 15x8 ***
Turn = 0.
  01234567
0 .....t..
1 ....rh..
2 .t.t.h..
3 .....f..
4 ........
5 ........
6 ..h.....
7 ........
8 ........
9 ........
0 .....f..
1 ........
2 .....r..
3 .t...t.f
4 .h......

Turn = 4.
  01234567
0 .....t..
1 r....t..
2 .t.t.t..
3 .....f..
4 ........
5 ........
6 ........
7 ........
8 ........
9 ........
0 ..h..f..
1 ........
2 .r......
3 .t...t.f
4 .t......

Turn = 8.
  01234567
0 .r...t..
1 .....t..
2 .t.t.t..
3 .....t..
4 ........
5 ........
6 ........
7 ........
8 ........
9 ........
0 .....f..
1 ........
2 ........
3 tt...t.f
4 .th.....

Turn = 12.
  01234567
0 ....rr..
1 .....t..
2 .t.t.t..
3 .....t..
4 ........
5 ........
6 ........
7 ........
8 ........
9 ........
0 .....f..
1 ........
2 ........
3 tt...t.f
4 .tt.....

*** Darwin 21x14 ***
Turn = 0.
  01234567890123
0 .......r......
1 ..............
2 ..............
3 .....r........
4 ...r.........r
5 .....r........
6 ..............
7 r....r........
8 ..............
9 f.....r.......
0 ..............
1 .............f
2 ..............
3 ..............
4 .......r......
5 .........h....
6 ..............
7 ....t.........
8 ..............
9 ..............
0 .....f........

Turn = 4.
  01234567890123
0 ...r.r........
1 ...r..........
2 ..............
3 ..............
4 ..............
5 ......r.......
6 ..............
7 ..............
8 ..rr.........r
9 f....r........
0 .......r......
1 .............f
2 ..............
3 ..............
4 ..............
5 ..............
6 ..............
7 ....t.........
8 ..............
9 .........h....
0 .....f........

Turn = 8.
  01234567890123
0 r........r....
1 ......rr......
2 ..............
3 ..............
4 ..............
5 ..............
6 .......r......
7 ..............
8 ..............
9 f.............
0 ..............
1 ...........r.r
2 ..rr..........
3 .....r........
4 ..............
5 ..............
6 ..............
7 ....t.........
8 ..............
9 ..............
0 .....f...h....

Turn = 12.
  01234567890123
0 ...rr........r
1 ...........r..
2 .......r......
3 ..............
4 ..............
5 ..............
6 ..............
7 ..............
8 ..............
9 f.............
0 ..............
1 .......r......
2 ..............
3 ..............
4 ..............
5 .............r
6 ..rr..........
7 ....tr........
8 ..............
9 ..............
0 .....f...h....

*** Darwin 35x22 ***
Turn = 0.
  0123456789012345678901
0 ......................
1 ......................
2 ......................
3 ......................
4 ......................
5 ...........f..........
6 ....................t.
7 ......................
8 ......................
9 ......................
0 ......................
1 ......................
2 ......................
3 ......................
4 ............h.........
5 ......................
6 ...............f......
7 ......................
8 ...........t..........
9 ......................
0 ......................
1 t..........r..........
2 ......................
3 ......................
4 .....h................
5 ...............h......
6 ..................f...
7 ......................
8 ......................
9 ......................
0 ......................
1 ..r........h..........
2 ......................
3 ......................
4 ......................

*** Darwin 17x28 ***
Turn = 0.
  0123456789012345678901234567
0 ............................
1 ............................
2 ............................
3 ............................
4 ............................
5 ......................f.....
6 ............................
7 .t....r.....................
8 ............................
9 ............................
0 ......t.....................
1 ............................
2 ............................
3 ............................
4 ............................
5 ............t...........f...
6 ............................

Turn = 4.
  0123456789012345678901234567
0 ............................
1 ............................
2 ............................
3 ............................
4 ............................
5 ......................f.....
6 ............................
7 .t..........................
8 ............................
9 ......r.....................
0 .......r....................
1 ............................
2 ............................
3 ............................
4 ............................
5 ............t...........f...
6 ............................

Turn = 8.
  0123456789012345678901234567
0 ............................
1 ............................
2 ............................
3 ............................
4 ............................
5 ......................f.....
6 ............................
7 .t..........................
8 ............................
9 ..........r.................
0 ...........r................
1 ............................
2 ............................
3 ............................
4 ............................
5 ............t...........f...
6 ............................

*** Darwin 11x35 ***
Turn = 0.
  01234567890123456789012345678901234
0 ...................................
1 ...............t...................
2 ........r....................r.....
3 ....f..............................
4 ...................................
5 ...................................
6 ...................................
7 ....r.........h....................
8 ....f..............................
9 .............................r.....
0 ...................................

Turn = 2.
  01234567890123456789012345678901234
0 ...................................
1 ...............t...................
2 ..........r....................r...
3 ....f..............................
4 ...................................
5 ...................................
6 ...................................
7 ..r..........................r.....
8 ....f..............................
9 ..............h....................
0 ...................................

Turn = 4.
  01234567890123456789012345678901234
0 ...................................
1 ...............t...................
2 ............r....................r.
3 ....f..............................
4 ...................................
5 .............................r.....
6 ...................................
7 r..................................
8 ....f..............................
9 ...................................
0 ..............h....................

Turn = 6.
  01234567890123456789012345678901234
0 ...................................
1 ...............t...................
2 ..............r...................r
3 ....f........................r.....
4 ...................................
5 ...................................
6 r..................................
7 ...................................
8 ....f..............................
9 ...................................
0 ..............h....................

Turn = 8.
  01234567890123456789012345678901234
0 ..................................r
1 ...............t.............r.....
2 ................r..................
3 ....f..............................
4 r..................................
5 ...................................
6 ...................................
7 ...................................
8 ....f..............................
9 ...................................
0 ..............h....................

Turn = 10.
  01234567890123456789012345678901234
0 .............................r....r
1 ...............t...................
2 r.................r................
3 ....f..............................
4 ...................................
5 ...................................
6 ...................................
7 ...................................
8 ....f..............................
9 ...................................
0 ..............h....................

*** Darwin 24x7 ***
Turn = 0.
  0123456
0 .......
1 .t..r..
2 .......
3 .......
4 .......
5 .t.....
6 .......
7 .r.....
8 .......
9 .......
0 .......
1 .......
2 .......
3 .......
4 .......
5 .......
6 .......
7 .......
8 .......
9 .......
0 ...f...
1 .......
2 .......
3 .......

Turn = 2.
  0123456
0 .......
1 .t.....
2 .......
3 ....r..
4 .......
5 .t.....
6 .......
7 ...r...
8 .......
9 .......
0 .......
1 .......
2 .......
3 .......
4 .......
5 .......
6 .......
7 .......
8 .......
9 .......
0 ...f...
1 .......
2 .......
3 .......

Turn = 4.
  0123456
0 .......
1 .t.....
2 .......
3 .......
4 .......
5 .t..r..
6 .......
7 .....r.
8 .......
9 .......
0 .......
1 .......
2 .......
3 .......
4 .......
5 .......
6 .......
7 .......
8 .......
9 .......
0 ...f...
1 .......
2 .......
3 .......

Turn = 6.
  0123456
0 .......
1 .t.....
2 .......
3 .......
4 .......
5 .t.....
6 .......
7 ....r.r
8 .......
9 .......
0 .......
1 .......
2 .......
3 .......
4 .......
5 .......
6 .......
7 .......
8 .......
9 .......
0 ...f...
1 .......
2 .......
3 .......

*** Darwin 16x7 ***
Turn = 0.
  0123456
0 ......h
1 h......
2 .......
3 .......
4 .......
5 .......
6 ......h
7 .......
8 .......
9 f......
0 .......
1 ....f..
2 .......
3 f......
4 .f.....
5 ......r

*** Darwin 34x22 ***
Turn = 0.
  0123456789012345678901
0 ......................
1 ..........t...........
2 ................h.....
3 ......................
4 ......................
5 ......................
6 ......................
7 ......................
8 ......................
9 ......................
0 ......................
1 ......................
2 ......................
3 ......................
4 ......................
5 ......................
6 ......................
7 ......................
8 ......................
9 ..f...................
0 ......................
1 ......................
2 ......................
3 ......................
4 ......................
5 ......................
6 ......................
7 ......................
8 ......................
9 ......................
0 ......................
1 ......................
2 ......................
3 ......................

Turn = 5.
  0123456789012345678901
0 ......................
1 ..........t...........
2 .....................h
3 ......................
4 ......................
5 ......................
6 ......................
7 ......................
8 ......................
9 ......................
0 ......................
1 ......................
2 ......................
3 ......................
4 ......................
5 ......................
6 ......................
7 ......................
8 ......................
9 ..f...................
0 ......................
1 ......................
2 ......................
3 ......................
4 ......................
5 ......................
6 ......................
7 ......................
8 ......................
9 ......................
0 ......................
1 ......................
2 ......................
3 ......................

*** Darwin 21x29 ***
Turn = 0.
  01234567890123456789012345678
0 ...........r..............h..
1 ...f.........................
2 ....................h........
3 ................r............
4 ..........h.............f....
5 .............................
6 .............................
7 .............................
8 .............................
9 .............................
0 .............................
1 .............................
2 .............h...............
3 ..t..........................
4 .....f.......................
5 .............................
6 .............................
7 .r.............r.............
8 .............................
9 ...h......t..................
0 ...........h.................

Turn = 3.
  01234567890123456789012345678
0 .............................
1 ...f.........................
2 .......................h.....
3 ...........r..............h..
4 ........................f....
5 .............................
6 ................r............
7 ..........h..................
8 .............................
9 .............................
0 .............................
1 .............................
2 .............................
3 ..t..........................
4 .r...f.......................
5 .............h...............
6 .............................
7 ..................r..........
8 .............................
9 ..........t..................
0 ...h..........h..............

Turn = 6.
  01234567890123456789012345678
0 .............................
1 ...f.........................
2 ..........................h..
3 .............................
4 ........................f....
5 .............................
6 ...........r..............h..
7 .............................
8 .............................
9 ................r............
0 ..........h..................
1 .r...........................
2 .............................
3 ..t..........................
4 .....f.......................
5 .............................
6 .............................
7 .....................r.......
8 .............h...............
9 ..........t..................
0 ...h.............h...........

*** Darwin 25x19 ***
Turn = 0.
  0123456789012345678
0 .r.................
1 .....h.............
2 ...................
3 ...................
4 ...................
5 ...................
6 ......h............
7 ...................
8 ................h..
9 ...................
0 ...................
1 h.......f..........
2 .....f.............
3 ...................
4 .......f...........
5 ...................
6 ........h..........
7 .........f.........
8 ...................
9 ...................
0 ......h............
1 ...r...............
2 ....t..............
3 ...................
4 ...................

Turn = 5.
  0123456789012345678
0 ....r.r............
1 ...................
2 ...................
3 ...................
4 ...................
5 ...................
6 ...........h.......
7 ...................
8 ..................h
9 ...................
0 ...................
1 h.......f..........
2 .....f.............
3 ...................
4 .......f...........
5 ......h............
6 ...h...............
7 .........f.........
8 ...................
9 ...................
0 ...................
1 ...................
2 ....t..............
3 ...................
4 ....r..............

Turn = 10.
  0123456789012345678
0 ...........r.......
1 ...................
2 ...................
3 ...................
4 ...................
5 ....r..............
6 ................h..
7 ...................
8 ..................h
9 ...................
0 ......h............
1 h.......f..........
2 .....f.............
3 ...................
4 .......f...........
5 ...................
6 h..................
7 .........f.........
8 ...................
9 ...................
0 ...................
1 ...................
2 ....t..............
3 ...................
4 .........r.........

*** Darwin 25x33 ***
Turn = 0.
  012345678901234567890123456789012
0 .................................
1 .................................
2 .................................
3 .................................
4 ......f..........................
5 .................................
6 .................................
7 ...............................t.
8 ......................r..........
9 ...............f.................
0 .................................
1 ...........t.....................
2 .................................
3 .................................
4 .................................
5 ........................tr..r....
6 .................................
7 .................................
8 .................................
9 .f...............................
0 ......................t..........
1 .................................
2 ...............f.................
3 ......r..........................
4 f................................

Turn = 1.
  012345678901234567890123456789012
0 .................................
1 .................................
2 .................................
3 .................................
4 ......f..........................
5 .................................
6 .................................
7 ...............................t.
8 .......................r.........
9 ...............f.................
0 .................................
1 ...........t.....................
2 .................................
3 .................................
4 .........................r..r....
5 ........................t........
6 .................................
7 .................................
8 .................................
9 .f...............................
0 ......................t..........
1 .................................
2 ...............f.................
3 .....r...........................
4 f................................

Turn = 2.
  012345678901234567890123456789012
0 .................................
1 .................................
2 .................................
3 .................................
4 ......f..........................
5 .................................
6 .................................
7 ...............................t.
8 ........................r........
9 ...............f.................
0 .................................
1 ...........t.....................
2 .................................
3 .........................r..r....
4 .................................
5 ........................t........
6 .................................
7 .................................
8 .................................
9 .f...............................
0 ......................t..........
1 .................................
2 ...............f.................
3 ....r............................
4 f................................

Turn = 3.
  012345678901234567890123456789012
0 .................................
1 .................................
2 .................................
3 .................................
4 ......f..........................
5 .................................
6 .................................
7 ...............................t.
8 .........................r.......
9 ...............f.................
0 .................................
1 ...........t.....................
2 .........................r..r....
3 .................................
4 .................................
5 ........................t........
6 .................................
7 .................................
8 .................................
9 .f...............................
0 ......................t..........
1 .................................
2 ...............f.................
3 ...r.............................
4 f................................

Turn = 4.
  012345678901234567890123456789012
0 .................................
1 .................................
2 .................................
3 .................................
4 ......f..........................
5 .................................
6 .................................
7 ...............................t.
8 ..........................r......
9 ...............f.................
0 .................................
1 ...........t.............r..r....
2 .................................
3 .................................
4 .................................
5 ........................t........
6 .................................
7 .................................
8 .................................
9 .f...............................
0 ......................t..........
1 .................................
2 ...............f.................
3 ..r..............................
4 f................................

Turn = 5.
  012345678901234567890123456789012
0 .................................
1 .................................
2 .................................
3 .................................
4 ......f..........................
5 .................................
6 .................................
7 ...............................t.
8 ...........................r.....
9 ...............f.................
0 .........................r..r....
1 ...........t.....................
2 .................................
3 .................................
4 .................................
5 ........................t........
6 .................................
7 .................................
8 .................................
9 .f...............................
0 ......................t..........
1 .................................
2 ...............f.................
3 .r...............................
4 f................................

Turn = 6.
  012345678901234567890123456789012
0 .................................
1 .................................
2 .................................
3 .................................
4 ......f..........................
5 .................................
6 .................................
7 ...............................t.
8 ............................r....
9 ...............f.........r..r....
0 .................................
1 ...........t.....................
2 .................................
3 .................................
4 .................................
5 ........................t........
6 .................................
7 .................................
8 .................................
9 .f...............................
0 ......................t..........
1 .................................
2 ...............f.................
3 r................................
4 f................................

Turn = 7.
  012345678901234567890123456789012
0 .................................
1 .................................
2 .................................
3 .................................
4 ......f..........................
5 .................................
6 .................................
7 ...............................t.
8 .........................r..rr...
9 ...............f.................
0 .................................
1 ...........t.....................
2 .................................
3 .................................
4 .................................
5 ........................t........
6 .................................
7 .................................
8 .................................
9 .f...............................
0 ......................t..........
1 .................................
2 ...............f.................
3 r................................
4 f................................

*** Darwin 13x34 ***
Turn = 0.
  0123456789012345678901234567890123
0 ............................t.....
1 ................................f.
2 ...............h..................
3 ..................................
4 ..................h...............
5 ..................................
6 ..................................
7 ..................................
8 ..................................
9 ..................................
0 ..................................
1 .t................................
2 ..................................

Turn = 4.
  0123456789012345678901234567890123
0 ............................t.....
1 ................................f.
2 ..................................
3 ..................................
4 ......................h...........
5 ..................................
6 ...............h..................
7 ..................................
8 ..................................
9 ..................................
0 ..................................
1 .t................................
2 ..................................

Turn = 8.
  0123456789012345678901234567890123
0 ............................t.....
1 ................................f.
2 ..................................
3 ..................................
4 ..........................h.......
5 ..................................
6 ..................................
7 ..................................
8 ..................................
9 ..................................
0 ...............h..................
1 .t................................
2 ..................................

Turn = 12.
  0123456789012345678901234567890123
0 ............................t.....
1 ................................f.
2 ..................................
3 ..................................
4 ..............................h...
5 ..................................
6 ..................................
7 ..................................
8 ..................................
9 ..................................
0 ..................................
1 .t................................
2 ...............h..................

*** Darwin 19x24 ***
Turn = 0.
  012345678901234567890123
0 ........................
1 ........................
2 ........................
3 ........................
4 ........................
5 ........................
6 ........................
7 ................r.......
8 ........................
9 ........................
0 ........................
1 .t......................
2 ........................
3 .r......................
4 ........................
5 ........h...............
6 ........................
7 ........................
8 ........................

Turn = 5.
  012345678901234567890123
0 ........................
1 ........................
2 ........................
3 ........................
4 ........................
5 ........................
6 ........................
7 ........................
8 ........................
9 ........................
0 ........h...............
1 r.......................
2 r...............r.......
3 ........................
4 ........................
5 ........................
6 ........................
7 ........................
8 ........................
