*** Darwin 5x10 ***
Turn = 0.
  0123456789
0 .....f....
1 ..........
2 ..........
3 ..........
4 ..........

Turn = 1.
  0123456789
0 .....f....
1 ..........
2 ..........
3 ..........
4 ..........

Turn = 2.
  0123456789
0 .....f....
1 ..........
2 ..........
3 ..........
4 ..........

Turn = 3.
  0123456789
0 .....f....
1 ..........
2 ..........
3 ..........
4 ..........

Turn = 4.
  0123456789
0 .....f....
1 ..........
2 ..........
3 ..........
4 ..........

Turn = 5.
  0123456789
0 .....f....
1 ..........
2 ..........
3 ..........
4 ..........

Turn = 6.
  0123456789
0 .....f....
1 ..........
2 ..........
3 ..........
4 ..........

Turn = 7.
  0123456789
0 .....f....
1 ..........
2 ..........
3 ..........
4 ..........

Turn = 8.
  0123456789
0 .....f....
1 ..........
2 ..........
3 ..........
4 ..........

Turn = 9.
  0123456789
0 .....f....
1 ..........
2 ..........
3 ..........
4 ..........

Turn = 10.
  0123456789
0 .....f....
1 ..........
2 ..........
3 ..........
4 ..........

Turn = 11.
  0123456789
0 .....f....
1 ..........
2 ..........
3 ..........
4 ..........

Turn = 12.
  0123456789
0 .....f....
1 ..........
2 ..........
3 ..........
4 ..........

Turn = 13.
  0123456789
0 .....f....
1 ..........
2 ..........
3 ..........
4 ..........

Turn = 14.
  0123456789
0 .....f....
1 ..........
2 ..........
3 ..........
4 ..........

Turn = 15.
  0123456789
0 .....f....
1 ..........
2 ..........
3 ..........
4 ..........

Turn = 16.
  0123456789
0 .....f....
1 ..........
2 ..........
3 ..........
4 ..........

Turn = 17.
  0123456789
0 .....f....
1 ..........
2 ..........
3 ..........
4 ..........

Turn = 18.
  0123456789
0 .....f....
1 ..........
2 ..........
3 ..........
4 ..........

Turn = 19.
  0123456789
0 .....f....
1 ..........
2 ..........
3 ..........
4 ..........

Turn = 20.
  0123456789
0 .....f....
1 ..........
2 ..........
3 ..........
4 ..........

*** Darwin 10x8 ***
Turn = 0.
  01234567
0 ...r....
1 ....h...
2 ..t.....
3 .....t..
4 ........
5 ........
6 ........
7 ........
8 ........
9 ........

Turn = 2.
  01234567
0 ....h...
1 ........
2 ..tt....
3 .....t..
4 ........
5 ........
6 ........
7 ........
8 ........
9 ........

Turn = 4.
  01234567
0 ....h...
1 ........
2 ..tt....
3 .....t..
4 ........
5 ........
6 ........
7 ........
8 ........
9 ........

Turn = 6.
  01234567
0 ....h...
1 ........
2 ..tt....
3 .....t..
4 ........
5 ........
6 ........
7 ........
8 ........
9 ........

Turn = 8.
  01234567
0 ....h...
1 ........
2 ..tt....
3 .....t..
4 ........
5 ........
6 ........
7 ........
8 ........
9 ........

Turn = 10.
  01234567
0 ....h...
1 ........
2 ..tt....
3 .....t..
4 ........
5 ........
6 ........
7 ........
8 ........
9 ........

Turn = 12.
  01234567
0 ....h...
1 ........
2 ..tt....
3 .....t..
4 ........
5 ........
6 ........
7 ........
8 ........
9 ........

Turn = 14.
  01234567
0 ....h...
1 ........
2 ..tt....
3 .....t..
4 ........
5 ........
6 ........
7 ........
8 ........
9 ........

*** Darwin 6x7 ***
Turn = 0.
  0123456
0 .r.....
1 .......
2 .......
3 .......
4 .......
5 .......

Turn = 1.
  0123456
0 ..r....
1 .......
2 .......
3 .......
4 .......
5 .......

Turn = 2.
  0123456
0 ...r...
1 .......
2 .......
3 .......
4 .......
5 .......

Turn = 3.
  0123456
0 ....r..
1 .......
2 .......
3 .......
4 .......
5 .......

Turn = 4.
  0123456
0 .....r.
1 .......
2 .......
3 .......
4 .......
5 .......

Turn = 5.
  0123456
0 ......r
1 .......
2 .......
3 .......
4 .......
5 .......

Turn = 6.
  0123456
0 ......r
1 .......
2 .......
3 .......
4 .......
5 .......

Turn = 7.
  0123456
0 .......
1 ......r
2 .......
3 .......
4 .......
5 .......

Turn = 8.
  0123456
0 .......
1 .......
2 ......r
3 .......
4 .......
5 .......

Turn = 9.
  0123456
0 .......
1 .......
2 .......
3 ......r
4 .......
5 .......

Turn = 10.
  0123456
0 .......
1 .......
2 .......
3 .......
4 ......r
5 .......

Turn = 11.
  0123456
0 .......
1 .......
2 .......
3 .......
4 .......
5 ......r

Turn = 12.
  0123456
0 .......
1 .......
2 .......
3 .......
4 .......
5 ......r

Turn = 13.
  0123456
0 .......
1 .......
2 .......
3 .......
4 .......
5 ......r

Turn = 14.
  0123456
0 .......
1 .......
2 .......
3 .......
4 .......
5 ......r

Turn = 15.
  0123456
0 .......
1 .......
2 .......
3 .......
4 .......
5 .....r.

Turn = 16.
  0123456
0 .......
1 .......
2 .......
3 .......
4 .......
5 ....r..

Turn = 17.
  0123456
0 .......
1 .......
2 .......
3 .......
4 .......
5 ...r...

*** Darwin 3x3 ***
Turn = 0.
  012
0 ..r
1 ..f
2 ...

Turn = 2.
  012
0 ...
1 r.r
2 ...

Turn = 4.
  012
0 r..
1 ...
2 ..r

Turn = 6.
  012
0 .r.
1 ...
2 ..r

Turn = 8.
  012
0 ..r
1 ...
2 r..

Turn = 10.
  012
0 ...
1 ...
2 r.r

Turn = 12.
  012
0 ...
1 ...
2 .rr

Turn = 14.
  012
0 ...
1 ...
2 r.r

Turn = 16.
  012
0 ...
1 r..
2 ..r

Turn = 18.
  012
0 r.r
1 ...
2 ...

Turn = 20.
  012
0 .r.
1 r..
2 ...

*** Darwin 9x5 ***
Turn = 0.
  01234
0 .t...
1 .....
2 .....
3 .....
4 .....
5 .....
6 .....
7 .....
8 .....

Turn = 1.
  01234
0 .t...
1 .....
2 .....
3 .....
4 .....
5 .....
6 .....
7 .....
8 .....

Turn = 2.
  01234
0 .t...
1 .....
2 .....
3 .....
4 .....
5 .....
6 .....
7 .....
8 .....

Turn = 3.
  01234
0 .t...
1 .....
2 .....
3 .....
4 .....
5 .....
6 .....
7 .....
8 .....

Turn = 4.
  01234
0 .t...
1 .....
2 .....
3 .....
4 .....
5 .....
6 .....
7 .....
8 .....

Turn = 5.
  01234
0 .t...
1 .....
2 .....
3 .....
4 .....
5 .....
6 .....
7 .....
8 .....

Turn = 6.
  01234
0 .t...
1 .....
2 .....
3 .....
4 .....
5 .....
6 .....
7 .....
8 .....

Turn = 7.
  01234
0 .t...
1 .....
2 .....
3 .....
4 .....
5 .....
6 .....
7 .....
8 .....

Turn = 8.
  01234
0 .t...
1 .....
2 .....
3 .....
4 .....
5 .....
6 .....
7 .....
8 .....

Turn = 9.
  01234
0 .t...
1 .....
2 .....
3 .....
4 .....
5 .....
6 .....
7 .....
8 .....

Turn = 10.
  01234
0 .t...
1 .....
2 .....
3 .....
4 .....
5 .....
6 .....
7 .....
8 .....

Turn = 11.
  01234
0 .t...
1 .....
2 .....
3 .....
4 .....
5 .....
6 .....
7 .....
8 .....

Turn = 12.
  01234
0 .t...
1 .....
2 .....
3 .....
4 .....
5 .....
6 .....
7 .....
8 .....

Turn = 13.
  01234
0 .t...
1 .....
2 .....
3 .....
4 .....
5 .....
6 .....
7 .....
8 .....

Turn = 14.
  01234
0 .t...
1 .....
2 .....
3 .....
4 .....
5 .....
6 .....
7 .....
8 .....

Turn = 15.
  01234
0 .t...
1 .....
2 .....
3 .....
4 .....
5 .....
6 .....
7 .....
8 .....

Turn = 16.
  01234
0 .t...
1 .....
2 .....
3 .....
4 .....
5 .....
6 .....
7 .....
8 .....

*** Darwin 7x6 ***
Turn = 0.
  012345
0 ..r...
1 ...h..
2 .....t
3 ......
4 ......
5 ......
6 ......

Turn = 1.
  012345
0 ......
1 ..r...
2 ...h.t
3 ......
4 ......
5 ......
6 ......

Turn = 2.
  012345
0 ......
1 ......
2 ..r..t
3 ...h..
4 ......
5 ......
6 ......

Turn = 3.
  012345
0 ......
1 ......
2 .....t
3 ..r...
4 ...h..
5 ......
6 ......

Turn = 4.
  012345
0 ......
1 ......
2 .....t
3 ......
4 ..r...
5 ...h..
6 ......

Turn = 5.
  012345
0 ......
1 ......
2 .....t
3 ......
4 ......
5 ..r...
6 ...h..

Turn = 6.
  012345
0 ......
1 ......
2 .....t
3 ......
4 ......
5 ......
6 ..rh..

Turn = 7.
  012345
0 ......
1 ......
2 .....t
3 ......
4 ......
5 ......
6 ..rh..

Turn = 8.
  012345
0 ......
1 ......
2 .....t
3 ......
4 ......
5 ......
6 .r.h..

Turn = 9.
  012345
0 ......
1 ......
2 .....t
3 ......
4 ......
5 ......
6 r..h..

Turn = 10.
  012345
0 ......
1 ......
2 .....t
3 ......
4 ......
5 ......
6 r..h..

Turn = 11.
  012345
0 ......
1 ......
2 .....t
3 ......
4 ......
5 ......
6 r..h..

Turn = 12.
  012345
0 ......
1 ......
2 .....t
3 ......
4 ......
5 ......
6 r..h..

*** Darwin 5x4 ***
Turn = 0.
  0123
0 .t..
1 ....
2 ....
3 ....
4 ....

Turn = 2.
  0123
0 .t..
1 ....
2 ....
3 ....
4 ....

Turn = 4.
  0123
0 .t..
1 ....
2 ....
3 ....
4 ....

Turn = 6.
  0123
0 .t..
1 ....
2 ....
3 ....
4 ....

Turn = 8.
  0123
0 .t..
1 ....
2 ....
3 ....
4 ....

Turn = 10.
  0123
0 .t..
1 ....
2 ....
3 ....
4 ....

Turn = 12.
  0123
0 .t..
1 ....
2 ....
3 ....
4 ....

*** Darwin 3x3 ***
Turn = 0.
  012
0 .t.
1 .h.
2 ...

Turn = 1.
  012
0 .t.
1 ..h
2 ...

Turn = 2.
  012
0 .t.
1 ..h
2 ...

Turn = 3.
  012
0 .t.
1 ..h
2 ...

Turn = 4.
  012
0 .t.
1 ..h
2 ...

Turn = 5.
  012
0 .t.
1 ..h
2 ...

Turn = 6.
  012
0 .t.
1 ..h
2 ...

Turn = 7.
  012
0 .t.
1 ..h
2 ...

Turn = 8.
  012
0 .t.
1 ..h
2 ...

Turn = 9.
  012
0 .t.
1 ..h
2 ...

Turn = 10.
  012
0 .t.
1 ..h
2 ...

Turn = 11.
  012
0 .t.
1 ..h
2 ...

Turn = 12.
  012
0 .t.
1 ..h
2 ...

Turn = 13.
  012
0 .t.
1 ..h
2 ...

Turn = 14.
  012
0 .t.
1 ..h
2 ...

Turn = 15.
  012
0 .t.
1 ..h
2 ...

Turn = 16.
  012
0 .t.
1 ..h
2 ...

*** Darwin 3x5 ***
Turn = 0.
  01234
0 ....r
1 ...h.
2 .....

Turn = 2.
  01234
0 ..r..
1 ....h
2 .....

Turn = 4.
  01234
0 r....
1 ....h
2 .....

Turn = 6.
  01234
0 r....
1 ....h
2 .....

Turn = 8.
  01234
0 r....
1 ....h
2 .....

Turn = 10.
  01234
0 ..r..
1 ....h
2 .....

Turn = 12.
  01234
0 ....r
1 ....h
2 .....

*** Darwin 9x9 ***
Turn = 0.
  012345678
0 ......t..
1 ......r..
2 .......h.
3 ...t.....
4 .........
5 .........
6 .........
7 .........
8 .........

Turn = 1.
  012345678
0 ......t..
1 ......t..
2 .........
3 ...t...h.
4 .........
5 .........
6 .........
7 .........
8 .........

Turn = 2.
  012345678
0 ......t..
1 ......t..
2 .........
3 ...t.....
4 .......h.
5 .........
6 .........
7 .........
8 .........

Turn = 3.
  012345678
0 ......t..
1 ......t..
2 .........
3 ...t.....
4 .........
5 .......h.
6 .........
7 .........
8 .........

Turn = 4.
  012345678
0 ......t..
1 ......t..
2 .........
3 ...t.....
4 .........
5 .........
6 .......h.
7 .........
8 .........

Turn = 5.
  012345678
0 ......t..
1 ......t..
2 .........
3 ...t.....
4 .........
5 .........
6 .........
7 .......h.
8 .........

Turn = 6.
  012345678
0 ......t..
1 ......t..
2 .........
3 ...t.....
4 .........
5 .........
6 .........
7 .........
8 .......h.

Turn = 7.
  012345678
0 ......t..
1 ......t..
2 .........
3 ...t.....
4 .........
5 .........
6 .........
7 .........
8 .......h.

Turn = 8.
  012345678
0 ......t..
1 ......t..
2 .........
3 ...t.....
4 .........
5 .........
6 .........
7 .........
8 .......h.

Turn = 9.
  012345678
0 ......t..
1 ......t..
2 .........
3 ...t.....
4 .........
5 .........
6 .........
7 .........
8 .......h.

Turn = 10.
  012345678
0 ......t..
1 ......t..
2 .........
3 ...t.....
4 .........
5 .........
6 .........
7 .........
8 .......h.

Turn = 11.
  012345678
0 ......t..
1 ......t..
2 .........
3 ...t.....
4 .........
5 .........
6 .........
7 .........
8 .......h.

Turn = 12.
  012345678
0 ......t..
1 ......t..
2 .........
3 ...t.....
4 .........
5 .........
6 .........
7 .........
8 .......h.

Turn = 13.
  012345678
0 ......t..
1 ......t..
2 .........
3 ...t.....
4 .........
5 .........
6 .........
7 .........
8 .......h.

Turn = 14.
  012345678
0 ......t..
1 ......t..
2 .........
3 ...t.....
4 .........
5 .........
6 .........
7 .........
8 .......h.

*** Darwin 6x3 ***
Turn = 0.
  012
0 .t.
1 .r.
2 ..h
3 ...
4 ...
5 ...

Turn = 2.
  012
0 .t.
1 .t.
2 ..h
3 ...
4 ...
5 ...

Turn = 4.
  012
0 .t.
1 .t.
2 ..h
3 ...
4 ...
5 ...

Turn = 6.
  012
0 .t.
1 .t.
2 ..h
3 ...
4 ...
5 ...

Turn = 8.
  012
0 .t.
1 .t.
2 ..h
3 ...
4 ...
5 ...

Turn = 10.
  012
0 .t.
1 .t.
2 ..h
3 ...
4 ...
5 ...

Turn = 12.
  012
0 .t.
1 .t.
2 ..h
3 ...
4 ...
5 ...

Turn = 14.
  012
0 .t.
1 .t.
2 ..h
3 ...
4 ...
5 ...

*** Darwin 9x4 ***
Turn = 0.
  0123
0 .f..
1 ....
2 ....
3 ....
4 ....
5 ....
6 ....
7 ....
8 ....

Turn = 1.
  0123
0 .f..
1 ....
2 ....
3 ....
4 ....
5 ....
6 ....
7 ....
8 ....

Turn = 2.
  0123
0 .f..
1 ....
2 ....
3 ....
4 ....
5 ....
6 ....
7 ....
8 ....

Turn = 3.
  0123
0 .f..
1 ....
2 ....
3 ....
4 ....
5 ....
6 ....
7 ....
8 ....

Turn = 4.
  0123
0 .f..
1 ....
2 ....
3 ....
4 ....
5 ....
6 ....
7 ....
8 ....

Turn = 5.
  0123
0 .f..
1 ....
2 ....
3 ....
4 ....
5 ....
6 ....
7 ....
8 ....

Turn = 6.
  0123
0 .f..
1 ....
2 ....
3 ....
4 ....
5 ....
6 ....
7 ....
8 ....

Turn = 7.
  0123
0 .f..
1 ....
2 ....
3 ....
4 ....
5 ....
6 ....
7 ....
8 ....

Turn = 8.
  0123
0 .f..
1 ....
2 ....
3 ....
4 ....
5 ....
6 ....
7 ....
8 ....

Turn = 9.
  0123
0 .f..
1 ....
2 ....
3 ....
4 ....
5 ....
6 ....
7 ....
8 ....

Turn = 10.
  0123
0 .f..
1 ....
2 ....
3 ....
4 ....
5 ....
6 ....
7 ....
8 ....

Turn = 11.
  0123
0 .f..
1 ....
2 ....
3 ....
4 ....
5 ....
6 ....
7 ....
8 ....

Turn = 12.
  0123
0 .f..
1 ....
2 ....
3 ....
4 ....
5 ....
6 ....
7 ....
8 ....

Turn = 13.
  0123
0 .f..
1 ....
2 ....
3 ....
4 ....
5 ....
6 ....
7 ....
8 ....

Turn = 14.
  0123
0 .f..
1 ....
2 ....
3 ....
4 ....
5 ....
6 ....
7 ....
8 ....

Turn = 15.
  0123
0 .f..
1 ....
2 ....
3 ....
4 ....
5 ....
6 ....
7 ....
8 ....

Turn = 16.
  0123
0 .f..
1 ....
2 ....
3 ....
4 ....
5 ....
6 ....
7 ....
8 ....

Turn = 17.
  0123
0 .f..
1 ....
2 ....
3 ....
4 ....
5 ....
6 ....
7 ....
8 ....

Turn = 18.
  0123
0 .f..
1 ....
2 ....
3 ....
4 ....
5 ....
6 ....
7 ....
8 ....

*** Darwin 9x6 ***
Turn = 0.
  012345
0 ...t..
1 ......
2 ......
3 ......
4 ......
5 ......
6 ......
7 ......
8 ......

Turn = 2.
  012345
0 ...t..
1 ......
2 ......
3 ......
4 ......
5 ......
6 ......
7 ......
8 ......

Turn = 4.
  012345
0 ...t..
1 ......
2 ......
3 ......
4 ......
5 ......
6 ......
7 ......
8 ......

Turn = 6.
  012345
0 ...t..
1 ......
2 ......
3 ......
4 ......
5 ......
6 ......
7 ......
8 ......

Turn = 8.
  012345
0 ...t..
1 ......
2 ......
3 ......
4 ......
5 ......
6 ......
7 ......
8 ......

Turn = 10.
  012345
0 ...t..
1 ......
2 ......
3 ......
4 ......
5 ......
6 ......
7 ......
8 ......

Turn = 12.
  012345
0 ...t..
1 ......
2 ......
3 ......
4 ......
5 ......
6 ......
7 ......
8 ......

Turn = 14.
  012345
0 ...t..
1 ......
2 ......
3 ......
4 ......
5 ......
6 ......
7 ......
8 ......

*** Darwin 9x6 ***
Turn = 0.
  012345
0 .f....
1 ...h..
2 .r....
3 ...t..
4 ...t..
5 ......
6 ......
7 ......
8 ......

Turn = 1.
  012345
0 .f....
1 ..h...
2 ..r...
3 ...t..
4 ...t..
5 ......
6 ......
7 ......
8 ......

Turn = 2.
  012345
0 .f....
1 .h....
2 ...r..
3 ...t..
4 ...t..
5 ......
6 ......
7 ......
8 ......

Turn = 3.
  012345
0 .f....
1 h.....
2 ....r.
3 ...t..
4 ...t..
5 ......
6 ......
7 ......
8 ......

Turn = 4.
  012345
0 .f....
1 h.....
2 .....r
3 ...t..
4 ...t..
5 ......
6 ......
7 ......
8 ......

Turn = 5.
  012345
0 .f....
1 h.....
2 .....r
3 ...t..
4 ...t..
5 ......
6 ......
7 ......
8 ......

Turn = 6.
  012345
0 .f....
1 h.....
2 ......
3 ...t.r
4 ...t..
5 ......
6 ......
7 ......
8 ......

Turn = 7.
  012345
0 .f....
1 h.....
2 ......
3 ...t..
4 ...t.r
5 ......
6 ......
7 ......
8 ......

Turn = 8.
  012345
0 .f....
1 h.....
2 ......
3 ...t..
4 ...t..
5 .....r
6 ......
7 ......
8 ......

Turn = 9.
  012345
0 .f....
1 h.....
2 ......
3 ...t..
4 ...t..
5 ......
6 .....r
7 ......
8 ......

Turn = 10.
  012345
0 .f....
1 h.....
2 ......
3 ...t..
4 ...t..
5 ......
6 ......
7 .....r
8 ......

Turn = 11.
  012345
0 .f....
1 h.....
2 ......
3 ...t..
4 ...t..
5 ......
6 ......
7 ......
8 .....r

Turn = 12.
  012345
0 .f....
1 h.....
2 ......
3 ...t..
4 ...t..
5 ......
6 ......
7 ......
8 .....r

Turn = 13.
  012345
0 .f....
1 h.....
2 ......
3 ...t..
4 ...t..
5 ......
6 ......
7 ......
8 .....r

Turn = 14.
  012345
0 .f....
1 h.....
2 ......
3 ...t..
4 ...t..
5 ......
6 ......
7 ......
8 .....r

Turn = 15.
  012345
0 .f....
1 h.....
2 ......
3 ...t..
4 ...t..
5 ......
6 ......
7 ......
8 ....r.

Turn = 16.
  012345
0 .f....
1 h.....
2 ......
3 ...t..
4 ...t..
5 ......
6 ......
7 ......
8 ...r..

*** Darwin 6x4 ***
Turn = 0.
  0123
0 ...f
1 ..f.
2 .r..
3 ..r.
4 .r..
5 ....

Turn = 2.
  0123
0 .r.f
1 ..r.
2 ..r.
3 ....
4 ...r
5 ....

Turn = 4.
  0123
0 ..rf
1 r.r.
2 ....
3 ...r
4 ....
5 ....

Turn = 6.
  0123
0 r.rr
1 ...r
2 ...r
3 ....
4 ....
5 ....

Turn = 8.
  0123
0 .r.r
1 ...r
2 ..rr
3 ....
4 ....
5 ....

Turn = 10.
  0123
0 ..rr
1 ...r
2 .r..
3 ....
4 ..r.
5 ....

*** Darwin 8x7 ***
Turn = 0.
  0123456
0 .....f.
1 ......h
2 .....r.
3 .....f.
4 ..h....
5 .......
6 .......
7 .......

Turn = 1.
  0123456
0 .....f.
1 .......
2 .....rr
3 .....f.
4 ...h...
5 .......
6 .......
7 .......

Turn = 2.
  0123456
0 .....f.
1 .......
2 .....r.
3 .....fr
4 ....h..
5 .......
6 .......
7 .......

Turn = 3.
  0123456
0 .....f.
1 .......
2 .....r.
3 .....r.
4 .....hr
5 .......
6 .......
7 .......

Turn = 4.
  0123456
0 .....f.
1 .......
2 .....r.
3 ....r..
4 .....h.
5 ......r
6 .......
7 .......

Turn = 5.
  0123456
0 .....f.
1 .......
2 ....r..
3 ...r...
4 ......h
5 .......
6 ......r
7 .......

Turn = 6.
  0123456
0 .....f.
1 .......
2 ...r...
3 ..r....
4 ......h
5 .......
6 .......
7 ......r

Turn = 7.
  0123456
0 .....f.
1 .......
2 ..r....
3 .r.....
4 ......h
5 .......
6 .......
7 ......r

Turn = 8.
  0123456
0 .....f.
1 .......
2 .r.....
3 r......
4 ......h
5 .......
6 .......
7 .....r.

Turn = 9.
  0123456
0 .....f.
1 .......
2 r......
3 r......
4 ......h
5 .......
6 .......
7 ....r..

Turn = 10.
  0123456
0 .....f.
1 .......
2 r......
3 r......
4 ......h
5 .......
6 .......
7 ...r...

Turn = 11.
  0123456
0 .....f.
1 r......
2 .......
3 r......
4 ......h
5 .......
6 .......
7 ..r....

Turn = 12.
  0123456
0 r....f.
1 .......
2 .......
3 .......
4 r.....h
5 .......
6 .......
7 .r.....

Turn = 13.
  0123456
0 r....f.
1 .......
2 .......
3 .......
4 ......h
5 r......
6 .......
7 r......

Turn = 14.
  0123456
0 .r...f.
1 .......
2 .......
3 .......
4 ......h
5 .......
6 r......
7 r......

Turn = 15.
  0123456
0 ..r..f.
1 .......
2 .......
3 .......
4 ......h
5 .......
6 r......
7 r......

*** Darwin 6x9 ***
Turn = 0.
  012345678
0 ...r.....
1 .......r.
2 ...f.....
3 .....r...
4 ....h....
5 .........

Turn = 2.
  012345678
0 .....r...
1 .....r..r
2 ...f.....
3 .........
4 .........
5 ....h....

Turn = 4.
  012345678
0 .....r.r.
1 .........
2 ...f.....
3 ........r
4 .........
5 ....h....

Turn = 6.
  012345678
0 ...r....r
1 .........
2 ...f.....
3 .........
4 .........
5 ....h...r

Turn = 8.
  012345678
0 .r.......
1 .........
2 ...f....r
3 .........
4 .........
5 ....h..r.

Turn = 10.
  012345678
0 r........
1 .........
2 ...f.....
3 .........
4 ........r
5 ....hr...

Turn = 12.
  012345678
0 .r.......
1 .........
2 ...f.....
3 .........
4 .........
5 ....rr..r

*** Darwin 3x7 ***
Turn = 0.
  0123456
0 ...f...
1 .......
2 .......

Turn = 1.
  0123456
0 ...f...
1 .......
2 .......

Turn = 2.
  0123456
0 ...f...
1 .......
2 .......

Turn = 3.
  0123456
0 ...f...
1 .......
2 .......

Turn = 4.
  0123456
0 ...f...
1 .......
2 .......

Turn = 5.
  0123456
0 ...f...
1 .......
2 .......

Turn = 6.
  0123456
0 ...f...
1 .......
2 .......

Turn = 7.
  0123456
0 ...f...
1 .......
2 .......

Turn = 8.
  0123456
0 ...f...
1 .......
2 .......

Turn = 9.
  0123456
0 ...f...
1 .......
2 .......

Turn = 10.
  0123456
0 ...f...
1 .......
2 .......

Turn = 11.
  0123456
0 ...f...
1 .......
2 .......

Turn = 12.
  0123456
0 ...f...
1 .......
2 .......

Turn = 13.
  0123456
0 ...f...
1 .......
2 .......

*** Darwin 8x6 ***
Turn = 0.
  012345
0 ...r..
1 .t....
2 .h....
3 ..r...
4 ......
5 ......
6 ......
7 ......

Turn = 1.
  012345
0 ..r...
1 .t....
2 ......
3 .h....
4 ..r...
5 ......
6 ......
7 ......

Turn = 2.
  012345
0 .t....
1 .t....
2 ......
3 ......
4 .h....
5 ..r...
6 ......
7 ......

Turn = 3.
  012345
0 .t....
1 .t....
2 ......
3 ......
4 ......
5 .h....
6 ..r...
7 ......

Turn = 4.
  012345
0 .t....
1 .t....
2 ......
3 ......
4 ......
5 ......
6 .h....
7 ..r...

Turn = 5.
  012345
0 .t....
1 .t....
2 ......
3 ......
4 ......
5 ......
6 ......
7 .hr...

Turn = 6.
  012345
0 .t....
1 .t....
2 ......
3 ......
4 ......
5 ......
6 ......
7 .rr...

Turn = 7.
  012345
0 .t....
1 .t....
2 ......
3 ......
4 ......
5 ......
6 ......
7 .rr...

Turn = 8.
  012345
0 .t....
1 .t....
2 ......
3 ......
4 ......
5 ......
6 ..r...
7 .r....

Turn = 9.
  012345
0 .t....
1 .t....
2 ......
3 ......
4 ......
5 ..r...
6 ......
7 .r....

Turn = 10.
  012345
0 .t....
1 .t....
2 ......
3 ......
4 ..r...
5 ......
6 ......
7 r.....

Turn = 11.
  012345
0 .t....
1 .t....
2 ......
3 ..r...
4 ......
5 ......
6 ......
7 r.....

Turn = 12.
  012345
0 .t....
1 .t....
2 ..r...
3 ......
4 ......
5 ......
6 r.....
7 ......

Turn = 13.
  012345
0 .t....
1 .tr...
2 ......
3 ......
4 ......
5 r.....
6 ......
7 ......

*** Darwin 3x8 ***
Turn = 0.
  01234567
0 ......r.
1 ........
2 ........

Turn = 1.
  01234567
0 .......r
1 ........
2 ........

Turn = 2.
  01234567
0 .......r
1 ........
2 ........

Turn = 3.
  01234567
0 ........
1 .......r
2 ........

Turn = 4.
  01234567
0 ........
1 ........
2 .......r

Turn = 5.
  01234567
0 ........
1 ........
2 .......r

Turn = 6.
  01234567
0 ........
1 ........
2 .......r

Turn = 7.
  01234567
0 ........
1 ........
2 .......r

Turn = 8.
  01234567
0 ........
1 ........
2 ......r.

Turn = 9.
  01234567
0 ........
1 ........
2 .....r..

Turn = 10.
  01234567
0 ........
1 ........
2 ....r...

Turn = 11.
  01234567
0 ........
1 ........
2 ...r....

Turn = 12.
  01234567
0 ........
1 ........
2 ..r.....

Turn = 13.
  01234567
0 ........
1 ........
2 .r......

Turn = 14.
  01234567
0 ........
1 ........
2 r.......

Turn = 15.
  01234567
0 ........
1 ........
2 r.......

Turn = 16.
  01234567
0 ........
1 r.......
2 ........

*** Darwin 9x9 ***
Turn = 0.
  012345678
0 ...r.....
1 .........
2 .........
3 .........
4 .........
5 .........
6 .........
7 .........
8 .........

Turn = 2.
  012345678
0 .........
1 .........
2 ...r.....
3 .........
4 .........
5 .........
6 .........
7 .........
8 .........

Turn = 4.
  012345678
0 .........
1 .........
2 .........
3 .........
4 ...r.....
5 .........
6 .........
7 .........
8 .........

Turn = 6.
  012345678
0 .........
1 .........
2 .........
3 .........
4 .........
5 .........
6 ...r.....
7 .........
8 .........

Turn = 8.
  012345678
0 .........
1 .........
2 .........
3 .........
4 .........
5 .........
6 .........
7 .........
8 ...r.....

Turn = 10.
  012345678
0 .........
1 .........
2 .........
3 .........
4 .........
5 .........
6 .........
7 .........
8 ..r......

Turn = 12.
  012345678
0 .........
1 .........
2 .........
3 .........
4 .........
5 .........
6 .........
7 .........
8 r........

*** Darwin 3x7 ***
Turn = 0.
  0123456
0 .....f.
1 .......
2 .......

Turn = 1.
  0123456
0 .....f.
1 .......
2 .......

Turn = 2.
  0123456
0 .....f.
1 .......
2 .......

Turn = 3.
  0123456
0 .....f.
1 .......
2 .......

Turn = 4.
  0123456
0 .....f.
1 .......
2 .......

Turn = 5.
  0123456
0 .....f.
1 .......
2 .......

Turn = 6.
  0123456
0 .....f.
1 .......
2 .......

Turn = 7.
  0123456
0 .....f.
1 .......
2 .......

Turn = 8.
  0123456
0 .....f.
1 .......
2 .......

Turn = 9.
  0123456
0 .....f.
1 .......
2 .......

Turn = 10.
  0123456
0 .....f.
1 .......
2 .......

Turn = 11.
  0123456
0 .....f.
1 .......
2 .......

Turn = 12.
  0123456
0 .....f.
1 .......
2 .......

Turn = 13.
  0123456
0 .....f.
1 .......
2 .......

Turn = 14.
  0123456
0 .....f.
1 .......
2 .......

Turn = 15.
  0123456
0 .....f.
1 .......
2 .......

Turn = 16.
  0123456
0 .....f.
1 .......
2 .......

Turn = 17.
  0123456
0 .....f.
1 .......
2 .......

*** Darwin 8x4 ***
Turn = 0.
  0123
0 ..h.
1 .f..
2 .t..
3 ..r.
4 ..h.
5 ..r.
6 .h..
7 ....

Turn = 1.
  0123
0 ...h
1 .f..
2 .t..
3 .r..
4 ..h.
5 .r..
6 h...
7 ....

Turn = 2.
  0123
0 ...h
1 .t..
2 .t..
3 r...
4 ....
5 r.h.
6 h...
7 ....

Turn = 3.
  0123
0 ...h
1 .t..
2 .t..
3 r...
4 ....
5 r...
6 h.h.
7 ....

Turn = 4.
  0123
0 ...h
1 .t..
2 rt..
3 ....
4 ....
5 r...
6 r...
7 ..h.

Turn = 5.
  0123
0 ...h
1 rt..
2 .t..
3 ....
4 ....
5 r...
6 r...
7 ..h.

Turn = 6.
  0123
0 r..h
1 .t..
2 .t..
3 ....
4 ....
5 r...
6 .r..
7 ..h.

Turn = 7.
  0123
0 r..h
1 .t..
2 .t..
3 ....
4 r...
5 ....
6 ..r.
7 ..h.

Turn = 8.
  0123
0 r..h
1 .t..
2 .t..
3 r...
4 ....
5 ....
6 ...r
7 ..h.

Turn = 9.
  0123
0 ...h
1 rt..
2 rt..
3 ....
4 ....
5 ....
6 ...r
7 ..h.

Turn = 10.
  0123
0 ...h
1 rt..
2 rt..
3 ....
4 ....
5 ....
6 ....
7 ..hr

Turn = 11.
  0123
0 ...h
1 rt..
2 rt..
3 ....
4 ....
5 ....
6 ....
7 ..hr

*** Darwin 8x3 ***
Turn = 0.
  012
0 .h.
1 ..r
2 ...
3 ...
4 ...
5 ...
6 ...
7 ...

Turn = 1.
  012
0 ..r
1 .h.
2 ...
3 ...
4 ...
5 ...
6 ...
7 ...

Turn = 2.
  012
0 ..r
1 ...
2 .h.
3 ...
4 ...
5 ...
6 ...
7 ...

Turn = 3.
  012
0 ..r
1 ...
2 ...
3 .h.
4 ...
5 ...
6 ...
7 ...

Turn = 4.
  012
0 ..r
1 ...
2 ...
3 ...
4 .h.
5 ...
6 ...
7 ...

Turn = 5.
  012
0 ..r
1 ...
2 ...
3 ...
4 ...
5 .h.
6 ...
7 ...

Turn = 6.
  012
0 ...
1 ..r
2 ...
3 ...
4 ...
5 ...
6 .h.
7 ...

Turn = 7.
  012
0 ...
1 ...
2 ..r
3 ...
4 ...
5 ...
6 ...
7 .h.

Turn = 8.
  012
0 ...
1 ...
2 ...
3 ..r
4 ...
5 ...
6 ...
7 .h.

Turn = 9.
  012
0 ...
1 ...
2 ...
3 ...
4 ..r
5 ...
6 ...
7 .h.

Turn = 10.
  012
0 ...
1 ...
2 ...
3 ...
4 ...
5 ..r
6 ...
7 .h.

Turn = 11.
  012
0 ...
1 ...
2 ...
3 ...
4 ...
5 ...
6 ..r
7 .h.

Turn = 12.
  012
0 ...
1 ...
2 ...
3 ...
4 ...
5 ...
6 ...
7 .hr

Turn = 13.
  012
0 ...
1 ...
2 ...
3 ...
4 ...
5 ...
6 ...
7 .hr

Turn = 14.
  012
0 ...
1 ...
2 ...
3 ...
4 ...
5 ...
6 ...
7 .rr

Turn = 15.
  012
0 ...
1 ...
2 ...
3 ...
4 ...
5 ...
6 ...
7 .rr

Turn = 16.
  012
0 ...
1 ...
2 ...
3 ...
4 ...
5 ...
6 ...
7 r.r

*** Darwin 4x4 ***
Turn = 0.
  0123
0 ..t.
1 ....
2 ....
3 ....

Turn = 2.
  0123
0 ..t.
1 ....
2 ....
3 ....

Turn = 4.
  0123
0 ..t.
1 ....
2 ....
3 ....

Turn = 6.
  0123
0 ..t.
1 ....
2 ....
3 ....

Turn = 8.
  0123
0 ..t.
1 ....
2 ....
3 ....

Turn = 10.
  0123
0 ..t.
1 ....
2 ....
3 ....

Turn = 12.
  0123
0 ..t.
1 ....
2 ....
3 ....

Turn = 14.
  0123
0 ..t.
1 ....
2 ....
3 ....

Turn = 16.
  0123
0 ..t.
1 ....
2 ....
3 ....

Turn = 18.
  0123
0 ..t.
1 ....
2 ....
3 ....

Turn = 20.
  0123
0 ..t.
1 ....
2 ....
3 ....

*** Darwin 10x7 ***
Turn = 0.
  0123456
0 ......t
1 .f.....
2 ..r....
3 .r.....
4 .t.....
5 ......t
6 ......f
7 ..h....
8 .......
9 .......

Turn = 1.
  0123456
0 ......t
1 .f.....
2 ...r...
3 .r.....
4 .......
5 .r....t
6 ..h...f
7 .......
8 .......
9 .......

Turn = 2.
  0123456
0 ......t
1 .f.....
2 ....r..
3 .......
4 .r.....
5 ..h...t
6 .r....f
7 .......
8 .......
9 .......

Turn = 3.
  0123456
0 ......t
1 .f.....
2 .....r.
3 .......
4 ..h....
5 .r....t
6 ......t
7 .r.....
8 .......
9 .......

Turn = 4.
  0123456
0 ......t
1 .f.....
2 ......r
3 ..h....
4 .......
5 ......t
6 .r....t
7 .......
8 .r.....
9 .......

Turn = 5.
  0123456
0 ......t
1 .f.....
2 ..h...r
3 .......
4 .......
5 ......t
6 ......t
7 .r.....
8 .......
9 .r.....

Turn = 6.
  0123456
0 ......t
1 .fh....
2 .......
3 ......r
4 .......
5 ......t
6 ......t
7 .......
8 .r.....
9 .r.....

Turn = 7.
  0123456
0 ..h...t
1 .f.....
2 .......
3 .......
4 ......r
5 ......t
6 ......t
7 .......
8 .r.....
9 ..r....

Turn = 8.
  0123456
0 ..h...t
1 .f.....
2 .......
3 .......
4 ......r
5 ......r
6 ......r
7 .......
8 r......
9 ...r...

Turn = 9.
  0123456
0 ..h...t
1 .f.....
2 .......
3 .......
4 ......r
5 ......r
6 .......
7 ......r
8 r......
9 ....r..

Turn = 10.
  0123456
0 ..h...t
1 .f.....
2 .......
3 .......
4 .....r.
5 .....r.
6 .......
7 .......
8 ......r
9 r....r.

Turn = 11.
  0123456
0 ..h...t
1 .f.....
2 .......
3 .......
4 ....r..
5 ....r..
6 .......
7 .......
8 .......
9 r....rr

Turn = 12.
  0123456
0 ..h...t
1 .f.....
2 .......
3 .......
4 ...r...
5 ...r...
6 .......
7 .......
8 .......
9 .r...rr

Turn = 13.
  0123456
0 ..h...t
1 .f.....
2 .......
3 .......
4 ..r....
5 ..r....
6 .......
7 .......
8 .......
9 ..r.r.r

Turn = 14.
  0123456
0 ..h...t
1 .f.....
2 .......
3 .......
4 .r.....
5 .r.....
6 .......
7 .......
8 .......
9 ...rr.r

Turn = 15.
  0123456
0 ..h...t
1 .f.....
2 .......
3 .......
4 r......
5 r......
6 .......
7 .......
8 .......
9 ...rrr.

Turn = 16.
  0123456
0 ..h...t
1 .f.....
2 .......
3 .......
4 r......
5 r......
6 .......
7 .......
8 .......
9 ...rrr.

Turn = 17.
  0123456
0 ..h...t
1 .f.....
2 .......
3 .......
4 r......
5 .......
6 r......
7 .......
8 ....rr.
9 ...r...

Turn = 18.
  0123456
0 ..h...t
1 .f.....
2 .......
3 .......
4 .r.....
5 .......
6 .......
7 r...rr.
8 .......
9 ...r...

*** Darwin 4x7 ***
Turn = 0.
  0123456
0 ....h..
1 .......
2 .......
3 .......

Turn = 2.
  0123456
0 .......
1 .......
2 ....h..
3 .......

Turn = 4.
  0123456
0 .......
1 .......
2 .......
3 ....h..

Turn = 6.
  0123456
0 .......
1 .......
2 .......
3 ....h..

Turn = 8.
  0123456
0 .......
1 .......
2 .......
3 ....h..

Turn = 10.
  0123456
0 .......
1 .......
2 .......
3 ....h..

Turn = 12.
  0123456
0 .......
1 .......
2 .......
3 ....h..

Turn = 14.
  0123456
0 .......
1 .......
2 .......
3 ....h..

Turn = 16.
  0123456
0 .......
1 .......
2 .......
3 ....h..

Turn = 18.
  0123456
0 .......
1 .......
2 .......
3 ....h..

*** Darwin 6x5 ***
Turn = 0.
  01234
0 .t...
1 ...t.
2 .....
3 .....
4 .....
5 .....

Turn = 2.
  01234
0 .t...
1 ...t.
2 .....
3 .....
4 .....
5 .....

Turn = 4.
  01234
0 .t...
1 ...t.
2 .....
3 .....
4 .....
5 .....

Turn = 6.
  01234
0 .t...
1 ...t.
2 .....
3 .....
4 .....
5 .....

Turn = 8.
  01234
0 .t...
1 ...t.
2 .....
3 .....
4 .....
5 .....

Turn = 10.
  01234
0 .t...
1 ...t.
2 .....
3 .....
4 .....
5 .....

*** Darwin 4x9 ***
Turn = 0.
  012345678
0 .....f...
1 .t.......
2 .r.......
3 .........

Turn = 1.
  012345678
0 .....f...
1 .t.......
2 .........
3 .r.......

Turn = 2.
  012345678
0 .....f...
1 .t.......
2 .........
3 .r.......

Turn = 3.
  012345678
0 .....f...
1 .t.......
2 .........
3 r........

Turn = 4.
  012345678
0 .....f...
1 .t.......
2 .........
3 r........

Turn = 5.
  012345678
0 .....f...
1 .t.......
2 .........
3 r........

Turn = 6.
  012345678
0 .....f...
1 .t.......
2 .........
3 r........

Turn = 7.
  012345678
0 .....f...
1 .t.......
2 r........
3 .........

Turn = 8.
  012345678
0 .....f...
1 rt.......
2 .........
3 .........

Turn = 9.
  012345678
0 r....f...
1 .t.......
2 .........
3 .........

Turn = 10.
  012345678
0 r....f...
1 .t.......
2 .........
3 .........

Turn = 11.
  012345678
0 .r...f...
1 .t.......
2 .........
3 .........

Turn = 12.
  012345678
0 ..r..f...
1 .t.......
2 .........
3 .........

Turn = 13.
  012345678
0 ...r.f...
1 .t.......
2 .........
3 .........

Turn = 14.
  012345678
0 ....rf...
1 .t.......
2 .........
3 .........

Turn = 15.
  012345678
0 ....rr...
1 .t.......
2 .........
3 .........

Turn = 16.
  012345678
0 ....rr...
1 .t.......
2 .........
3 .........

Turn = 17.
  012345678
0 ....rr...
1 .t.......
2 .........
3 .........

*** Darwin 10x10 ***
Turn = 0.
  0123456789
0 .........t
1 .....f....
2 ..........
3 ..........
4 ..........
5 ..........
6 ..........
7 ..........
8 ..........
9 ..........

Turn = 1.
  0123456789
0 .........t
1 .....f....
2 ..........
3 ..........
4 ..........
5 ..........
6 ..........
7 ..........
8 ..........
9 ..........

Turn = 2.
  0123456789
0 .........t
1 .....f....
2 ..........
3 ..........
4 ..........
5 ..........
6 ..........
7 ..........
8 ..........
9 ..........

Turn = 3.
  0123456789
0 .........t
1 .....f....
2 ..........
3 ..........
4 ..........
5 ..........
6 ..........
7 ..........
8 ..........
9 ..........

Turn = 4.
  0123456789
0 .........t
1 .....f....
2 ..........
3 ..........
4 ..........
5 ..........
6 ..........
7 ..........
8 ..........
9 ..........

Turn = 5.
  0123456789
0 .........t
1 .....f....
2 ..........
3 ..........
4 ..........
5 ..........
6 ..........
7 ..........
8 ..........
9 ..........

Turn = 6.
  0123456789
0 .........t
1 .....f....
2 ..........
3 ..........
4 ..........
5 ..........
6 ..........
7 ..........
8 ..........
9 ..........

Turn = 7.
  0123456789
0 .........t
1 .....f....
2 ..........
3 ..........
4 ..........
5 ..........
6 ..........
7 ..........
8 ..........
9 ..........

Turn = 8.
  0123456789
0 .........t
1 .....f....
2 ..........
3 ..........
4 ..........
5 ..........
6 ..........
7 ..........
8 ..........
9 ..........

Turn = 9.
  0123456789
0 .........t
1 .....f....
2 ..........
3 ..........
4 ..........
5 ..........
6 ..........
7 ..........
8 ..........
9 ..........

Turn = 10.
  0123456789
0 .........t
1 .....f....
2 ..........
3 ..........
4 ..........
5 ..........
6 ..........
7 ..........
8 ..........
9 ..........

Turn = 11.
  0123456789
0 .........t
1 .....f....
2 ..........
3 ..........
4 ..........
5 ..........
6 ..........
7 ..........
8 ..........
9 ..........

Turn = 12.
  0123456789
0 .........t
1 .....f....
2 ..........
3 ..........
4 ..........
5 ..........
6 ..........
7 ..........
8 ..........
9 ..........

Turn = 13.
  0123456789
0 .........t
1 .....f....
2 ..........
3 ..........
4 ..........
5 ..........
6 ..........
7 ..........
8 ..........
9 ..........

Turn = 14.
  0123456789
0 .........t
1 .....f....
2 ..........
3 ..........
4 ..........
5 ..........
6 ..........
7 ..........
8 ..........
9 ..........

Turn = 15.
  0123456789
0 .........t
1 .....f....
2 ..........
3 ..........
4 ..........
5 ..........
6 ..........
7 ..........
8 ..........
9 ..........

Turn = 16.
  0123456789
0 .........t
1 .....f....
2 ..........
3 ..........
4 ..........
5 ..........
6 ..........
7 ..........
8 ..........
9 ..........

Turn = 17.
  0123456789
0 .........t
1 .....f....
2 ..........
3 ..........
4 ..........
5 ..........
6 ..........
7 ..........
8 ..........
9 ..........
