*** Darwin 10x13 ***
Turn = 0.
  0123456789012
0 ...........r.
1 ..ht..t......
2 ...........h.
3 ........r....
4 ......r......
5 .............
6 .............
7 ..t..........
8 .......t.....
9 .............

Turn = 5.
  0123456789012
0 ..h...r......
1 ...t..t...r..
2 ............h
3 .............
4 ...........r.
5 .............
6 .............
7 ..t..........
8 .......t.....
9 .............

*** Darwin 14x19 ***
Turn = 0.
  0123456789012345678
0 ...................
1 ...................
2 ...................
3 ...................
4 ...................
5 ...................
6 ...................
7 ...................
8 ...................
9 ...................
0 ...................
1 ...................
2 .................r.
3 ...................

*** Darwin 15x9 ***
Turn = 0.
  012345678
0 ..ff.....
1 .........
2 .........
3 .........
4 ......rf.
5 .........
6 .......h.
7 ......h..
8 .........
9 .....t...
0 .........
1 .........
2 .........
3 .........
4 .........

Turn = 2.
  012345678
0 ..ff.....
1 .........
2 .........
3 .........
4 .......r.
5 .........
6 .....hhr.
7 .........
8 .........
9 .....t...
0 .........
1 .........
2 .........
3 .........
4 .........

Turn = 4.
  012345678
0 ..ff.....
1 .........
2 .........
3 .........
4 ......h.r
5 .........
6 ...h.....
7 .........
8 .......r.
9 .....t...
0 .........
1 .........
2 .........
3 .........
4 .........

Turn = 6.
  012345678
0 ..ff.....
1 .........
2 ......h..
3 .........
4 .........
5 .........
6 .h......r
7 .........
8 .........
9 .....t...
0 .......r.
1 .........
2 .........
3 .........
4 .........

*** Darwin 4x7 ***
Turn = 0.
  0123456
0 ....t..
1 .......
2 .......
3 ...h...

Turn = 4.
  0123456
0 ....t..
1 .......
2 .......
3 ...h...

Turn = 8.
  0123456
0 ....t..
1 .......
2 .......
3 ...h...

*** Darwin 15x15 ***
Turn = 0.
  012345678901234
0 ...............
1 ..............r
2 ...............
3 ...............
4 ...............
5 ...............
6 ...............
7 .t.............
8 .r.............
9 ...............
0 ...............
1 ...............
2 ...............
3 ...............
4 ...............

Turn = 1.
  012345678901234
0 ...............
1 ...............
2 ..............r
3 ...............
4 ...............
5 ...............
6 ...............
7 .t.............
8 .t.............
9 ...............
0 ...............
1 ...............
2 ...............
3 ...............
4 ...............

Turn = 2.
  012345678901234
0 ...............
1 ...............
2 ...............
3 ..............r
4 ...............
5 ...............
6 ...............
7 .t.............
8 .t.............
9 ...............
0 ...............
1 ...............
2 ...............
3 ...............
4 ...............

Turn = 3.
  012345678901234
0 ...............
1 ...............
2 ...............
3 ...............
4 ..............r
5 ...............
6 ...............
7 .t.............
8 .t.............
9 ...............
0 ...............
1 ...............
2 ...............
3 ...............
4 ...............

Turn = 4.
  012345678901234
0 ...............
1 ...............
2 ...............
3 ...............
4 ...............
5 ..............r
6 ...............
7 .t.............
8 .t.............
9 ...............
0 ...............
1 ...............
2 ...............
3 ...............
4 ...............

Turn = 5.
  012345678901234
0 ...............
1 ...............
2 ...............
3 ...............
4 ...............
5 ...............
6 ..............r
7 .t.............
8 .t.............
9 ...............
0 ...............
1 ...............
2 ...............
3 ...............
4 ...............

Turn = 6.
  012345678901234
0 ...............
1 ...............
2 ...............
3 ...............
4 ...............
5 ...............
6 ...............
7 .t............r
8 .t.............
9 ...............
0 ...............
1 ...............
2 ...............
3 ...............
4 ...............

*** Darwin 1x5 ***
Turn = 0.
  01234
0 h.rf.

Turn = 1.
  01234
0 .rrf.

Turn = 2.
  01234
0 .rrf.

Turn = 3.
  01234
0 .rrf.

Turn = 4.
  01234
0 rr.f.

Turn = 5.
  01234
0 rr.f.

Turn = 6.
  01234
0 rr.f.

*** Darwin 10x15 ***
Turn = 0.
  012345678901234
0 ...............
1 ...............
2 r..............
3 ...t...........
4 ...............
5 ...............
6 ...............
7 ......r......f.
8 ..........t....
9 ...............

*** Darwin 13x18 ***
Turn = 0.
  012345678901234567
0 ..................
1 ..................
2 ...............f..
3 .......h..r.......
4 ..................
5 ............h.....
6 ..................
7 ..................
8 ............h.....
9 ..................
0 ..................
1 ..................
2 ..................

Turn = 4.
  012345678901234567
0 ..................
1 ..................
2 ...............f..
3 ..................
4 ..................
5 ................h.
6 ..................
7 .......h..r.......
8 ..................
9 ..................
0 ..................
1 ..................
2 ............h.....

Turn = 8.
  012345678901234567
0 ..................
1 ..................
2 ...............f..
3 ..................
4 ..................
5 .................h
6 ..................
7 ..................
8 ..................
9 ..................
0 ..................
1 .......h..r.......
2 ............h.....

*** Darwin 19x13 ***
Turn = 0.
  0123456789012
0 .............
1 .............
2 .............
3 .............
4 .............
5 .....r.......
6 .............
7 t............
8 .............
9 .............
0 .............
1 .............
2 .............
3 .............
4 .............
5 .............
6 .............
7 .............
8 .............

Turn = 1.
  0123456789012
0 .............
1 .............
2 .............
3 .............
4 .............
5 ....r........
6 .............
7 t............
8 .............
9 .............
0 .............
1 .............
2 .............
3 .............
4 .............
5 .............
6 .............
7 .............
8 .............

Turn = 2.
  0123456789012
0 .............
1 .............
2 .............
3 .............
4 .............
5 ...r.........
6 .............
7 t............
8 .............
9 .............
0 .............
1 .............
2 .............
3 .............
4 .............
5 .............
6 .............
7 .............
8 .............

Turn = 3.
  0123456789012
0 .............
1 .............
2 .............
3 .............
4 .............
5 ..r..........
6 .............
7 t............
8 .............
9 .............
0 .............
1 .............
2 .............
3 .............
4 .............
5 .............
6 .............
7 .............
8 .............

Turn = 4.
  0123456789012
0 .............
1 .............
2 .............
3 .............
4 .............
5 .r...........
6 .............
7 t............
8 .............
9 .............
0 .............
1 .............
2 .............
3 .............
4 .............
5 .............
6 .............
7 .............
8 .............

Turn = 5.
  0123456789012
0 .............
1 .............
2 .............
3 .............
4 .............
5 r............
6 .............
7 t............
8 .............
9 .............
0 .............
1 .............
2 .............
3 .............
4 .............
5 .............
6 .............
7 .............
8 .............

Turn = 6.
  0123456789012
0 .............
1 .............
2 .............
3 .............
4 .............
5 r............
6 .............
7 t............
8 .............
9 .............
0 .............
1 .............
2 .............
3 .............
4 .............
5 .............
6 .............
7 .............
8 .............

Turn = 7.
  0123456789012
0 .............
1 .............
2 .............
3 .............
4 r............
5 .............
6 .............
7 t............
8 .............
9 .............
0 .............
1 .............
2 .............
3 .............
4 .............
5 .............
6 .............
7 .............
8 .............

Turn = 8.
  0123456789012
0 .............
1 .............
2 .............
3 r............
4 .............
5 .............
6 .............
7 t............
8 .............
9 .............
0 .............
1 .............
2 .............
3 .............
4 .............
5 .............
6 .............
7 .............
8 .............

Turn = 9.
  0123456789012
0 .............
1 .............
2 r............
3 .............
4 .............
5 .............
6 .............
7 t............
8 .............
9 .............
0 .............
1 .............
2 .............
3 .............
4 .............
5 .............
6 .............
7 .............
8 .............

Turn = 10.
  0123456789012
0 .............
1 r............
2 .............
3 .............
4 .............
5 .............
6 .............
7 t............
8 .............
9 .............
0 .............
1 .............
2 .............
3 .............
4 .............
5 .............
6 .............
7 .............
8 .............

Turn = 11.
  0123456789012
0 r............
1 .............
2 .............
3 .............
4 .............
5 .............
6 .............
7 t............
8 .............
9 .............
0 .............
1 .............
2 .............
3 .............
4 .............
5 .............
6 .............
7 .............
8 .............

Turn = 12.
  0123456789012
0 r............
1 .............
2 .............
3 .............
4 .............
5 .............
6 .............
7 t............
8 .............
9 .............
0 .............
1 .............
2 .............
3 .............
4 .............
5 .............
6 .............
7 .............
8 .............

Turn = 13.
  0123456789012
0 r............
1 .............
2 .............
3 .............
4 .............
5 .............
6 .............
7 t............
8 .............
9 .............
0 .............
1 .............
2 .............
3 .............
4 .............
5 .............
6 .............
7 .............
8 .............

Turn = 14.
  0123456789012
0 r............
1 .............
2 .............
3 .............
4 .............
5 .............
6 .............
7 t............
8 .............
9 .............
0 .............
1 .............
2 .............
3 .............
4 .............
5 .............
6 .............
7 .............
8 .............

Turn = 15.
  0123456789012
0 .r...........
1 .............
2 .............
3 .............
4 .............
5 .............
6 .............
7 t............
8 .............
9 .............
0 .............
1 .............
2 .............
3 .............
4 .............
5 .............
6 .............
7 .............
8 .............

*** Darwin 10x1 ***
Turn = 0.
  0
0 .
1 .
2 .
3 .
4 .
5 h
6 .
7 .
8 r
9 .

Turn = 3.
  0
0 .
1 .
2 .
3 .
4 .
5 h
6 r
7 .
8 .
9 .

Turn = 6.
  0
0 .
1 .
2 .
3 .
4 .
5 r
6 r
7 .
8 .
9 .

*** Darwin 10x2 ***
Turn = 0.
  01
0 r.
1 f.
2 .h
3 .t
4 hr
5 ..
6 ..
7 f.
8 ..
9 .t

Turn = 2.
  01
0 r.
1 f.
2 .t
3 .t
4 rr
5 ..
6 ..
7 f.
8 ..
9 .t

Turn = 4.
  01
0 r.
1 f.
2 rt
3 rr
4 ..
5 ..
6 ..
7 f.
8 ..
9 .t

Turn = 6.
  01
0 rr
1 ..
2 rr
3 .r
4 r.
5 ..
6 ..
7 f.
8 ..
9 .t

Turn = 8.
  01
0 rr
1 r.
2 .r
3 ..
4 .r
5 ..
6 r.
7 f.
8 ..
9 .t

Turn = 10.
  01
0 .r
1 rr
2 .r
3 ..
4 ..
5 ..
6 rr
7 r.
8 ..
9 .t

Turn = 12.
  01
0 .r
1 r.
2 ..
3 rr
4 ..
5 ..
6 r.
7 r.
8 .r
9 .t

*** Darwin 4x20 ***
Turn = 0.
  01234567890123456789
0 ....................
1 ....................
2 ....................
3 .......r............

*** Darwin 1x17 ***
Turn = 0.
  01234567890123456
0 ..frr....f...r...

Turn = 1.
  01234567890123456
0 ..frr....f...r...

Turn = 2.
  01234567890123456
0 ..fr.r...f....r..

Turn = 3.
  01234567890123456
0 ..fr..r..f.....r.

Turn = 4.
  01234567890123456
0 ..rr...r.f......r

Turn = 5.
  01234567890123456
0 .rr.....rf......r

Turn = 6.
  01234567890123456
0 rr......rr......r

Turn = 7.
  01234567890123456
0 rr......rr......r

Turn = 8.
  01234567890123456
0 rr......rr......r

Turn = 9.
  01234567890123456
0 r.r....r.r.....r.

Turn = 10.
  01234567890123456
0 r..r..r...r...r..

Turn = 11.
  01234567890123456
0 .r..rr.....r.r...

Turn = 12.
  01234567890123456
0 ..r.rr......rr...

Turn = 13.
  01234567890123456
0 ...rrr......rr...

Turn = 14.
  01234567890123456
0 ...rrr......r.r..

*** Darwin 15x19 ***
Turn = 0.
  0123456789012345678
0 ....h........f.....
1 ...................
2 ...................
3 ...................
4 ...................
5 ...................
6 ...................
7 ...................
8 ...................
9 ...................
0 ...................
1 ...................
2 ...................
3 ...................
4 ...................

Turn = 1.
  0123456789012345678
0 ....h........f.....
1 ...................
2 ...................
3 ...................
4 ...................
5 ...................
6 ...................
7 ...................
8 ...................
9 ...................
0 ...................
1 ...................
2 ...................
3 ...................
4 ...................

Turn = 2.
  0123456789012345678
0 ....h........f.....
1 ...................
2 ...................
3 ...................
4 ...................
5 ...................
6 ...................
7 ...................
8 ...................
9 ...................
0 ...................
1 ...................
2 ...................
3 ...................
4 ...................

*** Darwin 13x19 ***
Turn = 0.
  0123456789012345678
0 ..................t
1 ...................
2 ...................
3 ................f..
4 f....r.............
5 ...................
6 ...................
7 ...................
8 ...................
9 ...................
0 ...................
1 ...............t...
2 ...................

*** Darwin 11x8 ***
Turn = 0.
  01234567
0 ...h..h.
1 ........
2 ..t.....
3 .h......
4 ........
5 ....h...
6 .f...r..
7 ........
8 ........
9 ........
0 ........

Turn = 5.
  01234567
0 ...hh...
1 .....r..
2 ..t.....
3 .....h..
4 ........
5 h.......
6 .f......
7 ........
8 ........
9 ........
0 ........

Turn = 10.
  01234567
0 ...hh..r
1 ........
2 ..t.....
3 .......h
4 ........
5 h.......
6 .f......
7 ........
8 ........
9 ........
0 ........

Turn = 15.
  01234567
0 ...hh...
1 ........
2 ..t....r
3 .......r
4 ........
5 h.......
6 .f......
7 ........
8 ........
9 ........
0 ........

*** Darwin 9x5 ***
Turn = 0.
  01234
0 .....
1 .....
2 .....
3 .....
4 .....
5 .....
6 ..t..
7 ...r.
8 .r...

Turn = 1.
  01234
0 .....
1 .....
2 .....
3 .....
4 .....
5 .....
6 ..t..
7 ....r
8 r....

Turn = 2.
  01234
0 .....
1 .....
2 .....
3 .....
4 .....
5 .....
6 ..t..
7 ....r
8 r....

Turn = 3.
  01234
0 .....
1 .....
2 .....
3 .....
4 .....
5 .....
6 ..t..
7 .....
8 r...r

Turn = 4.
  01234
0 .....
1 .....
2 .....
3 .....
4 .....
5 .....
6 ..t..
7 .....
8 r...r

Turn = 5.
  01234
0 .....
1 .....
2 .....
3 .....
4 .....
5 .....
6 ..t..
7 r....
8 ...r.

Turn = 6.
  01234
0 .....
1 .....
2 .....
3 .....
4 .....
5 .....
6 r.t..
7 .....
8 ..r..

Turn = 7.
  01234
0 .....
1 .....
2 .....
3 .....
4 .....
5 r....
6 ..t..
7 .....
8 .r...

*** Darwin 11x15 ***
Turn = 0.
  012345678901234
0 ...............
1 .............r.
2 .t.............
3 .f.............
4 ........f......
5 ...............
6 ...............
7 ...............
8 .......th.f.h..
9 ...............
0 .......f.......

Turn = 1.
  012345678901234
0 ...............
1 ............r..
2 .t.............
3 .f.............
4 ........f......
5 ...............
6 ...............
7 ........h...h..
8 .......t..f....
9 ...............
0 .......f.......

Turn = 2.
  012345678901234
0 ...............
1 ...........r...
2 .t.............
3 .f.............
4 ........f......
5 ...............
6 ........h...h..
7 ...............
8 .......t..f....
9 ...............
0 .......f.......

Turn = 3.
  012345678901234
0 ...............
1 ..........r....
2 .t.............
3 .t.............
4 ........f......
5 ........h...h..
6 ...............
7 ...............
8 .......t..f....
9 ...............
0 .......f.......

Turn = 4.
  012345678901234
0 ...............
1 .........r.....
2 .t.............
3 .t.............
4 ........f...h..
5 ........h......
6 ...............
7 ...............
8 .......t..f....
9 ...............
0 .......f.......

Turn = 5.
  012345678901234
0 ...............
1 ........r......
2 .t.............
3 .t..........h..
4 ........f......
5 ........h......
6 ...............
7 ...............
8 .......t..f....
9 ...............
0 .......f.......

Turn = 6.
  012345678901234
0 ...............
1 .......r.......
2 .t..........h..
3 .t.............
4 ........f......
5 ........h......
6 ...............
7 ...............
8 .......t..f....
9 ...............
0 .......f.......

Turn = 7.
  012345678901234
0 ...............
1 ......r.....h..
2 .t.............
3 .t.............
4 ........f......
5 ........h......
6 ...............
7 ...............
8 .......t..f....
9 ...............
0 .......f.......

Turn = 8.
  012345678901234
0 ............h..
1 .....r.........
2 .t.............
3 .t.............
4 ........f......
5 ........h......
6 ...............
7 ...............
8 .......t..f....
9 ...............
0 .......f.......

*** Darwin 7x13 ***
Turn = 0.
  0123456789012
0 .............
1 ..r.t......f.
2 h............
3 ..........h..
4 .............
5 .....h.h....f
6 .............

Turn = 2.
  0123456789012
0 .............
1 ....t......f.
2 .h...........
3 ..r....hh....
4 .............
5 .......h....f
6 .............

Turn = 4.
  0123456789012
0 .............
1 ....t..h...f.
2 ...h.........
3 ......h......
4 .............
5 ..r......h..f
6 .............

*** Darwin 9x14 ***
Turn = 0.
  01234567890123
0 ..............
1 h.............
2 ..............
3 ..............
4 ..............
5 ......h.....h.
6 ..............
7 ..............
8 ..............

Turn = 3.
  01234567890123
0 ..............
1 ...h..........
2 ..............
3 ..............
4 ..............
5 ...h..........
6 ..............
7 ..............
8 ............h.

Turn = 6.
  01234567890123
0 ..............
1 ......h.......
2 ..............
3 ..............
4 ..............
5 h.............
6 ..............
7 ..............
8 ............h.

Turn = 9.
  01234567890123
0 ..............
1 .........h....
2 ..............
3 ..............
4 ..............
5 h.............
6 ..............
7 ..............
8 ............h.

Turn = 12.
  01234567890123
0 ..............
1 ............h.
2 ..............
3 ..............
4 ..............
5 h.............
6 ..............
7 ..............
8 ............h.

*** Darwin 20x15 ***
Turn = 0.
  012345678901234
0 ..h............
1 ......f........
2 ...............
3 ...............
4 ...............
5 ...............
6 ...............
7 ...............
8 ...............
9 .h.............
0 ...............
1 ...............
2 ...........t...
3 ...............
4 .........h.....
5 ...............
6 ...............
7 ...............
8 ...............
9 ...............

Turn = 5.
  012345678901234
0 h..............
1 ......f........
2 ...............
3 ...............
4 ...............
5 ...............
6 ...............
7 ...............
8 ...............
9 h........h.....
0 ...............
1 ...............
2 ...........t...
3 ...............
4 ...............
5 ...............
6 ...............
7 ...............
8 ...............
9 ...............

Turn = 10.
  012345678901234
0 h..............
1 ......f........
2 ...............
3 ...............
4 .........h.....
5 ...............
6 ...............
7 ...............
8 ...............
9 h..............
0 ...............
1 ...............
2 ...........t...
3 ...............
4 ...............
5 ...............
6 ...............
7 ...............
8 ...............
9 ...............

*** Darwin 1x5 ***
Turn = 0.
  01234
0 hhrr.

Turn = 1.
  01234
0 hhrr.

Turn = 2.
  01234
0 hhrr.

Turn = 3.
  01234
0 hrrr.

*** Darwin 3x3 ***
Turn = 0.
  012
0 ..r
1 ..t
2 ..r

Turn = 4.
  012
0 ..t
1 r.t
2 ...

*** Darwin 3x13 ***
Turn = 0.
  0123456789012
0 .............
1 ..........h..
2 .............

Turn = 4.
  0123456789012
0 .............
1 .............
2 ..........h..

*** Darwin 13x6 ***
Turn = 0.
  012345
0 ....f.
1 ......
2 ..h.r.
3 ......
4 ......
5 ......
6 .....t
7 ......
8 ...t..
9 ......
0 ......
1 ......
2 ......

Turn = 2.
  012345
0 ....f.
1 ......
2 ....h.
3 ......
4 ....r.
5 ......
6 .....t
7 ......
8 ...t..
9 ......
0 ......
1 ......
2 ......

Turn = 4.
  012345
0 ....f.
1 ......
2 .....h
3 ......
4 ......
5 ......
6 ....rt
7 ......
8 ...t..
9 ......
0 ......
1 ......
2 ......

Turn = 6.
  012345
0 ....f.
1 ......
2 .....h
3 ......
4 ......
5 ......
6 .....t
7 ......
8 ...tt.
9 ......
0 ......
1 ......
2 ......
