*** Darwin 4x3 ***
Turn = 0.
  012
0 r.t
1 .h.
2 htr
3 hfh

Turn = 5.
  012
0 .rr
1 rr.
2 rr.
3 rrh

Turn = 10.
  012
0 rr.
1 rrr
2 r.r
3 r.r

Turn = 15.
  012
0 rrr
1 rr.
2 rr.
3 r.r

Turn = 20.
  012
0 rrr
1 r..
2 .rr
3 rrr

Turn = 25.
  012
0 .rr
1 r.r
2 rrr
3 rr.

Turn = 30.
  012
0 rrr
1 rr.
2 r.r
3 .rr

Turn = 35.
  012
0 .rr
1 .rr
2 rrr
3 rr.

Turn = 40.
  012
0 rr.
1 .r.
2 rrr
3 rrr

Turn = 45.
  012
0 r.r
1 ..r
2 rrr
3 rrr

Turn = 50.
  012
0 rrr
1 ..r
2 rr.
3 rrr

Turn = 55.
  012
0 r.r
1 ..r
2 rrr
3 rrr

Turn = 60.
  012
0 rr.
1 r.r
2 rrr
3 r.r

Turn = 65.
  012
0 rr.
1 .rr
2 r.r
3 rrr

Turn = 70.
  012
0 r.r
1 rrr
2 rr.
3 .rr

Turn = 75.
  012
0 rrr
1 r.r
2 rr.
3 rr.

Turn = 80.
  012
0 rrr
1 r..
2 rr.
3 rrr

Turn = 85.
  012
0 r.r
1 rr.
2 rrr
3 .rr

Turn = 90.
  012
0 r.r
1 .rr
2 r.r
3 rrr

Turn = 95.
  012
0 r..
1 rrr
2 rrr
3 rr.

Turn = 100.
  012
0 rrr
1 rr.
2 rr.
3 r.r

Turn = 105.
  012
0 rrr
1 .rr
2 r.r
3 r.r

Turn = 110.
  012
0 rrr
1 rrr
2 r..
3 r.r

Turn = 115.
  012
0 r.r
1 rr.
2 .rr
3 rrr

Turn = 120.
  012
0 .rr
1 .rr
2 r.r
3 rrr

Turn = 125.
  012
0 .r.
1 rrr
2 rr.
3 rrr

Turn = 130.
  012
0 .r.
1 rrr
2 .rr
3 rrr

Turn = 135.
  012
0 r.r
1 rrr
2 .rr
3 r.r

Turn = 140.
  012
0 r.r
1 .rr
2 .rr
3 rrr

Turn = 145.
  012
0 rrr
1 r.r
2 r.r
3 .rr

Turn = 150.
  012
0 .rr
1 r.r
2 rrr
3 r.r

Turn = 155.
  012
0 rrr
1 rr.
2 r.r
3 rr.

Turn = 160.
  012
0 rrr
1 rrr
2 r..
3 r.r

Turn = 165.
  012
0 .rr
1 r.r
2 .rr
3 rrr

Turn = 170.
  012
0 ..r
1 rrr
2 rr.
3 rrr

Turn = 175.
  012
0 r.r
1 rr.
2 r.r
3 rrr

Turn = 180.
  012
0 rr.
1 rr.
2 rrr
3 .rr

Turn = 185.
  012
0 rrr
1 r.r
2 r..
3 rrr

*** Darwin 16x31 ***
Turn = 0.
  0123456789012345678901234567890
0 ...............................
1 ...............................
2 ...............................
3 ...............................
4 .............................r.
5 ...............................
6 ...............................
7 ...............................
8 ...............................
9 ...............................
0 ...............................
1 ...............................
2 ...............................
3 ...............................
4 ...............................
5 ...............................

*** Darwin 27x38 ***
Turn = 0.
  01234567890123456789012345678901234567
0 ...f..................................
1 ......................................
2 .t....................................
3 ......................................
4 ......................................
5 ......................................
6 ...................f......r...........
7 ......................................
8 ......................................
9 ......................................
0 ......................................
1 .............................t........
2 ......................................
3 ...........................t..........
4 ......................................
5 ............h.........................
6 .................................t....
7 ......................................
8 ......................................
9 ......................................
0 ..........t...........................
1 ......................................
2 ......................................
3 ......................................
4 .............h........................
5 ......................................
6 ......................................

*** Darwin 35x30 ***
Turn = 0.
  012345678901234567890123456789
0 ..............................
1 ..............................
2 ..............................
3 .......f......................
4 ..............................
5 ..............................
6 ..........................r...
7 ..............................
8 ..............................
9 ..............................
0 ........r.....................
1 ...........................h..
2 ..............................
3 ..............................
4 ..............................
5 ..............................
6 ..............................
7 ..............................
8 ..............................
9 .........f.................r..
0 ..............................
1 .t..h.........................
2 ..............................
3 ..............................
4 ..............................
5 ..............................
6 ..............................
7 ...........................f..
8 ..............................
9 ..............................
0 ..............................
1 ..............................
2 ..............................
3 ..............................
4 ..............................

*** Darwin 37x38 ***
Turn = 0.
  01234567890123456789012345678901234567
0 ......r...............................
1 ......................................
2 ......................................
3 .............t........................
4 ......................................
5 ......................................
6 ....................................t.
7 ......................................
8 ......................................
9 ................r.....................
0 ......................................
1 ......................................
2 ........................h.............
3 ......................................
4 ......................................
5 ......................................
6 ......................................
7 ......................................
8 ......................................
9 ......................................
0 .................h....................
1 ......................................
2 ......................................
3 ....................f.................
4 ......................................
5 ................................h.....
6 t.....................................
7 ......................................
8 ......................................
9 ......................................
0 ......................................
1 ......................................
2 ......................................
3 ...f..................................
4 ......................................
5 ......................................
6 ......................................

Turn = 153.
  01234567890123456789012345678901234567
0 ......................................
1 ......................................
2 ......................................
3 .............t........................
4 ......................................
5 ......................................
6 ....................................t.
7 ......................................
8 ......................................
9 ......................................
0 ......................................
1 ......................................
2 ......................................
3 ......................................
4 ......................................
5 ......................................
6 ......................................
7 ......................................
8 ......................................
9 ......................................
0 ......................................
1 ......................................
2 ......................................
3 ....................f.................
4 ......................................
5 ......................................
6 .............r........................
7 ..........r...........................
8 ......................................
9 ......................................
0 ......................................
1 ......................................
2 ......................................
3 ...f..................................
4 ......................................
5 r.....................................
6 .................r.r.........r........

*** Darwin 22x6 ***
Turn = 0.
  012345
0 ...r..
1 .....r
2 ......
3 .h....
4 ......
5 .....r
6 ......
7 ......
8 ......
9 ......
0 ......
1 .r....
2 ......
3 .....t
4 ......
5 ......
6 ......
7 ...f..
8 ..t...
9 ......
0 .....t
1 ......

*** Darwin 36x38 ***
Turn = 0.
  01234567890123456789012345678901234567
0 ......................................
1 ......................................
2 ......f...............................
3 ......................................
4 ......................................
5 ......................................
6 ......................................
7 ......................................
8 ......................................
9 ......................................
0 ......................................
1 ......................................
2 ......................................
3 ......................................
4 ......................................
5 ......................................
6 ......................................
7 ......................................
8 ......................................
9 ......................................
0 ......................................
1 ......................................
2 ......................................
3 ......................................
4 ......................................
5 ......................................
6 ......................................
7 ......................................
8 ......................................
9 ......................................
0 ......................................
1 ......................................
2 ......................................
3 ......................................
4 ......................................
5 ......................................

Turn = 118.
  01234567890123456789012345678901234567
0 ......................................
1 ......................................
2 ......f...............................
3 ......................................
4 ......................................
5 ......................................
6 ......................................
7 ......................................
8 ......................................
9 ......................................
0 ......................................
1 ......................................
2 ......................................
3 ......................................
4 ......................................
5 ......................................
6 ......................................
7 ......................................
8 ......................................
9 ......................................
0 ......................................
1 ......................................
2 ......................................
3 ......................................
4 ......................................
5 ......................................
6 ......................................
7 ......................................
8 ......................................
9 ......................................
0 ......................................
1 ......................................
2 ......................................
3 ......................................
4 ......................................
5 ......................................

*** Darwin 24x6 ***
Turn = 0.
  012345
0 ......
1 r.....
2 ..r.h.
3 ......
4 ......
5 ......
6 ......
7 ......
8 ......
9 ......
0 ......
1 ...f..
2 ......
3 ......
4 ..h...
5 ......
6 .....t
7 ...t..
8 ......
9 ..r...
0 ......
1 ......
2 ......
3 ......

*** Darwin 27x37 ***
Turn = 0.
  0123456789012345678901234567890123456
0 .....................................
1 .....................................
2 .....................................
3 .....................................
4 .....................................
5 .....................................
6 .....................................
7 .....................................
8 .....................................
9 .....................................
0 .....................................
1 .....................................
2 .....................................
3 .....................................
4 .....................................
5 .....................................
6 .....................................
7 .....................................
8 .....................................
9 .....................................
0 .....................................
1 .....................................
2 .....................................
3 .........................t...........
4 .....................................
5 .....................................
6 .....................................

*** Darwin 30x26 ***
Turn = 0.
  01234567890123456789012345
0 ..........................
1 ..........................
2 ..........................
3 ..........................
4 ..........................
5 ..........................
6 .............h............
7 ..........................
8 ..........................
9 ..........................
0 ..........................
1 ..........................
2 ..........................
3 ..........................
4 ..........................
5 ..........................
6 ..........................
7 ..........................
8 ..........................
9 ..........................
0 ..........................
1 ..........................
2 ..........................
3 ..........................
4 ..........................
5 ..........................
6 ..........................
7 ..........................
8 ..........................
9 ..........................

*** Darwin 33x39 ***
Turn = 0.
  012345678901234567890123456789012345678
0 .......................................
1 ......f................................
2 .......................................
3 .......................................
4 .......................................
5 .......................................
6 ..........r............................
7 .......................................
8 .................r.....................
9 .......................................
0 .......................................
1 ...........t...........................
2 .......................................
3 .......................................
4 .......................................
5 .......................................
6 .......................................
7 .......................................
8 .....h.................................
9 .......................................
0 .......................................
1 .......................................
2 ...r...................................
3 .......................................
4 .......................................
5 .......................................
6 .......................................
7 .......................................
8 .......................................
9 .......................................
0 .......................................
1 .......................................
2 .......................................

*** Darwin 3x36 ***
Turn = 0.
  012345678901234567890123456789012345
0 ............r........fr......r......
1 .t......t...................t.......
2 ............t.............h.........

Turn = 134.
  012345678901234567890123456789012345
0 .tt.................................
1 ttt.................................
2 .tttt...............................

*** Darwin 35x28 ***
Turn = 0.
  0123456789012345678901234567
0 ............................
1 ............................
2 ............................
3 ......r....t................
4 ..............r.............
5 ............................
6 ............................
7 ............................
8 ............................
9 ............................
0 ............................
1 ............................
2 ............................
3 ............................
4 ..........................h.
5 ...........................t
6 ............f...............
7 ...............t............
8 ............................
9 ............................
0 ............................
1 ............................
2 ............................
3 ............................
4 ............................
5 ............................
6 ............................
7 ............................
8 ............................
9 ............................
0 ............................
1 ............................
2 ............................
3 ............................
4 ............................

*** Darwin 18x35 ***
Turn = 0.
  01234567890123456789012345678901234
0 ...................................
1 ...................................
2 ...................................
3 ...................................
4 ...................................
5 ....f.................t............
6 ...................................
7 ...................................
8 ...................................
9 ......h.....r......................
0 ..............................t....
1 ................r...r..............
2 ...................................
3 ........h..........................
4 t..................................
5 ...................................
6 ...................................
7 .......................t...........

Turn = 160.
  01234567890123456789012345678901234
0 ...................................
1 .......................r...........
2 ......................r..r.........
3 ...................................
4 ...................................
5 ....f.................t............
6 ...................................
7 ...................................
8 ...................................
9 ...................................
0 ..............................t....
1 ...................................
2 r..................................
3 ...................................
4 ...................................
5 r..................................
6 ...................................
7 ........r...r......................

*** Darwin 38x18 ***
Turn = 0.
  012345678901234567
0 ..................
1 ..................
2 ..................
3 ..................
4 ..................
5 ..................
6 ..................
7 ..................
8 ..................
9 ..................
0 ..................
1 ..................
2 ..................
3 ..................
4 ..................
5 ..................
6 ..................
7 ..................
8 ..................
9 ..................
0 ..................
1 ..................
2 ..................
3 ..................
4 ..................
5 ..................
6 ..................
7 ..................
8 ..................
9 ..................
0 ................f.
1 ..............t...
2 ..................
3 ..h..f............
4 ..................
5 ..................
6 ..................
7 ..................

*** Darwin 8x30 ***
Turn = 0.
  012345678901234567890123456789
0 ..............................
1 ..............................
2 ..........................t...
3 ..............................
4 ..............................
5 ....................f.........
6 ..............................
7 ..............................

*** Darwin 3x9 ***
Turn = 0.
  012345678
0 ..t.t....
1 ...f.h...
2 ......ttr

Turn = 125.
  012345678
0 ..t.t....
1 ...tt....
2 ......ttt

*** Darwin 27x5 ***
Turn = 0.
  01234
0 .....
1 ....h
2 .....
3 .....
4 .....
5 .....
6 .....
7 .....
8 .....
9 .....
0 .....
1 .....
2 .....
3 .....
4 .....
5 .....
6 ...hf
7 .....
8 .....
9 .....
0 .....
1 .....
2 ...h.
3 .....
4 t..fh
5 .....
6 .....

*** Darwin 36x15 ***
Turn = 0.
  012345678901234
0 ...............
1 ...............
2 ...............
3 ...............
4 ...............
5 ...............
6 ...............
7 f..............
8 ...............
9 ...............
0 ...............
1 ...............
2 ...............
3 ........h......
4 ...............
5 ...............
6 .......f.......
7 ...............
8 ...............
9 ...............
0 ...............
1 .....r.........
2 ...............
3 ...............
4 ...............
5 ...............
6 ...............
7 ...............
8 ...............
9 ...............
0 ..........f....
1 ...............
2 ...............
3 ...............
4 ...............
5 ...............

*** Darwin 29x22 ***
Turn = 0.
  0123456789012345678901
0 .......h..............
1 ......................
2 ......................
3 ......................
4 ......................
5 ......................
6 ......................
7 ...............t......
8 .....h................
9 ......................
0 ......................
1 ......................
2 ......................
3 ......................
4 ......................
5 ......................
6 ......................
7 ......................
8 ......................
9 ......................
0 ......................
1 .........h............
2 ....f.................
3 ......................
4 ......................
5 ......................
6 ......................
7 .h....................
8 ......................

Turn = 170.
  0123456789012345678901
0 h.....................
1 ......................
2 ......................
3 ......................
4 ......................
5 ......................
6 ......................
7 ...............t......
8 ...............t......
9 ......................
0 ......................
1 ......................
2 ......................
3 ......................
4 ......................
5 ......................
6 ......................
7 ......................
8 ......................
9 ......................
0 ......................
1 .....................h
2 ....f.................
3 ......................
4 ......................
5 ......................
6 ......................
7 h.....................
8 ......................

*** Darwin 18x8 ***
Turn = 0.
  01234567
0 ........
1 ........
2 ...r...t
3 ........
4 ........
5 ........
6 ........
7 ........
8 ........
9 ........
0 ........
1 ........
2 ........
3 ........
4 f.......
5 ........
6 ........
7 ........

*** Darwin 16x37 ***
Turn = 0.
  0123456789012345678901234567890123456
0 ..........ht.........................
1 .....................................
2 ........ff...........................
3 .....................................
4 .....................................
5 .....................................
6 .....................................
7 .....................................
8 .....................................
9 .....................................
0 .....................................
1 .............................f.......
2 ..............t................f.....
3 .....................................
4 .....................................
5 .....................................

Turn = 69.
  0123456789012345678901234567890123456
0 ...........t.........................
1 .....................................
2 ........ff...........................
3 .....................................
4 .....................................
5 .....................................
6 .....................................
7 .....................................
8 .....................................
9 .....................................
0 .....................................
1 .............................f.......
2 ..............t................f.....
3 .....................................
4 .....................................
5 ..........h..........................

Turn = 138.
  0123456789012345678901234567890123456
0 ...........t.........................
1 .....................................
2 ........ff...........................
3 .....................................
4 .....................................
5 .....................................
6 .....................................
7 .....................................
8 .....................................
9 .....................................
0 .....................................
1 .............................f.......
2 ..............t................f.....
3 .....................................
4 .....................................
5 ..........h..........................

*** Darwin 31x32 ***
Turn = 0.
  01234567890123456789012345678901
0 ................................
1 ................................
2 ................................
3 .....h..........................
4 ................................
5 ................................
6 ................................
7 ................................
8 ................................
9 ................................
0 ................................
1 ................................
2 ................................
3 ................................
4 ................................
5 ................................
6 ................................
7 ................................
8 ......h.........................
9 ................................
0 ................................
1 ................................
2 ................................
3 ................................
4 ................................
5 .........h......................
6 ................................
7 ................................
8 ....................f...........
9 ................................
0 ................................

Turn = 64.
  01234567890123456789012345678901
0 .....h..........................
1 ................................
2 ................................
3 ................................
4 ................................
5 ................................
6 ................................
7 ................................
8 ................................
9 ................................
0 ................................
1 ................................
2 ................................
3 ................................
4 ................................
5 ................................
6 ................................
7 ................................
8 ...............................h
9 ................................
0 ................................
1 ................................
2 ................................
3 ................................
4 ................................
5 ...............................h
6 ................................
7 ................................
8 ....................f...........
9 ................................
0 ................................

*** Darwin 17x34 ***
Turn = 0.
  0123456789012345678901234567890123
0 ..................................
1 ..................................
2 ..................................
3 ..................................
4 ..................................
5 ..................................
6 ..................................
7 ..................................
8 ..................................
9 ....r.............................
0 ..................................
1 ..................................
2 ..................................
3 ..................................
4 ..................................
5 ...........t..r...................
6 ..................................

Turn = 37.
  0123456789012345678901234567890123
0 .....................r............
1 ..................................
2 ..................................
3 ..................................
4 ..................................
5 ..................................
6 ..................................
7 ..................................
8 ..................................
9 ..................................
0 ..................................
1 ..................................
2 ..................................
3 ..................................
4 ..................................
5 ...........t......................
6 ...........t......................

*** Darwin 14x6 ***
Turn = 0.
  012345
0 ......
1 ......
2 ......
3 ......
4 .r....
5 ......
6 ......
7 ......
8 ......
9 ......
0 ......
1 ......
2 ......
3 ......

Turn = 66.
  012345
0 r.....
1 ......
2 ......
3 ......
4 ......
5 ......
6 ......
7 ......
8 ......
9 ......
0 ......
1 ......
2 ......
3 ......

Turn = 132.
  012345
0 ......
1 ......
2 ......
3 ......
4 ......
5 ......
6 ......
7 ......
8 r.....
9 ......
0 ......
1 ......
2 ......
3 ......

*** Darwin 26x34 ***
Turn = 0.
  0123456789012345678901234567890123
0 ..................................
1 ..................................
2 ..................................
3 ..................................
4 ..................................
5 ..................................
6 ..................................
7 ..................................
8 ..................................
9 ..................................
0 ..................................
1 ..................................
2 ..................r...f...........
3 ..............................r...
4 ..................................
5 ..................................
6 ..................................
7 ......................f...........
8 ..................................
9 ..................................
0 ..................................
1 ..................................
2 ..............f...................
3 ..................................
4 .........t........................
5 ..................................

*** Darwin 2x5 ***
Turn = 0.
  01234
0 f.r.f
1 fthfr

Turn = 16.
  01234
0 trtrr
1 ttt..
