<?xml version="1.0" encoding="UTF-8" standalone="no"?>
<svg
   xmlns:dc="http://purl.org/dc/elements/1.1/"
   xmlns:cc="http://creativecommons.org/ns#"
   xmlns:rdf="http://www.w3.org/1999/02/22-rdf-syntax-ns#"
   xmlns:svg="http://www.w3.org/2000/svg"
   xmlns="http://www.w3.org/2000/svg"
   xmlns:sodipodi="http://sodipodi.sourceforge.net/DTD/sodipodi-0.dtd"
   xmlns:inkscape="http://www.inkscape.org/namespaces/inkscape"
   version="1.1"
   inkscape:output_extension="org.inkscape.output.svg.inkscape"
   sodipodi:docname="interpolate-f10.svg"
   inkscape:version="1.0beta1 (08a003b, 2019-11-10)"
   sodipodi:version="0.32"
   viewBox="0 0 300 41"
   id="svg15699"
   height="41"
   width="300">
  <defs
     id="defs15701" />
  <sodipodi:namedview
     inkscape:lockguides="true"
     id="base"
     pagecolor="#ffffff"
     bordercolor="#666666"
     borderopacity="1.0"
     inkscape:pageopacity="0.0"
     inkscape:pageshadow="2"
     inkscape:zoom="1.4"
     inkscape:cx="160"
     inkscape:cy="20.5"
     inkscape:document-units="px"
     inkscape:current-layer="layer1"
     inkscape:document-rotation="0"
     showgrid="false"
     units="px"
     showguides="true"
     inkscape:guide-bbox="true"
     inkscape:window-width="1866"
     inkscape:window-height="1016"
     inkscape:window-x="54"
     inkscape:window-y="27"
     inkscape:window-maximized="1" />
  <metadata
     id="metadata15704">
    <rdf:RDF>
      <cc:Work
         rdf:about="">
        <dc:format>image/svg+xml</dc:format>
        <dc:type
           rdf:resource="http://purl.org/dc/dcmitype/StillImage" />
        <dc:title></dc:title>
      </cc:Work>
    </rdf:RDF>
  </metadata>
  <g
     id="layer1"
     inkscape:groupmode="layer"
     inkscape:label="Layer 1">
    <g
       transform="translate(-9.2781232,-16.358316)"
       id="g2607">
      <path
         inkscape:connector-curvature="0"
         style="fill:#00ccff;fill-opacity:1;stroke:#2e75ac;stroke-width:4.04816;stroke-linejoin:round;stroke-miterlimit:4;stroke-opacity:1"
         id="path4460"
         d="m 39.567707,18.382395 c 10.119089,0 18.265504,8.1464 18.265504,18.265501 0,10.1191 -8.146415,18.265499 -18.265504,18.265499 -10.11909,0 -18.265505,-8.146399 -18.265505,-18.265499 0,-10.119101 8.146415,-18.265501 18.265505,-18.265501 z"
         inkscape:export-xdpi="88.379997"
         inkscape:export-filename="C:\Documents and Settings\ryan\Desktop\interpolate1.png"
         inkscape:export-ydpi="88.379997" />
      <path
         inkscape:connector-curvature="0"
         style="fill:#00ccff;fill-opacity:1;stroke:#2e75ac;stroke-width:4.04816;stroke-linejoin:round;stroke-miterlimit:4;stroke-opacity:1"
         id="path4462"
         sodipodi:nodetypes="cccc"
         inkscape:export-xdpi="88.379997"
         d="m 282.98352,25.688595 -18.2655,29.2248 -18.26551,-29.2248 z"
         inkscape:export-filename="C:\Documents and Settings\ryan\Desktop\interpolate1.png"
         inkscape:export-ydpi="88.379997" />
      <g
         id="g4484"
         transform="matrix(0.5218716,0,0,0.5218716,10.864771,-181.23611)">
        <path
           inkscape:connector-curvature="0"
           style="fill:#00ccff;fill-opacity:1;stroke:#2e75ac;stroke-width:7.757;stroke-linejoin:round;stroke-miterlimit:4;stroke-opacity:1"
           id="path4486"
           d="m 121.63265,384.50504 c 16.62,0 25,21.38 25,38 0,16.62001 -18.38,22.00001 -35,22.00001 -16.619996,0 -27.499996,-13.38 -24.999996,-30.00001 2.5,-16.62 18.379996,-30 34.999996,-30 0,0 0,0 0,0" />
        <path
           inkscape:connector-curvature="0"
           style="fill:#00ccff;fill-opacity:1;stroke:#2e75ac;stroke-width:7.757;stroke-linejoin:round;stroke-miterlimit:4;stroke-opacity:1"
           id="path4488"
           d="m 188.26531,386.50504 c 13.85,0 15,27.15 15,41 0,13.85001 -21.15,9.00001 -35,9.00001 -13.85,0 -20,-11.15 -15,-25.00001 5,-13.85 21.15,-25 35,-25 0,0 0,0 0,0" />
        <path
           inkscape:connector-curvature="0"
           style="fill:#00ccff;fill-opacity:1;stroke:#2e75ac;stroke-width:7.757;stroke-linejoin:round;stroke-miterlimit:4;stroke-opacity:1"
           id="path4490"
           d="m 254.89796,388.50504 c 11.08,0 5,32.92 5,44 0,11.08001 -23.92,-3.99999 -35,-3.99999 -11.08,0 -12.5,-8.92 -5,-20.00001 7.5,-11.08 23.92,-20 35,-20 0,0 0,0 0,0" />
        <path
           inkscape:connector-curvature="0"
           style="fill:#00ccff;fill-opacity:1;stroke:#2e75ac;stroke-width:7.757;stroke-linejoin:round;stroke-miterlimit:4;stroke-opacity:1"
           id="path4492"
           d="m 321.53062,390.50504 c 8.31,0 -5,38.69001 -5,47.00001 0,8.31 -26.69,-17.00001 -35,-17.00001 -8.31,0 -5,-6.69 5,-15 10,-8.31 26.69,-15 35,-15 0,0 0,0 0,0" />
        <path
           inkscape:connector-curvature="0"
           style="fill:#00ccff;fill-opacity:1;stroke:#2e75ac;stroke-width:7.757;stroke-linejoin:round;stroke-miterlimit:4;stroke-opacity:1"
           id="path4494"
           d="m 388.16327,392.50504 c 5.54,0 -15,44.46001 -15,50.00001 0,5.54 -29.46,-30.00001 -35,-30.00001 -5.54,0 2.5,-4.46 15,-10 12.5,-5.54 29.46,-10 35,-10 0,0 0,0 0,0" />
        <path
           inkscape:connector-curvature="0"
           style="fill:#00ccff;fill-opacity:1;stroke:#2e75ac;stroke-width:7.757;stroke-linejoin:round;stroke-miterlimit:4;stroke-opacity:1"
           id="path4496"
           d="m 454.79593,394.50504 c 2.77,0 -25,50.23001 -25,53.00001 0,2.77 -32.23,-43.00001 -35,-43.00001 -2.77,0 10,-2.23 25,-5 15,-2.77 32.23,-5 35,-5 0,0 0,0 0,0" />
      </g>
    </g>
  </g>
</svg>
