<?xml version="1.0" encoding="UTF-8" standalone="no"?>
<svg
   xmlns:dc="http://purl.org/dc/elements/1.1/"
   xmlns:cc="http://creativecommons.org/ns#"
   xmlns:rdf="http://www.w3.org/1999/02/22-rdf-syntax-ns#"
   xmlns:svg="http://www.w3.org/2000/svg"
   xmlns="http://www.w3.org/2000/svg"
   xmlns:xlink="http://www.w3.org/1999/xlink"
   xmlns:sodipodi="http://sodipodi.sourceforge.net/DTD/sodipodi-0.dtd"
   xmlns:inkscape="http://www.inkscape.org/namespaces/inkscape"
   sodipodi:docname="elements-f07.svg"
   inkscape:version="1.0beta1 (a4ee55bc41, 2019-11-15)"
   sodipodi:version="0.32"
   id="svg2140"
   viewBox="0 0 300 100"
   height="100"
   width="300"
   version="1.1">
  <defs
     id="defs3">
    <pattern
       patternTransform="matrix(0.24537382,0,0,0.24537382,-7.1905355,1.1055782e-6)"
       id="pattern2172"
       xlink:href="#pattern2655"
       inkscape:collect="always" />
    <pattern
       patternTransform="matrix(0.1901284,0.13209553,-0.13209553,0.1901284,-7.1905355,1.1055782e-6)"
       id="pattern2169"
       xlink:href="#pattern2664"
       inkscape:collect="always" />
    <pattern
       patternTransform="matrix(0.03535563,-0.06173763,0.06173763,0.03535563,-7.1905355,1.1055782e-6)"
       id="pattern2166"
       xlink:href="#pattern2666"
       inkscape:collect="always" />
    <pattern
       id="pattern2650"
       patternTransform="matrix(0.25,0,0,0.25,0,0)"
       height="24"
       width="24"
       patternUnits="userSpaceOnUse">
      <path
         id="path2649"
         d="M -0.25,24.25 L 24.25,-0.25"
         style="fill:none;stroke:#000000;stroke-width:1.25;stroke-linecap:butt;stroke-opacity:1" />
    </pattern>
    <pattern
       patternTransform="matrix(0.234375,0.000000,0.000000,0.234375,0,0)"
       id="pattern2655"
       xlink:href="#pattern2650"
       inkscape:collect="always" />
    <pattern
       patternTransform="matrix(0.193713,0.134586,-0.134586,0.193713,0,0)"
       id="pattern2664"
       xlink:href="#pattern2655"
       inkscape:collect="always" />
    <pattern
       patternTransform="matrix(3.602221e-2,-6.290160e-2,6.290160e-2,3.602221e-2,0,0)"
       id="pattern2666"
       xlink:href="#pattern2664"
       inkscape:collect="always" />
  </defs>
  <sodipodi:namedview
     inkscape:window-maximized="1"
     inkscape:window-y="27"
     inkscape:window-x="54"
     inkscape:window-height="1016"
     inkscape:window-width="1866"
     inkscape:guide-bbox="true"
     showguides="true"
     units="px"
     showgrid="false"
     inkscape:document-rotation="0"
     inkscape:current-layer="layer1"
     inkscape:document-units="px"
     inkscape:cy="-2.7978518"
     inkscape:cx="202.98743"
     inkscape:zoom="1.4"
     inkscape:pageshadow="2"
     inkscape:pageopacity="0.0"
     borderopacity="1.0"
     bordercolor="#666666"
     pagecolor="#ffffff"
     id="base"
     inkscape:lockguides="true" />
  <metadata
     id="metadata4">
    <rdf:RDF>
      <cc:Work
         rdf:about="">
        <dc:format>image/svg+xml</dc:format>
        <dc:type
           rdf:resource="http://purl.org/dc/dcmitype/StillImage" />
        <dc:title />
      </cc:Work>
    </rdf:RDF>
  </metadata>
  <g
     id="layer1"
     inkscape:groupmode="layer"
     inkscape:label="Layer 1">
    <rect
       y="0.24460813"
       x="0.2445485"
       height="99.124901"
       width="299.51016"
       id="rect2067"
       style="fill:none;fill-rule:evenodd;stroke:#000000;stroke-width:0.489097" />
    <rect
       id="rect2652"
       y="0.82353699"
       x="0.076368988"
       height="53.236797"
       width="299.19101"
       style="fill:url(#pattern2172);stroke:none;stroke-width:0.981496" />
    <rect
       id="rect2663"
       y="22.907181"
       x="0.076368988"
       height="53.236797"
       width="299.19101"
       style="fill:url(#pattern2169);stroke:none;stroke-width:0.981496" />
    <rect
       id="rect2665"
       y="45.773315"
       x="0.076368988"
       height="53.236797"
       width="299.19101"
       style="fill:url(#pattern2166);stroke:none;stroke-width:0.981496" />
  </g>
</svg>
