<?xml version="1.0" encoding="UTF-8" standalone="no"?>
<svg
   xmlns:dc="http://purl.org/dc/elements/1.1/"
   xmlns:cc="http://creativecommons.org/ns#"
   xmlns:rdf="http://www.w3.org/1999/02/22-rdf-syntax-ns#"
   xmlns:svg="http://www.w3.org/2000/svg"
   xmlns="http://www.w3.org/2000/svg"
   xmlns:sodipodi="http://sodipodi.sourceforge.net/DTD/sodipodi-0.dtd"
   xmlns:inkscape="http://www.inkscape.org/namespaces/inkscape"
   sodipodi:docname="shapes-f04.svg"
   inkscape:version="1.0beta1 (08a003b, 2019-11-10)"
   sodipodi:version="0.32"
   id="svg3785"
   viewBox="0 0 300 157"
   height="157"
   width="300"
   version="1.1">
  <defs
     id="defs3" />
  <sodipodi:namedview
     inkscape:window-maximized="1"
     inkscape:window-y="27"
     inkscape:window-x="54"
     inkscape:window-height="1016"
     inkscape:window-width="1866"
     inkscape:guide-bbox="true"
     showguides="true"
     units="px"
     showgrid="false"
     inkscape:document-rotation="0"
     inkscape:current-layer="layer1"
     inkscape:document-units="px"
     inkscape:cy="77"
     inkscape:cx="160"
     inkscape:zoom="1.4"
     inkscape:pageshadow="2"
     inkscape:pageopacity="0.0"
     borderopacity="1.0"
     bordercolor="#666666"
     pagecolor="#ffffff"
     id="base"
     inkscape:lockguides="true" />
  <metadata
     id="metadata4">
    <rdf:RDF>
      <cc:Work
         rdf:about="">
        <dc:format>image/svg+xml</dc:format>
        <dc:type
           rdf:resource="http://purl.org/dc/dcmitype/StillImage" />
        <dc:title></dc:title>
      </cc:Work>
    </rdf:RDF>
  </metadata>
  <g
     id="layer1"
     inkscape:groupmode="layer"
     inkscape:label="Layer 1">
    <text
       id="text3168"
       y="145.20508"
       x="37.091438"
       style="font-style:normal;font-variant:normal;font-weight:normal;font-stretch:normal;line-height:0%;font-family:'Liberation Sans',Arial,sans-serif;writing-mode:lr-tb;text-anchor:start;fill:#000000;fill-opacity:1;stroke:none;stroke-width:1pt;stroke-linecap:butt;stroke-linejoin:miter;stroke-opacity:1"
       xml:space="preserve"><tspan
         y="145.20508"
         x="37.091438"
         id="tspan3169"
         sodipodi:role="line"
         style="font-size:6px;line-height:1.4">Scaling rounded rectangles </tspan><tspan
         y="153.54752"
         x="37.091438"
         id="tspan3171"
         sodipodi:role="line"
         style="font-size:6px;line-height:1.4">with &quot;Scale rounded corners&quot; ON</tspan></text>
    <rect
       rx="15.759731"
       ry="16.984438"
       y="0.4056105"
       x="69.242393"
       height="63.16048"
       width="196.67784"
       id="rect2217"
       style="color:#000000;font-size:12px;fill:#0000ff;fill-opacity:0.110368;fill-rule:evenodd;stroke:#000000;stroke-width:0.625;stroke-linecap:butt;stroke-linejoin:miter;stroke-miterlimit:4;stroke-dasharray:0.625, 1.25;stroke-dashoffset:0;stroke-opacity:1;marker:none;marker-start:none;marker-mid:none;marker-end:none" />
    <rect
       rx="15.759731"
       ry="32.930244"
       y="0.33053726"
       x="69.242393"
       height="122.45857"
       width="196.67784"
       id="rect2218"
       style="color:#000000;font-size:12px;fill:#0000ff;fill-opacity:0.110368;fill-rule:evenodd;stroke:#000000;stroke-width:0.625;stroke-linecap:butt;stroke-linejoin:miter;stroke-miterlimit:4;stroke-dasharray:0.625, 1.25;stroke-dashoffset:0;stroke-opacity:1;marker:none;marker-start:none;marker-mid:none;marker-end:none" />
    <rect
       rx="12.157472"
       ry="28.506227"
       y="0.35556167"
       x="114.2903"
       height="106.00687"
       width="151.72247"
       id="rect2216"
       style="color:#000000;font-size:12px;fill:#0000ff;fill-opacity:0.110368;fill-rule:evenodd;stroke:#000000;stroke-width:0.625;stroke-linecap:butt;stroke-linejoin:miter;stroke-miterlimit:4;stroke-dasharray:0.625, 1.25;stroke-dashoffset:0;stroke-opacity:1;marker:none;marker-start:none;marker-mid:none;marker-end:none" />
    <rect
       rx="6.6371598"
       ry="16.96977"
       y="0.31942886"
       x="183.44244"
       height="63.105938"
       width="82.830246"
       id="rect1589"
       style="font-size:12px;fill:#ff0004;fill-opacity:0.75;fill-rule:evenodd;stroke:#000000;stroke-width:0.625;stroke-miterlimit:4;stroke-dashoffset:0" />
    <rect
       rx="3.8556969"
       ry="40.030827"
       y="0.32016128"
       x="218.03819"
       height="148.86371"
       width="48.118217"
       id="rect2220"
       style="color:#000000;font-size:12px;fill:#0000ff;fill-opacity:0.110368;fill-rule:evenodd;stroke:#000000;stroke-width:0.625;stroke-linecap:butt;stroke-linejoin:miter;stroke-miterlimit:4;stroke-dasharray:0.625, 1.25;stroke-dashoffset:0;stroke-opacity:1;marker:none;marker-start:none;marker-mid:none;marker-end:none" />
    <rect
       rx="4.8443513"
       ry="14.801374"
       y="0.382173"
       x="205.74445"
       height="55.042263"
       width="60.456402"
       id="rect2221"
       style="color:#000000;font-size:12px;fill:#0000ff;fill-opacity:0.110368;fill-rule:evenodd;stroke:#000000;stroke-width:0.625;stroke-linecap:butt;stroke-linejoin:miter;stroke-miterlimit:4;stroke-dasharray:0.625, 1.25;stroke-dashoffset:0;stroke-opacity:1;marker:none;marker-start:none;marker-mid:none;marker-end:none" />
    <rect
       rx="3.0812931"
       ry="7.8653026"
       y="0.31295913"
       x="227.86066"
       height="29.248909"
       width="38.453835"
       id="rect2222"
       style="color:#000000;font-size:12px;fill:#0000ff;fill-opacity:0.110368;fill-rule:evenodd;stroke:#000000;stroke-width:0.625;stroke-linecap:butt;stroke-linejoin:miter;stroke-miterlimit:4;stroke-dasharray:0.625, 1.25;stroke-dashoffset:0;stroke-opacity:1;marker:none;marker-start:none;marker-mid:none;marker-end:none" />
    <rect
       rx="18.206608"
       ry="11.526689"
       y="0.31247085"
       x="38.1245"
       height="42.864601"
       width="227.21432"
       id="rect1912"
       style="color:#000000;font-size:12px;fill:#0000ff;fill-opacity:0.110368;fill-rule:evenodd;stroke:#000000;stroke-width:0.625;stroke-linecap:butt;stroke-linejoin:miter;stroke-miterlimit:4;stroke-dasharray:0.625, 1.25;stroke-dashoffset:0;stroke-opacity:1;marker:none;marker-start:none;marker-mid:none;marker-end:none" />
  </g>
</svg>
