<?xml version="1.0" encoding="UTF-8" standalone="no"?>
<svg
   xmlns:dc="http://purl.org/dc/elements/1.1/"
   xmlns:cc="http://creativecommons.org/ns#"
   xmlns:rdf="http://www.w3.org/1999/02/22-rdf-syntax-ns#"
   xmlns:svg="http://www.w3.org/2000/svg"
   xmlns="http://www.w3.org/2000/svg"
   xmlns:xlink="http://www.w3.org/1999/xlink"
   xmlns:sodipodi="http://sodipodi.sourceforge.net/DTD/sodipodi-0.dtd"
   xmlns:inkscape="http://www.inkscape.org/namespaces/inkscape"
   sodipodi:docname="calligraphy-f04.svg"
   inkscape:version="1.0beta1 (a4ee55bc41, 2019-11-15)"
   sodipodi:version="0.32"
   id="svg2397"
   viewBox="0 0 300 141"
   height="141"
   width="300"
   version="1.1">
  <defs
     id="defs3">
    <marker
       inkscape:stockid="TriangleOutS"
       orient="auto"
       refY="0"
       refX="0"
       id="TriangleOutS"
       style="overflow:visible">
      <path
         sodipodi:nodetypes="cccc"
         id="path1051"
         d="M 5.77,0 -2.88,5 V -5 Z"
         style="fill-rule:evenodd;stroke:#000000;stroke-width:1pt;marker-start:none"
         transform="scale(0.2)"
         inkscape:connector-curvature="0" />
    </marker>
    <marker
       inkscape:stockid="TriangleInS"
       orient="auto"
       refY="0"
       refX="0"
       id="TriangleInS"
       style="overflow:visible">
      <path
         sodipodi:nodetypes="cccc"
         id="path4777"
         d="M 5.77,0 -2.88,5 V -5 Z"
         style="fill-rule:evenodd;stroke:#000000;stroke-width:1pt;marker-start:none"
         transform="scale(-0.2)"
         inkscape:connector-curvature="0" />
    </marker>
  </defs>
  <sodipodi:namedview
     inkscape:window-maximized="0"
     inkscape:window-y="27"
     inkscape:window-x="54"
     inkscape:window-height="1053"
     inkscape:window-width="1866"
     inkscape:guide-bbox="true"
     showguides="true"
     units="px"
     showgrid="false"
     inkscape:document-rotation="0"
     inkscape:current-layer="layer1"
     inkscape:document-units="px"
     inkscape:cy="70.5"
     inkscape:cx="160"
     inkscape:zoom="1.4"
     inkscape:pageshadow="2"
     inkscape:pageopacity="0.0"
     borderopacity="1.0"
     bordercolor="#666666"
     pagecolor="#ffffff"
     id="base"
     inkscape:lockguides="true" />
  <metadata
     id="metadata4">
    <rdf:RDF>
      <cc:Work
         rdf:about="">
        <dc:format>image/svg+xml</dc:format>
        <dc:type
           rdf:resource="http://purl.org/dc/dcmitype/StillImage" />
        <dc:title />
      </cc:Work>
    </rdf:RDF>
  </metadata>
  <g
     id="layer1"
     inkscape:groupmode="layer"
     inkscape:label="Layer 1">
    <path

       id="path2832"
       d="m 111.32804,102.806 h 92.82339"
       style="display:block;fill:none;fill-opacity:0.75;fill-rule:evenodd;stroke:#000000;stroke-width:0.650136;stroke-linecap:butt;stroke-linejoin:miter;stroke-miterlimit:4;stroke-dasharray:0.650136, 1.95041;stroke-dashoffset:0;stroke-opacity:1"
       inkscape:connector-curvature="0" />
    <path

       id="path2834"
       d="M 111.36439,103.0791 199.52798,52.1779"
       style="display:block;fill:none;fill-opacity:0.75;fill-rule:evenodd;stroke:#000000;stroke-width:0.6875;stroke-linecap:butt;stroke-linejoin:miter;stroke-miterlimit:4;stroke-dasharray:0.6875, 2.0625;stroke-dashoffset:0;stroke-opacity:1"
       inkscape:connector-curvature="0" />
    <path

       sodipodi:nodetypes="cc"
       id="path2838"
       d="M 111.46966,130.3339 V 11.5504"
       style="color:#000000;display:block;visibility:visible;fill:none;fill-opacity:0.75;fill-rule:evenodd;stroke:#000000;stroke-width:0.6875;stroke-linecap:butt;stroke-linejoin:miter;stroke-miterlimit:4;stroke-dasharray:0.6875, 2.0625;stroke-dashoffset:0;stroke-opacity:1;marker:none;marker-start:none;marker-mid:none;marker-end:none"
       inkscape:connector-curvature="0" />
    <text
       id="text4096"
       y="6"
       x="88.336723"
       style="font-style:normal;font-weight:normal;line-height:0%;font-family:'Liberation Sans',Arial,sans-serif;display:block;fill:#000000;fill-opacity:1;stroke:none;stroke-width:1pt;stroke-linecap:butt;stroke-linejoin:miter;stroke-opacity:1"
       xml:space="preserve"><tspan
         y="6"
         x="88.336723"
         id="tspan4097"
         sodipodi:role="line"
         style="font-size:6px;line-height:1.1">angle = 90 deg</tspan></text>
    <text
       id="text4099"
       y="52.500549"
       x="202.46759"
       style="font-style:normal;font-weight:normal;line-height:0%;font-family:'Liberation Sans',Arial,sans-serif;display:block;fill:#000000;fill-opacity:1;stroke:none;stroke-width:1pt;stroke-linecap:butt;stroke-linejoin:miter;stroke-opacity:1"
       xml:space="preserve"><tspan
         y="52.500549"
         x="202.46759"
         id="tspan4100"
         sodipodi:role="line"
         style="font-size:6px;line-height:1.1">angle = 30 (default)</tspan></text>
    <text
       id="text4102"
       y="104.26855"
       x="215"
       style="font-style:normal;font-weight:normal;line-height:0%;font-family:'Liberation Sans',Arial,sans-serif;display:block;fill:#000000;fill-opacity:1;stroke:none;stroke-width:1pt;stroke-linecap:butt;stroke-linejoin:miter;stroke-opacity:1"
       xml:space="preserve"><tspan
         y="104.26855"
         x="215"
         id="tspan4103"
         sodipodi:role="line"
         style="font-size:6px;line-height:1.1">angle = 0</tspan></text>
    <text
       id="text4105"
       y="139.26855"
       x="87.677307"
       style="font-style:normal;font-weight:normal;line-height:0%;font-family:'Liberation Sans',Arial,sans-serif;display:block;fill:#000000;fill-opacity:1;stroke:none;stroke-width:1pt;stroke-linecap:butt;stroke-linejoin:miter;stroke-opacity:1"
       xml:space="preserve"><tspan
         y="139.26855"
         x="87.677307"
         id="tspan4106"
         sodipodi:role="line"
         style="font-size:6px;line-height:1.1">angle = −90 deg</tspan></text>
    <path
       style="color:#000000;display:block;visibility:visible;fill:none;stroke:#000000;stroke-width:1.6875;stroke-linecap:butt;stroke-linejoin:miter;stroke-miterlimit:4;stroke-dashoffset:0;stroke-opacity:1;marker:none;marker-start:url(#TriangleInS);marker-end:url(#TriangleOutS)"
       d="m 162.43828,86.7924 c 2.04124,4.3309 3.20951,9.0215 3.43812,13.8039"
       id="path4108"
       inkscape:connector-curvature="0" />
    <g
       style="display:block"
       transform="matrix(0.362447,-0.209258,0.209258,0.362447,-189.84249,-450.15)"
       id="g2827">
      <use
         height="2515"
         width="320"
         transform="matrix(-1,1.554114e-6,1.554114e-6,1,279.9908,-2.175686e-4)"
         id="use2837"
         xlink:href="#path2835"
         y="0"
         x="0" />
      <path
         sodipodi:nodetypes="ccccc"
         id="path2835"
         d="m 140.94842,1527.7299 h -14.51886 c 0,0 0.019,51.8997 -15.33832,51.8997 8.74098,47.2559 10.02196,36.9421 10.84143,46.7757 8.77326,5.3489 16.35419,6.3692 19.73225,5.9823"
         style="fill:#ffffff;fill-opacity:1;fill-rule:evenodd;stroke:none;stroke-width:3.325;stroke-linecap:butt;stroke-linejoin:round;stroke-miterlimit:4;stroke-opacity:1"
         inkscape:connector-curvature="0" />
      <path
         sodipodi:nodetypes="ccccc"
         id="path2836"
         d="m 140.94842,1527.2684 h -14.51886 c 0,0 0.019,51.8997 -15.33832,51.8997 8.74098,47.2559 10.02196,36.9421 10.84143,46.7757 10.61473,-5.0767 18.56396,-6.1416 19.38343,3.692"
         style="fill:#ffffff;fill-opacity:1;fill-rule:evenodd;stroke:none;stroke-width:3.325;stroke-linecap:butt;stroke-linejoin:round;stroke-miterlimit:4;stroke-opacity:1"
         inkscape:connector-curvature="0" />
      <path
         sodipodi:nodetypes="cccc"
         id="path2202"
         d="m 140.94842,1527.2684 h -14.51886 c 0,0 0.019,51.8997 -15.33832,51.8997 8.74098,47.2559 9.56045,38.7881 10.37992,48.6217"
         style="fill:none;fill-opacity:0.75;fill-rule:evenodd;stroke:#000000;stroke-width:3.325;stroke-linecap:butt;stroke-linejoin:round;stroke-miterlimit:4;stroke-opacity:1"
         inkscape:connector-curvature="0" />
      <use
         height="2515"
         width="320"
         transform="matrix(-1,0,0,1,279.5397,0)"
         id="use2203"
         xlink:href="#path2202"
         y="0"
         x="0" />
      <path
         id="path2204"
         d="m 140.12896,1527.5699 v 52.9355"
         style="fill:none;fill-opacity:0.75;fill-rule:evenodd;stroke:#000000;stroke-width:3.325;stroke-linecap:butt;stroke-linejoin:miter;stroke-miterlimit:4;stroke-opacity:1"
         inkscape:connector-curvature="0" />
      <path
         transform="matrix(1.065958,0.05034507,-0.03429285,0.726085,40.01797,415.8423)"
         style="color:#000000;display:block;visibility:visible;fill:#000000;fill-opacity:1;fill-rule:nonzero;stroke:none;stroke-width:3pt;marker:none"
         d="m 155.15253,1610.5809 c 0,10.4094 -4.21921,18.8478 -9.42388,18.8478 -5.20466,0 -9.42387,-8.4384 -9.42387,-18.8478 0,-10.4093 4.21921,-18.8477 9.42387,-18.8477 5.20467,0 9.42388,8.4384 9.42388,18.8477 z"
         id="path2205"
         inkscape:connector-curvature="0" />
    </g>
    <path
       d="M 174.47742,76.7197 C 169.169,68.9526 159.73169,64.9089 150.72838,63.5889 131.80596,61.9378 115.84285,76.2813 96.950376,74.7031 c -4.4139,-0.8521 -6.38537,-3.8204 -5.414006,-8.2285 3.432205,-15.5741 26.47028,-25.0381 39.21514,-29.8036 9.86413,-3.4255 20.19203,-4.9113 30.53774,-5.9031 l -10.88276,6.2839 c -10.34571,0.9918 -20.6736,2.4766 -30.53773,5.9021 -1.86587,0.6978 -3.75804,1.3289 -5.59764,2.0934 -1.70311,0.707 -6.33919,3.6107 -5.02324,2.3188 1.79024,-1.7581 4.18316,-2.8393 6.50965,-3.7786 0.30055,-0.1213 -3.12612,1.7341 -6.72596,5.3896 -3.47777,3.5325 -8.57153,10.426 -6.52659,15.8271 0.88473,2.3363 3.10748,3.1082 5.32811,3.6151 18.89252,1.5792 34.85562,-12.7644 53.77805,-11.1133 9.00331,1.32 18.44062,5.3628 23.74904,13.1298 z"
       id="path2853"
       style="display:block;fill:#d2d2d2;fill-opacity:1;fill-rule:nonzero;stroke:none;stroke-width:1pt;stroke-linecap:butt;stroke-linejoin:miter;stroke-opacity:1"
       inkscape:connector-curvature="0" />
  </g>
</svg>
