<?xml version="1.0" encoding="UTF-8" standalone="no"?>
<svg
   xmlns:dc="http://purl.org/dc/elements/1.1/"
   xmlns:cc="http://creativecommons.org/ns#"
   xmlns:rdf="http://www.w3.org/1999/02/22-rdf-syntax-ns#"
   xmlns:svg="http://www.w3.org/2000/svg"
   xmlns="http://www.w3.org/2000/svg"
   width="1200"
   height="1200"
   viewBox="0 0 317.5 317.5"
   version="1.1"
   id="svg8">
  <defs
     id="defs2">
    <clipPath
       id="clipPath1856"
       clipPathUnits="userSpaceOnUse">
      <path
         id="path1858"
         d="m 441.22256,-242.06429 a 59.841432,59.841432 0 0 1 -59.84144,59.84143 59.841432,59.841432 0 0 1 -59.84142,-59.84143 59.841432,59.841432 0 0 1 59.84142,-59.84142 59.841432,59.841432 0 0 1 59.84144,59.84142 z"
         style="display:inline;opacity:1;fill:#ffffff;fill-opacity:1;stroke:none;stroke-width:5.29167;stroke-linejoin:round;stroke-miterlimit:4;stroke-dasharray:none;stroke-opacity:1;paint-order:markers fill stroke;stop-opacity:1" />
    </clipPath>
    <clipPath
       id="clipPath1019-6"
       clipPathUnits="userSpaceOnUse">
      <path
         id="path1021-3"
         d="M 174.4497,136.91569 A 38.940486,38.940486 0 0 1 135.5092,175.85618 38.940486,38.940486 0 0 1 96.568716,136.91569 38.940486,38.940486 0 0 1 135.5092,97.975203 38.940486,38.940486 0 0 1 174.4497,136.91569 Z"
         style="fill:#ffffff;fill-opacity:1;stroke:#37474f;stroke-width:1.59259;stroke-linejoin:round;stroke-miterlimit:4;stroke-dasharray:none;stroke-opacity:1;paint-order:markers fill stroke" />
    </clipPath>
    <clipPath
       id="clipPath1210-1-2"
       clipPathUnits="userSpaceOnUse">
      <path
         style="display:inline;opacity:1;fill:#ffffff;fill-opacity:1;stroke:none;stroke-width:3.25393;stroke-linejoin:round;stroke-miterlimit:4;stroke-dasharray:none;stroke-opacity:1;paint-order:markers fill stroke"
         d="m 155.1985,200.45364 a 36.79745,36.79745 0 0 1 -36.79746,36.79745 36.79745,36.79745 0 0 1 -36.79745,-36.79745 36.79745,36.79745 0 0 1 36.79745,-36.79744 36.79745,36.79745 0 0 1 36.79746,36.79744 z"
         id="path1212-2-0" />
    </clipPath>
    <clipPath
       clipPathUnits="userSpaceOnUse"
       id="clipPath1164">
      <path
         id="path1166"
         d="m 402.18504,211.74044 a 30.405641,30.405641 0 0 1 -30.40565,30.40564 30.405641,30.405641 0 0 1 -30.40562,-30.40564 30.405641,30.405641 0 0 1 30.40562,-30.40564 30.405641,30.405641 0 0 1 30.40565,30.40564 z"
         style="display:inline;opacity:1;fill:#ffffff;fill-opacity:1;stroke:none;stroke-width:2.68872;stroke-linejoin:round;stroke-miterlimit:4;stroke-dasharray:none;stroke-opacity:1;paint-order:markers fill stroke;stop-opacity:1" />
    </clipPath>
  </defs>
  <metadata
     id="metadata5">
    <rdf:RDF>
      <cc:Work
         rdf:about="">
        <dc:format>image/svg+xml</dc:format>
        <dc:type
           rdf:resource="http://purl.org/dc/dcmitype/StillImage" />
        <dc:title></dc:title>
      </cc:Work>
    </rdf:RDF>
  </metadata>
  <g
     transform="matrix(4.8333333,0,0,4.8333333,-1638.1838,-272.103)"
     id="g1185">
    <path
       id="path1973"
       d="M 402.18504,89.142002 A 30.405641,30.405641 0 0 1 371.7794,119.54764 30.405641,30.405641 0 0 1 341.37376,89.142002 30.405641,30.405641 0 0 1 371.7794,58.736362 30.405641,30.405641 0 0 1 402.18504,89.142002 Z"
       style="display:inline;opacity:1;fill:#ffffff;fill-opacity:1;stroke:none;stroke-width:2.68872;stroke-linejoin:round;stroke-miterlimit:4;stroke-dasharray:none;stroke-opacity:1;paint-order:markers fill stroke;stop-opacity:1" />
    <g
       clip-path="url(#clipPath1164)"
       transform="translate(0,-122.59844)"
       id="g1160">
      <path
         style="opacity:1;fill:#4494d5;fill-opacity:1;stroke:none;stroke-width:2.71357;stroke-linecap:round;stroke-linejoin:round;stroke-miterlimit:4;stroke-dasharray:none;stroke-opacity:1;paint-order:markers fill stroke;stop-opacity:1"
         d="m 364.11366,215.61975 h 15.38003 c 2.27659,12.73775 0,34.26668 0,46.94553 h -15.38003 c 0,-12.38884 -2.37962,-34.37532 0,-46.94553 z"
         id="path1132" />
      <rect
         y="202.69305"
         x="366.63129"
         height="12.926697"
         width="10.296229"
         id="rect1134"
         style="opacity:1;fill:#4494d5;fill-opacity:1;stroke:none;stroke-width:2.71357;stroke-linecap:round;stroke-linejoin:round;stroke-miterlimit:4;stroke-dasharray:none;stroke-opacity:1;paint-order:markers fill stroke;stop-opacity:1" />
      <path
         style="opacity:1;fill:#1c63bc;fill-opacity:1;stroke:none;stroke-width:0.264583px;stroke-linecap:butt;stroke-linejoin:miter;stroke-opacity:1;stop-opacity:1"
         d="m 371.10008,215.61962 c 8.06071,6.5839 3.35277,31.29696 5.02914,46.94545 h 3.36466 c 0,-12.67886 2.2766,-34.20772 0,-46.94545 z"
         id="path1136" />
      <path
         style="opacity:1;fill:#c3e7fc;fill-opacity:1;stroke:none;stroke-width:0.264583px;stroke-linecap:butt;stroke-linejoin:miter;stroke-opacity:1;stop-opacity:1"
         d="m 363.15019,236.762 c 0.25625,9.39911 0.96325,19.03323 0.96325,25.80307 h 3.36465 z"
         id="path1138" />
      <path
         id="path1140"
         d="m 364.11366,215.61975 h 15.38003 c 2.27659,12.73775 0,34.26668 0,46.94553 h -15.38003 c 0,-12.38884 -2.37962,-34.37532 0,-46.94553 z"
         style="opacity:1;fill:none;fill-opacity:1;stroke:#37474f;stroke-width:2.71357;stroke-linecap:round;stroke-linejoin:round;stroke-miterlimit:4;stroke-dasharray:none;stroke-opacity:1;paint-order:markers fill stroke;stop-opacity:1" />
      <path
         style="opacity:1;fill:none;fill-opacity:1;stroke:#37474f;stroke-width:2.11667;stroke-linecap:round;stroke-linejoin:round;stroke-miterlimit:4;stroke-dasharray:none;stroke-opacity:1;paint-order:markers fill stroke;stop-opacity:1"
         d="m 369.97438,196.28287 h 3.40616 v 6.41018 h -3.40616 z"
         id="path1142" />
      <path
         style="opacity:1;fill:#c3e7fc;fill-opacity:1;stroke:none;stroke-width:0.264583px;stroke-linecap:butt;stroke-linejoin:miter;stroke-opacity:1;stop-opacity:1"
         d="m 373.10581,204.04864 -5.10726,5.17657 5.65208,2.52527 z"
         id="path1144" />
      <path
         style="opacity:1;fill:#c3e7fc;fill-opacity:1;stroke:none;stroke-width:0.264583px;stroke-linecap:butt;stroke-linejoin:miter;stroke-opacity:1;stop-opacity:1"
         d="m 366.63126,206.9142 4.76759,-4.27075 h -4.76761 z"
         id="path1146" />
      <path
         style="opacity:1;fill:#1c63bc;fill-opacity:1;stroke:none;stroke-width:0.264583px;stroke-linecap:butt;stroke-linejoin:miter;stroke-opacity:1;stop-opacity:1"
         d="m 373.10581,204.04864 -6.4907,2.08855 1.38359,3.08802 z"
         id="path1148" />
      <path
         style="opacity:1;fill:#1c63bc;fill-opacity:1;stroke:none;stroke-width:0.264583px;stroke-linecap:butt;stroke-linejoin:miter;stroke-opacity:1;stop-opacity:1"
         d="m 372.51592,202.69304 4.41158,10.2044 v -10.2044 z"
         id="path1150" />
      <path
         style="opacity:1;fill:#c3e7fc;fill-opacity:1;stroke:none;stroke-width:0.264583px;stroke-linecap:butt;stroke-linejoin:miter;stroke-opacity:1;stop-opacity:1"
         d="m 376.9275,208.55046 -7.23612,7.06927 7.23612,-1e-4 z"
         id="path1152" />
      <path
         style="opacity:1;fill:#1c63bc;fill-opacity:1;stroke:none;stroke-width:0.264583px;stroke-linecap:butt;stroke-linejoin:miter;stroke-opacity:1;stop-opacity:1"
         d="m 371.86464,215.61963 -5.23338,-8.65587 v 8.65597 z"
         id="path1154" />
      <rect
         style="opacity:1;fill:none;fill-opacity:1;stroke:#37474f;stroke-width:2.71357;stroke-linecap:round;stroke-linejoin:round;stroke-miterlimit:4;stroke-dasharray:none;stroke-opacity:1;paint-order:markers fill stroke;stop-opacity:1"
         id="rect1156"
         width="10.296229"
         height="12.926697"
         x="366.63129"
         y="202.69305" />
      <path
         style="opacity:1;fill:#37474f;fill-opacity:1;stroke:#37474f;stroke-width:2.11667;stroke-linecap:round;stroke-linejoin:round;stroke-miterlimit:4;stroke-dasharray:none;stroke-opacity:1;paint-order:markers fill stroke;stop-opacity:1"
         d="m 371.67746,193.38586 1.70308,2.89701 h -3.40616 z"
         id="path1158" />
    </g>
    <path
       style="display:inline;opacity:1;fill:none;fill-opacity:1;stroke:#37474f;stroke-width:2.68872;stroke-linejoin:round;stroke-miterlimit:4;stroke-dasharray:none;stroke-opacity:1;paint-order:markers fill stroke;stop-opacity:1"
       d="M 402.18504,89.142002 A 30.405641,30.405641 0 0 1 371.7794,119.54764 30.405641,30.405641 0 0 1 341.37376,89.142002 30.405641,30.405641 0 0 1 371.7794,58.736362 30.405641,30.405641 0 0 1 402.18504,89.142002 Z"
       id="path1999" />
  </g>
</svg>
