<?xml version="1.0" encoding="UTF-8" standalone="no"?>
<svg
   xmlns:dc="http://purl.org/dc/elements/1.1/"
   xmlns:cc="http://creativecommons.org/ns#"
   xmlns:rdf="http://www.w3.org/1999/02/22-rdf-syntax-ns#"
   xmlns:svg="http://www.w3.org/2000/svg"
   xmlns="http://www.w3.org/2000/svg"
   xmlns:sodipodi="http://sodipodi.sourceforge.net/DTD/sodipodi-0.dtd"
   xmlns:inkscape="http://www.inkscape.org/namespaces/inkscape"
   inkscape:export-ydpi="299.91489"
   inkscape:export-xdpi="299.91489"
   inkscape:export-filename="/home/jtx/Development/inkscape/content/presentations/LGM19-Get_the_Most_Out_of_Live_Path_Effects/videos/defaults.source/LPESDefaults.png"
   inkscape:version="1.0alpha (40b9fe84ba, 2019-05-24, custom)"
   sodipodi:docname="LPESDefaults.svg"
   viewBox="0 0 282 133"
   height="133"
   width="282"
   id="svg928"
   version="1.1">
  <style
     id="style1501"></style>
  <metadata
     id="metadata934">
    <rdf:RDF>
      <cc:Work
         rdf:about="">
        <dc:format>image/svg+xml</dc:format>
        <dc:type
           rdf:resource="http://purl.org/dc/dcmitype/StillImage" />
        <dc:title />
      </cc:Work>
    </rdf:RDF>
  </metadata>
  <defs
     id="defs932"><marker
   inkscape:isstock="true"
   style="overflow:visible;"
   id="Arrow1Mend"
   refX="0.0"
   refY="0.0"
   orient="auto"
   inkscape:stockid="Arrow1Mend">
  <path
     transform="scale(0.4) rotate(180) translate(10,0)"
     style="fill-rule:evenodd;stroke:#000000;stroke-width:1pt;stroke-opacity:1;fill:#000000;fill-opacity:1"
     d="M 0.0,0.0 L 5.0,-5.0 L -12.5,0.0 L 5.0,5.0 L 0.0,0.0 z "
     id="path3244" />
</marker>
<marker
   inkscape:isstock="true"
   style="overflow:visible"
   id="Arrow1Mstart"
   refX="0.0"
   refY="0.0"
   orient="auto"
   inkscape:stockid="Arrow1Mstart">
  <path
     transform="scale(0.4) translate(10,0)"
     style="fill-rule:evenodd;stroke:#000000;stroke-width:1pt;stroke-opacity:1;fill:#000000;fill-opacity:1"
     d="M 0.0,0.0 L 5.0,-5.0 L -12.5,0.0 L 5.0,5.0 L 0.0,0.0 z "
     id="path3241" />
</marker>
<inkscape:path-effect
   effect="mirror_symmetry"
   start_point="66.927502,33.239716"
   end_point="66.927502,95.64909"
   center_point="66.582465,64.444403"
   id="path-effect3654"
   is_visible="true"
   mode="free"
   split_gap="-0.001"
   discard_orig_path="false"
   fuse_paths="true"
   oposite_fuse="true"
   split_items="false" />
<inkscape:path-effect
   split_items="true"
   oposite_fuse="false"
   fuse_paths="false"
   discard_orig_path="false"
   split_gap="-0.001"
   mode="free"
   is_visible="true"
   id="path-effect2887"
   center_point="37.016641,58.485203"
   end_point="37.419814,88.855478"
   start_point="37.419814,28.114928"
   effect="mirror_symmetry" />
<inkscape:path-effect
   id="path-effect3531" />



space between copies, use small negative gaps to fix some joins=&quot;0.05&quot;
       split_items=&quot;true&quot;
       mirror_copies=&quot;false&quot;
       copies_to_360=&quot;true&quot;
       gap=&quot;-0.0001&quot;
       rotation_angle=&quot;90&quot;
       starting_angle=&quot;0&quot;
       num_copies=&quot;4&quot;
       method=&quot;normal&quot;
       is_visible=&quot;true&quot;
       id=&quot;path-effect1629&quot;
       origin=&quot;10.366756,52.14809&quot;
       starting_point=&quot;68.08663,52.14809&quot;
       effect=&quot;copy_rotate&quot; /&gt;
  </defs>
  <sodipodi:namedview
     inkscape:current-layer="g936"
     inkscape:window-maximized="1"
     inkscape:window-y="27"
     inkscape:window-x="0"
     inkscape:cy="85.248925"
     inkscape:cx="137.47583"
     inkscape:zoom="2.6817352"
     showgrid="false"
     id="namedview930"
     inkscape:window-height="1016"
     inkscape:window-width="1920"
     inkscape:pageshadow="2"
     inkscape:pageopacity="0"
     guidetolerance="10"
     gridtolerance="10"
     objecttolerance="10"
     borderopacity="1"
     inkscape:document-rotation="0"
     bordercolor="#666666"
     pagecolor="#ffffff" />
  <g
     id="g936"
     inkscape:label="Image"
     inkscape:groupmode="layer">
    <text
       xml:space="preserve"
       style="font-style:normal;font-variant:normal;font-weight:normal;font-stretch:normal;font-size:36.8077px;line-height:0.9;font-family:Troika;-inkscape-font-specification:Troika;letter-spacing:0px;word-spacing:0px;fill:#ff4bb1;fill-opacity:1;stroke:#000000;stroke-width:5.58465;stroke-miterlimit:4;stroke-dasharray:none;paint-order:stroke fill markers"
       x="12.638687"
       y="61.667191"
       id="text1464"><tspan
         style="stroke-width:5.58465"
         sodipodi:role="line"
         id="tspan1458"
         x="12.638687"
         y="61.667191">Change </tspan><tspan
         style="stroke-width:5.58465"
         sodipodi:role="line"
         x="12.638687"
         y="94.794121"
         id="tspan1462">defaults ON <tspan
   style="fill:#ffcc00;fill-opacity:1;stroke-width:5.58465"
   id="tspan1460">LPE</tspan></tspan></text>
  </g>
</svg>
