19:40:10.261: CPU Name: Intel(R) Core(TM) i7-7800X CPU @ 3.50GHz
19:40:10.261: CPU Speed: 3500.000MHz
19:40:10.262: Physical Cores: 6, Logical Cores: 12
19:40:10.262: Physical Memory: 47864MB Total, 13819MB Free
19:40:10.262: Kernel Version: Linux 5.15.32-1-MANJARO
19:40:10.262: Distribution: "Manjaro Linux" Unknown
19:40:10.262: Session Type: x11
19:40:10.262: Window System: X11.0, Vendor: The X.Org Foundation, Version: 1.21.1
19:40:10.264: Qt Version: 5.15.3 (runtime), 5.15.3 (compiled)
19:40:10.264: Portable mode: false
19:40:10.360: OBS 27.2.3-1 (linux)
19:40:10.360: ---------------------------------
19:40:10.360: ---------------------------------
19:40:10.360: audio settings reset:
19:40:10.360: 	samples per sec: 48000
19:40:10.360: 	speakers:        2
19:40:10.366: ---------------------------------
19:40:10.366: Initializing OpenGL...
19:40:10.491: Loading up OpenGL on adapter NVIDIA Corporation NVIDIA GeForce RTX 3070/PCIe/SSE2
19:40:10.491: OpenGL loaded successfully, version 3.3.0 NVIDIA 510.60.02, shading language 3.30 NVIDIA via Cg compiler
19:40:10.553: ---------------------------------
19:40:10.553: video settings reset:
19:40:10.553: 	base resolution:   2560x1440
19:40:10.553: 	output resolution: 1920x1080
19:40:10.553: 	downscale filter:  Bicubic
19:40:10.553: 	fps:               60/1
19:40:10.553: 	format:            NV12
19:40:10.553: 	YUV mode:          709/Partial
19:40:10.553: NV12 texture support not available
19:40:10.614: Audio monitoring device:
19:40:10.614: 	name: Default
19:40:10.614: 	id: default
19:40:10.614: ---------------------------------
19:40:10.618: Failed to load 'en-US' text for module: 'decklink-captions.so'
19:40:10.621: Failed to load 'en-US' text for module: 'decklink-ouput-ui.so'
19:40:10.700: A DeckLink iterator could not be created.  The DeckLink drivers may not be installed
19:40:10.700: No blackmagic support
19:40:10.720: v4l2loopback not installed, virtual camera disabled
19:40:10.730: NVENC supported
19:40:10.730: FFMPEG VAAPI supported
19:40:10.753: os_dlopen(/usr//lib/obs-plugins/sndio.so->/usr//lib/obs-plugins/sndio.so): libsndio.so.7: cannot open shared object file: No such file or directory
19:40:10.753: 
19:40:10.753: Module '/usr//lib/obs-plugins/sndio.so' not loaded
19:40:10.755: ---------------------------------
19:40:10.755:   Loaded Modules:
19:40:10.755:     text-freetype2.so
19:40:10.755:     rtmp-services.so
19:40:10.755:     obs-x264.so
19:40:10.755:     obs-transitions.so
19:40:10.755:     obs-outputs.so
19:40:10.755:     obs-libfdk.so
19:40:10.755:     obs-filters.so
19:40:10.755:     obs-ffmpeg.so
19:40:10.755:     linux-v4l2.so
19:40:10.755:     linux-pulseaudio.so
19:40:10.755:     linux-jack.so
19:40:10.755:     linux-decklink.so
19:40:10.755:     linux-capture.so
19:40:10.755:     linux-alsa.so
19:40:10.755:     image-source.so
19:40:10.755:     frontend-tools.so
19:40:10.755:     decklink-ouput-ui.so
19:40:10.755:     decklink-captions.so
19:40:10.755: ---------------------------------
19:40:10.756: ==== Startup complete ===============================================
19:40:10.804: All scene data cleared
19:40:10.804: ------------------------------------------------
19:40:10.808: pulse-input: Server name: 'pulseaudio 15.0'
19:40:10.808: pulse-input: Audio format: s16le, 44100 Hz, 2 channels
19:40:10.808: pulse-input: Started recording from 'alsa_output.pci-0000_00_1f.3.analog-stereo.monitor'
19:40:10.808: [Loaded global audio device]: 'Desktop Audio'
19:40:11.045: pulse-input: Server name: 'pulseaudio 15.0'
19:40:11.045: pulse-input: Audio format: s16le, 44100 Hz, 2 channels
19:40:11.045: pulse-input: Started recording from 'alsa_input.usb-Samson_Technologies_Samson_Q2U_Microphone-00.analog-stereo'
19:40:11.046: [Loaded global audio device]: 'Mic/Aux'
19:40:11.046: v4l2-input: Start capture from /dev/video1
19:40:11.046: v4l2-input: Unable to open device
19:40:11.046: v4l2-input: Initialization failed
19:40:11.047: xshm-input: Geometry 2560x1440 @ 0,0
19:40:11.055: alsa-input: Failed to open 'front:CARD=Microphone,DEV=0': Device or resource busy
19:40:11.056: Switched to scene 'Scene'
19:40:11.056: ------------------------------------------------
19:40:11.056: Loaded scenes:
19:40:11.056: - scene 'Scene':
19:40:11.076:     - source: 'Audio Capture Device (ALSA)' (alsa_input_capture)
19:40:11.077:     - source: 'Screen Capture (XSHM)' (xshm_input)
19:40:11.077:     - source: 'Video Capture Device (V4L2)' (v4l2_input)
19:40:11.077: ------------------------------------------------
19:40:11.464: [rtmp-services plugin] Successfully updated file 'services.json' (version 195)
19:40:11.464: [rtmp-services plugin] Successfully updated package (version 195)
19:40:11.604: adding 64 milliseconds of audio buffering, total audio buffering is now 64 milliseconds (source: Mic/Aux)
19:40:11.604: 
19:40:12.056: alsa-input: Failed to open 'front:CARD=Microphone,DEV=0': Device or resource busy
19:40:14.057: alsa-input: Failed to open 'front:CARD=Microphone,DEV=0': Device or resource busy
19:40:17.058: alsa-input: Failed to open 'front:CARD=Microphone,DEV=0': Device or resource busy
19:40:21.059: alsa-input: Failed to open 'front:CARD=Microphone,DEV=0': Device or resource busy
19:40:26.060: alsa-input: Failed to open 'front:CARD=Microphone,DEV=0': Device or resource busy
19:40:31.061: alsa-input: Failed to open 'front:CARD=Microphone,DEV=0': Device or resource busy
19:40:36.062: alsa-input: Failed to open 'front:CARD=Microphone,DEV=0': Device or resource busy
19:40:41.063: alsa-input: Failed to open 'front:CARD=Microphone,DEV=0': Device or resource busy
19:40:46.063: alsa-input: Failed to open 'front:CARD=Microphone,DEV=0': Device or resource busy
19:40:51.064: alsa-input: Failed to open 'front:CARD=Microphone,DEV=0': Device or resource busy
19:40:56.065: alsa-input: Failed to open 'front:CARD=Microphone,DEV=0': Device or resource busy
19:41:01.066: alsa-input: Failed to open 'front:CARD=Microphone,DEV=0': Device or resource busy
19:41:06.067: alsa-input: Failed to open 'front:CARD=Microphone,DEV=0': Device or resource busy
19:41:11.068: alsa-input: Failed to open 'front:CARD=Microphone,DEV=0': Device or resource busy
19:41:16.068: alsa-input: Failed to open 'front:CARD=Microphone,DEV=0': Device or resource busy
19:41:21.069: alsa-input: Failed to open 'front:CARD=Microphone,DEV=0': Device or resource busy
19:41:24.463: Settings changed (outputs)
19:41:24.463: ------------------------------------------------
19:41:26.070: alsa-input: Failed to open 'front:CARD=Microphone,DEV=0': Device or resource busy
19:41:27.634: ---------------------------------
19:41:27.634: [NVENC encoder: 'simple_h264_recording'] settings:
19:41:27.634: 	rate_control: CQP
19:41:27.634: 	bitrate:      0
19:41:27.634: 	cqp:          23
19:41:27.634: 	keyint:       250
19:41:27.634: 	preset:       hq
19:41:27.634: 	profile:      high
19:41:27.634: 	width:        1920
19:41:27.634: 	height:       1080
19:41:27.634: 	2-pass:       false
19:41:27.634: 	b-frames:     2
19:41:27.634: 	psycho-aq:    1
19:41:27.634: 	GPU:          0
19:41:27.634: 
19:41:27.888: libfdk_aac encoder created
19:41:27.888: libfdk_aac bitrate: 192, channels: 2
19:41:27.896: ==== Recording Start ===============================================
19:41:27.896: [ffmpeg muxer: 'simple_file_output'] Writing file '/home/nathan/mass_storage/OBS/2022-04-26 19-41-27.mkv'...
19:41:29.563: [ffmpeg muxer: 'simple_file_output'] Output of file '/home/nathan/mass_storage/OBS/2022-04-26 19-41-27.mkv' stopped
19:41:29.563: Output 'simple_file_output': stopping
19:41:29.563: Output 'simple_file_output': Total frames output: 64
19:41:29.563: Output 'simple_file_output': Total drawn frames: 100
19:41:29.563: ==== Recording Stop ================================================
19:41:29.762: libfdk_aac encoder destroyed
19:41:31.071: alsa-input: Failed to open 'front:CARD=Microphone,DEV=0': Device or resource busy
19:41:36.072: alsa-input: Failed to open 'front:CARD=Microphone,DEV=0': Device or resource busy
19:41:41.073: alsa-input: Failed to open 'front:CARD=Microphone,DEV=0': Device or resource busy
19:41:46.073: alsa-input: Failed to open 'front:CARD=Microphone,DEV=0': Device or resource busy
19:41:51.075: alsa-input: Failed to open 'front:CARD=Microphone,DEV=0': Device or resource busy
19:41:56.076: alsa-input: Failed to open 'front:CARD=Microphone,DEV=0': Device or resource busy
19:42:01.077: alsa-input: Failed to open 'front:CARD=Microphone,DEV=0': Device or resource busy
19:42:06.077: alsa-input: Failed to open 'front:CARD=Microphone,DEV=0': Device or resource busy
19:42:06.741: Settings changed (outputs)
19:42:06.741: ------------------------------------------------
19:42:11.078: alsa-input: Failed to open 'front:CARD=Microphone,DEV=0': Device or resource busy
19:42:13.916: ---------------------------------
19:42:13.916: [NVENC encoder: 'simple_h264_stream'] settings:
19:42:13.916: 	rate_control: CBR
19:42:13.916: 	bitrate:      2500
19:42:13.916: 	cqp:          0
19:42:13.916: 	keyint:       250
19:42:13.916: 	preset:       hq
19:42:13.916: 	profile:      high
19:42:13.916: 	width:        1920
19:42:13.916: 	height:       1080
19:42:13.916: 	2-pass:       false
19:42:13.916: 	b-frames:     2
19:42:13.916: 	psycho-aq:    1
19:42:13.916: 	GPU:          0
19:42:13.916: 
19:42:14.094: libfdk_aac encoder created
19:42:14.095: libfdk_aac bitrate: 160, channels: 2
19:42:14.100: ==== Recording Start ===============================================
19:42:14.100: [ffmpeg muxer: 'simple_file_output'] Writing file '/home/nathan/mass_storage/OBS/2022-04-26_19-42-13.mp4'...
19:42:16.079: alsa-input: Failed to open 'front:CARD=Microphone,DEV=0': Device or resource busy
19:42:21.079: alsa-input: Failed to open 'front:CARD=Microphone,DEV=0': Device or resource busy
19:42:26.080: alsa-input: Failed to open 'front:CARD=Microphone,DEV=0': Device or resource busy
19:42:29.830: [ffmpeg muxer: 'simple_file_output'] Output of file '/home/nathan/mass_storage/OBS/2022-04-26_19-42-13.mp4' stopped
19:42:29.830: Output 'simple_file_output': stopping
19:42:29.830: Output 'simple_file_output': Total frames output: 908
19:42:29.830: Output 'simple_file_output': Total drawn frames: 944
19:42:29.830: ==== Recording Stop ================================================
19:42:30.044: libfdk_aac encoder destroyed
19:42:31.081: alsa-input: Failed to open 'front:CARD=Microphone,DEV=0': Device or resource busy
19:42:36.081: alsa-input: Failed to open 'front:CARD=Microphone,DEV=0': Device or resource busy
19:42:41.082: alsa-input: Failed to open 'front:CARD=Microphone,DEV=0': Device or resource busy
19:42:46.083: alsa-input: Failed to open 'front:CARD=Microphone,DEV=0': Device or resource busy
19:42:51.083: alsa-input: Failed to open 'front:CARD=Microphone,DEV=0': Device or resource busy
19:42:56.084: alsa-input: Failed to open 'front:CARD=Microphone,DEV=0': Device or resource busy
19:43:01.085: alsa-input: Failed to open 'front:CARD=Microphone,DEV=0': Device or resource busy
19:43:06.085: alsa-input: Failed to open 'front:CARD=Microphone,DEV=0': Device or resource busy
19:43:11.218: alsa-input: Failed to open 'front:CARD=Microphone,DEV=0': Device or resource busy
19:43:16.219: alsa-input: Failed to open 'front:CARD=Microphone,DEV=0': Device or resource busy
19:43:21.221: alsa-input: Failed to open 'front:CARD=Microphone,DEV=0': Device or resource busy
19:43:26.221: alsa-input: Failed to open 'front:CARD=Microphone,DEV=0': Device or resource busy
19:43:31.222: alsa-input: Failed to open 'front:CARD=Microphone,DEV=0': Device or resource busy
19:43:36.223: alsa-input: Failed to open 'front:CARD=Microphone,DEV=0': Device or resource busy
19:43:41.224: alsa-input: Failed to open 'front:CARD=Microphone,DEV=0': Device or resource busy
19:43:46.225: alsa-input: Failed to open 'front:CARD=Microphone,DEV=0': Device or resource busy
19:43:51.225: alsa-input: Failed to open 'front:CARD=Microphone,DEV=0': Device or resource busy
19:43:56.226: alsa-input: Failed to open 'front:CARD=Microphone,DEV=0': Device or resource busy
19:44:01.227: alsa-input: Failed to open 'front:CARD=Microphone,DEV=0': Device or resource busy
19:44:06.228: alsa-input: Failed to open 'front:CARD=Microphone,DEV=0': Device or resource busy
19:44:11.228: alsa-input: Failed to open 'front:CARD=Microphone,DEV=0': Device or resource busy
19:44:16.229: alsa-input: Failed to open 'front:CARD=Microphone,DEV=0': Device or resource busy
19:44:21.230: alsa-input: Failed to open 'front:CARD=Microphone,DEV=0': Device or resource busy
19:44:26.231: alsa-input: Failed to open 'front:CARD=Microphone,DEV=0': Device or resource busy
19:44:31.232: alsa-input: Failed to open 'front:CARD=Microphone,DEV=0': Device or resource busy
19:44:36.233: alsa-input: Failed to open 'front:CARD=Microphone,DEV=0': Device or resource busy
19:44:41.233: alsa-input: Failed to open 'front:CARD=Microphone,DEV=0': Device or resource busy
19:44:46.234: alsa-input: Failed to open 'front:CARD=Microphone,DEV=0': Device or resource busy
19:44:51.234: alsa-input: Failed to open 'front:CARD=Microphone,DEV=0': Device or resource busy
19:44:56.235: alsa-input: Failed to open 'front:CARD=Microphone,DEV=0': Device or resource busy
19:45:01.236: alsa-input: Failed to open 'front:CARD=Microphone,DEV=0': Device or resource busy
19:46:19.008: Last log entry repeated for 15 more lines
19:46:19.008: ==== Shutting down ==================================================
19:46:19.028: pulse-input: Stopped recording from 'alsa_output.pci-0000_00_1f.3.analog-stereo.monitor'
19:46:19.028: pulse-input: Got 76077 packets with 16140406 frames
19:46:19.028: pulse-input: Stopped recording from 'alsa_input.usb-Samson_Technologies_Samson_Q2U_Microphone-00.analog-stereo'
19:46:19.028: pulse-input: Got 36900 packets with 16227609 frames
19:46:21.250: alsa-input: Failed to open 'front:CARD=Microphone,DEV=0': Device or resource busy
19:46:21.276: All scene data cleared
19:46:21.276: ------------------------------------------------
19:46:21.369: [Scripting] Total detached callbacks: 0
19:46:21.370: Freeing OBS context data
19:46:21.419: == Profiler Results =============================
19:46:21.419: run_program_init: 1044.41 ms
19:46:21.419:  ┣OBSApp::AppInit: 11.018 ms
19:46:21.419:  ┃ ┗OBSApp::InitLocale: 3.025 ms
19:46:21.419:  ┗OBSApp::OBSInit: 916.191 ms
19:46:21.419:    ┣obs_startup: 17.45 ms
19:46:21.419:    ┗OBSBasic::OBSInit: 802.166 ms
19:46:21.419:      ┣OBSBasic::InitBasicConfig: 0.198 ms
19:46:21.419:      ┣OBSBasic::ResetAudio: 0.083 ms
19:46:21.419:      ┣OBSBasic::ResetVideo: 253.06 ms
19:46:21.419:      ┣OBSBasic::InitOBSCallbacks: 0.017 ms
19:46:21.419:      ┣OBSBasic::InitHotkeys: 0.041 ms
19:46:21.419:      ┣obs_load_all_modules: 141.378 ms
19:46:21.419:      ┃ ┣obs_init_module(decklink-captions.so): 0.071 ms
19:46:21.419:      ┃ ┣obs_init_module(decklink-ouput-ui.so): 0.514 ms
19:46:21.419:      ┃ ┣obs_init_module(frontend-tools.so): 66.057 ms
19:46:21.419:      ┃ ┣obs_init_module(image-source.so): 0.006 ms
19:46:21.419:      ┃ ┣obs_init_module(linux-alsa.so): 0.001 ms
19:46:21.419:      ┃ ┣obs_init_module(linux-capture.so): 0.226 ms
19:46:21.419:      ┃ ┣obs_init_module(linux-decklink.so): 0.101 ms
19:46:21.419:      ┃ ┣obs_init_module(linux-jack.so): 0.001 ms
19:46:21.419:      ┃ ┣obs_init_module(linux-pulseaudio.so): 0.001 ms
19:46:21.419:      ┃ ┣obs_init_module(linux-v4l2.so): 6.138 ms
19:46:21.419:      ┃ ┣obs_init_module(obs-ffmpeg.so): 1.401 ms
19:46:21.419:      ┃ ┃ ┗nvenc_check: 1.29 ms
19:46:21.419:      ┃ ┣obs_init_module(obs-filters.so): 0.013 ms
19:46:21.419:      ┃ ┣obs_init_module(obs-libfdk.so): 0.001 ms
19:46:21.419:      ┃ ┣obs_init_module(obs-outputs.so): 0.001 ms
19:46:21.419:      ┃ ┣obs_init_module(obs-transitions.so): 0.004 ms
19:46:21.419:      ┃ ┣obs_init_module(obs-x264.so): 0.001 ms
19:46:21.419:      ┃ ┣obs_init_module(rtmp-services.so): 1.608 ms
19:46:21.419:      ┃ ┗obs_init_module(text-freetype2.so): 0.012 ms
19:46:21.419:      ┣OBSBasic::ResetOutputs: 1.314 ms
19:46:21.419:      ┣OBSBasic::CreateHotkeys: 0.031 ms
19:46:21.419:      ┣OBSBasic::InitService: 1.06 ms
19:46:21.419:      ┣OBSBasic::InitPrimitives: 0.156 ms
19:46:21.419:      ┗OBSBasic::Load: 320.765 ms
19:46:21.419: obs_hotkey_thread(25 ms): min=0.058 ms, median=0.156 ms, max=58.558 ms, 99th percentile=8.367 ms, 99.9447% below 25 ms
19:46:21.419: audio_thread(Audio): min=0 ms, median=0.141 ms, max=19.83 ms, 99th percentile=0.817 ms
19:46:21.419:  ┗receive_audio: min=0.002 ms, median=0.372 ms, max=1.049 ms, 99th percentile=0.886 ms, 0.0478069 calls per parent call
19:46:21.419:    ┣buffer_audio: min=0 ms, median=0.001 ms, max=0.084 ms, 99th percentile=0.002 ms
19:46:21.419:    ┗do_encode: min=0.097 ms, median=0.37 ms, max=1.043 ms, 99th percentile=0.882 ms
19:46:21.419:      ┣encode(simple_aac_recording): min=0.144 ms, median=0.276 ms, max=0.986 ms, 99th percentile=0.986 ms, 0.101449 calls per parent call
19:46:21.419:      ┣send_packet: min=0 ms, median=0.004 ms, max=0.065 ms, 99th percentile=0.028 ms
19:46:21.419:      ┗encode(simple_aac): min=0.091 ms, median=0.377 ms, max=1.034 ms, 99th percentile=0.831 ms, 0.898551 calls per parent call
19:46:21.419: obs_graphics_thread(16.6667 ms): min=0.299 ms, median=5.044 ms, max=115.054 ms, 99th percentile=16.954 ms, 98.1611% below 16.667 ms
19:46:21.419:  ┣tick_sources: min=0 ms, median=4.268 ms, max=71.216 ms, 99th percentile=16.293 ms
19:46:21.419:  ┣output_frame: min=0.093 ms, median=0.22 ms, max=46.597 ms, 99th percentile=1.021 ms
19:46:21.419:  ┃ ┣gs_context(video->graphics): min=0.093 ms, median=0.219 ms, max=46.597 ms, 99th percentile=0.667 ms
19:46:21.419:  ┃ ┃ ┣render_video: min=0.027 ms, median=0.12 ms, max=26.969 ms, 99th percentile=0.333 ms
19:46:21.419:  ┃ ┃ ┃ ┣render_main_texture: min=0.022 ms, median=0.11 ms, max=20.719 ms, 99th percentile=0.247 ms
19:46:21.419:  ┃ ┃ ┃ ┣render_output_texture: min=0.03 ms, median=0.037 ms, max=17.095 ms, 99th percentile=0.101 ms, 0.0470546 calls per parent call
19:46:21.419:  ┃ ┃ ┃ ┣render_convert_texture: min=0.038 ms, median=0.044 ms, max=8.789 ms, 99th percentile=0.113 ms, 0.0470546 calls per parent call
19:46:21.419:  ┃ ┃ ┃ ┗stage_output_texture: min=0.024 ms, median=0.029 ms, max=0.925 ms, 99th percentile=0.084 ms, 0.0470546 calls per parent call
19:46:21.419:  ┃ ┃ ┣gs_flush: min=0.005 ms, median=0.009 ms, max=15.521 ms, 99th percentile=0.047 ms
19:46:21.419:  ┃ ┃ ┗download_frame: min=0 ms, median=0.002 ms, max=0.012 ms, 99th percentile=0.005 ms, 0.0470546 calls per parent call
19:46:21.419:  ┃ ┗output_video_data: min=0.338 ms, median=0.38 ms, max=3.591 ms, 99th percentile=0.621 ms, 0.0469644 calls per parent call
19:46:21.419:  ┗render_displays: min=0.05 ms, median=0.284 ms, max=109.43 ms, 99th percentile=0.933 ms
19:46:21.419: OBSBasic::ResetOutputs: min=0.088 ms, median=0 ms, max=0.249 ms, 99th percentile=0.249 ms
19:46:21.419: video_thread(video): min=0.99 ms, median=1.273 ms, max=6.083 ms, 99th percentile=2.214 ms
19:46:21.419:  ┗receive_video: min=0.989 ms, median=1.272 ms, max=6.081 ms, 99th percentile=2.212 ms
19:46:21.419:    ┗do_encode: min=0.978 ms, median=1.271 ms, max=6.079 ms, 99th percentile=2.211 ms
19:46:21.419:      ┣encode(simple_h264_recording): min=0.998 ms, median=1.128 ms, max=2.904 ms, 99th percentile=2.904 ms, 0.0950096 calls per parent call
19:46:21.419:      ┣send_packet: min=0.002 ms, median=0.014 ms, max=4.276 ms, 99th percentile=0.037 ms, 0.934741 calls per parent call
19:46:21.419:      ┗encode(simple_h264_stream): min=0.977 ms, median=1.267 ms, max=2.312 ms, 99th percentile=1.951 ms, 0.90499 calls per parent call
19:46:21.419: =================================================
19:46:21.419: == Profiler Time Between Calls ==================
19:46:21.419: obs_hotkey_thread(25 ms): min=25.083 ms, median=25.244 ms, max=83.623 ms, 90.8865% within ±2% of 25 ms (0% lower, 9.11352% higher)
19:46:21.419: obs_graphics_thread(16.6667 ms): min=5.018 ms, median=16.667 ms, max=115.061 ms, 98.134% within ±2% of 16.667 ms (0.928513% lower, 0.937528% higher)
19:46:21.419: =================================================
19:46:21.441: Number of memory leaks: 1
