Name,Place,Division,Sex,Equipment,State,WeightClassKg,BodyweightKg,Age,Best3SquatKg,Best3BenchKg,Best3DeadliftKg,TotalKg,Event
Fran Searles,1,Open,F,Raw,MT,67.5,64.32,30,115,62.5,155,332.5,SBD
Stephanie Johnson,1,Open,F,Raw,MT,75,69.94,32,105,62.5,127.5,295,SBD
Sarah Paez-Long,1,Open,F,Raw,UT,82.5,81.1,32,132.5,65,137.5,335,SBD
Michele Russell,1,Open,F,Raw,UT,90,88.63,35,117.5,62.5,165,345,SBD
Vickie Shaw,1,Submasters 35-39,F,Raw,UT,67.5,66.59,39,85,65,145,295,SBD
Kristen Smith #1,2,Submasters 35-39,F,Raw,UT,67.5,61.51,37,60,50,102.5,212.5,SBD
Heather Hale,1,Submasters 35-39,F,Raw,UT,82.5,80.01,35,85,75,155,315,SBD
Aeowyn Pelca,1,Masters 40-44,F,Raw,UT,67.5,65.14,42,80,55,112.5,247.5,SBD
Ryan Schumm,1,Juniors 16-17,M,Raw,UT,67.5,64.77,17,137.5,77.5,182.5,397.5,SBD
Quyen Nguyen,1,Juniors 18-19,M,Raw,UT,75,72.12,18,152.5,85,170,407.5,SBD
Hudson Peery,1,Juniors 13-15,M,Raw,UT,82.5,75.93,14,25,52.5,102.5,180,SBD
Georgi Davidov,1,Open,M,Raw,UT,90,87.27,24,185,120,235,540,SBD
Keith Wolf,2,Open,M,Raw,MT,90,88,39,182.5,110,230,522.5,SBD
Josh Markham,3,Open,M,Raw,UT,90,85.91,34,157.5,110,205,472.5,SBD
Don Johnson #1,1,Open,M,Raw,UT,100,95.53,29,227.5,170,247.5,645,SBD
Logan Manzanas,2,Open,M,Raw,MT,100,98.97,25,210,145,235,590,SBD
Mike Cannon #1,1,Open,M,Raw,UT,110,109.77,40,295,192.5,295,782.5,SBD
John Mazza,2,Open,M,Raw,UT,110,109.32,33,260,182.5,297.5,740,SBD
Jared Case,3,Open,M,Raw,UT,100,99.43,37,190,120,210,520,SBD
Devon Parcell,1,Submasters 35-39,M,Raw,UT,90,88.81,35,182.5,145,220,547.5,SBD
Jule Albretsen,2,Submasters 35-39,M,Raw,UT,90,87.54,39,170,130,240,540,SBD
Brett Zimmerman,DQ,Submasters 35-39,M,Raw,UT,100,98.07,38,182.5,155,-240,,SBD
RB Hayes,1,Submasters 35-39,M,Raw,UT,125,113.58,35,157.5,105,155,417.5,SBD
David Colvin,1,Masters 50-54,M,Raw,NV,82.5,80.69,51,152.5,107.5,162,422,SBD
Mike Cannon #1,1,Masters 40-44,M,Raw,UT,110,109.77,40,295,192.5,295,782.5,SBD
Rylee Hudson,1,Juniors 18-19,F,Wraps,ID,67.5,63.23,19,115,55,120,290,SBD
Katlynn Hudson,1,Juniors 20-23,F,Wraps,ID,67.5,65.77,23,105,60,125,290,SBD
Rory Berigan,1,Masters 60-64,F,Wraps,MT,82.5,80.47,60,55,45,95,195,SBD
Joshua Maw,1,Juniors 18-19,M,Wraps,UT,90,89.72,19,177.5,130,227.5,535,SBD
Ben Shattuck,1,Open,M,Wraps,UT,67.5,65.95,27,140,95,155,390,SBD
Shea Kopecky,1,Open,M,Wraps,UT,100,98.07,30,235,192.5,262.5,690,SBD
Don Johnson #1,2,Open,M,Wraps,UT,100,95.53,29,227.5,170,247.5,645,SBD
Jacob Gunter,3,Open,M,Wraps,UT,100,99.7,35,237.5,137.5,260,635,SBD
Andrew Mower,4,Open,M,Wraps,UT,100,94.17,33,225,160,245,630,SBD
Jeremy Clifford,1,Open,M,Wraps,UT,140,139.53,30,287.5,167.5,310,765,SBD
Matt Olsen,1,Open,M,Wraps,UT,140+,153.5,24,300,205,245,750,SBD
David Hudson #1,1,Masters 50-54,M,Wraps,ID,75,74.84,53,182.5,107.5,182.5,472.5,SBD
David Wolf,1,Masters 55-59,M,Wraps,WY,125,115.58,59,192.5,132.5,220,545,SBD
Shay Ogden,1,Submasters 35-39,F,Single-ply,WY,67.5,65.5,38,92.5,60,125,277.5,SBD
Mike Saunders,DQ,Open,M,Single-ply,UT,100,99.88,34,345,-320,,,SBD
Jake Jensen,1,Open,M,Single-ply,UT,110,106.14,24,265,180,275,720,SBD
Aaron Davis,1,Submasters 35-39,M,Single-ply,UT,100,98.43,39,187.5,150,222.5,560,SBD
Scott Richey,1,Masters 55-59,M,Single-ply,NV,60,59.6,56,147.5,115,180,442.5,SBD
Tim Troy,1,Masters 55-59,M,Single-ply,WY,110,106.96,56,180,140,190,510,SBD
Jacob Stratton,1,Juniors 13-15,M,Multi-ply,UT,110,108.59,15,160,110,195,465,SBD
Cody Swensen,1,Juniors 18-19,M,Multi-ply,UT,100,94.8,19,272.5,182.5,260,715,SBD
Nickolas Damron,1,Open,M,Multi-ply,UT,125,116.57,26,200,157.5,205,562.5,SBD
Thomas Grove,1,Open,M,Raw,UT,90,89.99,24,,165,,165,B
Paul Andrus,1,Open,M,Raw,UT,100,92.71,36,,195,,195,B
Don Johnson #1,2,Open,M,Raw,UT,100,95.53,29,,170,,170,B
Charles Zbur,1,Open,M,Raw,WY,110,108.5,49,,192.5,,192.5,B
Marvin Rodenbeck,1,Open,M,Raw,MT,125,116.66,51,,157.5,,157.5,B
Brett Zimmerman,1,Submasters 35-39,M,Raw,UT,100,98.07,38,,155,,155,B
Michael Russell,1,Masters 55-59,M,Raw,CA,60,59.42,58,,90,,90,B
Chris Williams #1,1,Masters 55-59,M,Raw,UT,82.5,80.56,55,,107.5,,107.5,B
Scott Mecham,DQ,Open,M,Single-ply,UT,110,109.23,34,,-367.5,,,B
Jeff Alvari,1,Open,M,Single-ply,UT,125,117.48,49,,282.5,,282.5,B
Nathan Baptist,DQ,Open,M,Single-ply,UT,140+,200.03,30,,-250,,,B
Lance Davis,DQ,Masters 45-49,M,Single-ply,UT,110,108.41,47,,-175,,,B
Jeff Alvari,1,Masters 45-49,M,Single-ply,UT,125,117.48,49,,282.5,,282.5,B
Heather Gibson,1,Open,F,Multi-ply,UT,90+,108.95,40,,155,,155,B
Mick Benales,1,Open,M,Multi-ply,UT,125,113.58,32,,320,,320,B
Jason Gibson,1,Open,M,Multi-ply,UT,140,130.18,40,,320,,320,B
CJ Jenkins,DQ,Open,M,Multi-ply,UT,140,137.62,33,,-335,,,B
Jay Anderson,DQ,Submasters 35-39,M,Multi-ply,UT,125,116.57,36,,-272.5,,,B
Leslie Hofheins,1,Open,F,Raw,UT,75,73.66,43,,,197.5,197.5,D
Leslie Hofheins,1,Masters 40-44,F,Raw,UT,75,73.66,43,,,197.5,197.5,D
Don Johnson #1,1,Open,M,Raw,UT,100,95.53,29,,,247.5,247.5,D
CJ Jenkins,1,Open,M,Raw,UT,140,137.62,33,,,295,295,D
