Division,WeightClassKg,Place,Name,Team,BodyweightKg,Best3SquatKg,Best3BenchKg,Best3DeadliftKg,TotalKg,Equipment,Event,Sex
Boys,51.71,1,Juan Mares,Bowie,51.17,122.47,68.04,113.4,303.91,Single-ply,SBD,M
Boys,51.71,2,Dallas Elmore,Graham,50.62,97.52,61.23,122.47,281.23,Single-ply,SBD,M
Boys,51.71,3,Levi Jackson,Jacksboro,50.89,97.52,56.7,124.74,278.96,Single-ply,SBD,M
Boys,51.71,4,Zachary Tucker,Perrin-Whitt,50.44,108.86,52.16,106.59,267.62,Single-ply,SBD,M
Boys,51.71,5,Tristan Wilson,Graham,48.26,90.72,43.09,108.86,242.67,Single-ply,SBD,M
Boys,51.71,6,Jake Morris,Bowie,49.26,79.38,58.97,104.33,242.67,Single-ply,SBD,M
Boys,51.71,7,Carlos Fuentes,Graham,41.19,61.23,36.29,68.04,165.56,Single-ply,SBD,M
Boys,55.79,1,Ryan Thomas,Iowa Park,54.43,156.49,104.33,167.83,428.64,Single-ply,SBD,M
Boys,55.79,2,Dalton Adkins,Iowa Park,54.25,163.29,111.13,149.69,424.11,Single-ply,SBD,M
Boys,55.79,3,Dallas Salinas,Jacksboro,53.8,142.88,86.18,161.03,390.09,Single-ply,SBD,M
Boys,55.79,4,Ryan Stone,Graham,54.79,147.42,74.84,140.61,362.87,Single-ply,SBD,M
Boys,55.79,5,Zack Allen #1,Ponder,52.62,140.61,77.11,142.88,360.61,Single-ply,SBD,M
Boys,55.79,6,Jacob Hutchins,Graham,55.16,136.08,68.04,142.88,347,Single-ply,SBD,M
Boys,59.87,1,Lucas Sosebee,Iowa Park,58.06,181.44,117.93,183.7,483.08,Single-ply,SBD,M
Boys,59.87,2,Cristian Martinez,Bowie,58.97,179.17,97.52,188.24,464.93,Single-ply,SBD,M
Boys,59.87,3,Geo Miranda,Graham,59.24,163.29,86.18,156.49,405.97,Single-ply,SBD,M
Boys,59.87,4,Jared Holmes #2,Perrin-Whitt,56.97,140.61,81.65,172.37,394.63,Single-ply,SBD,M
Boys,59.87,5,Kalyb Conner,Paradise,59.15,147.42,74.84,156.49,378.75,Single-ply,SBD,M
Boys,59.87,6,Kade Weldon,Jacksboro,58.06,136.08,83.91,154.22,374.21,Single-ply,SBD,M
Boys,59.87,7,Braden Gonzales,Alvord,58.97,102.06,74.84,138.35,315.25,Single-ply,SBD,M
Boys,59.87,8,Cody Putnam,Alvord,59.06,97.52,58.97,113.4,269.89,Single-ply,SBD,M
Boys,67.13,1,Abraham Landaverde,Bowie,65.14,183.7,113.4,190.51,487.61,Single-ply,SBD,M
Boys,67.13,2,Darian Sotomi,Paradise,63.87,181.44,102.06,190.51,474,Single-ply,SBD,M
Boys,67.13,3,Crese Redman,Chico,66.86,192.78,83.91,192.78,469.47,Single-ply,SBD,M
Boys,67.13,4,Tinnin Smith,Jacksboro,63.68,172.37,115.67,174.63,462.66,Single-ply,SBD,M
Boys,74.84,5,Grayson Cobb,Paradise,67.36,185.97,88.45,183.7,458.13,Single-ply,SBD,M
Boys,67.13,6,J. Paul Axtell,Olney,60.42,170.1,95.25,170.1,435.45,Single-ply,SBD,M
Boys,67.13,7,Josh Wells #2,Jacksboro,64.23,147.42,81.65,176.9,405.97,Single-ply,SBD,M
Boys,67.13,8,Wyat Burrows,Olney,62.69,149.69,74.84,179.17,403.7,Single-ply,SBD,M
Boys,67.13,9,Noah Ballard,Olney,62.05,145.15,83.91,158.76,387.82,Single-ply,SBD,M
Boys,67.13,10,Justin Taylor,Decatur,62.14,131.54,88.45,124.74,344.73,Single-ply,SBD,M
Boys,67.13,11,Alex Langley,Alvord,65.41,90.72,58.97,138.35,288.03,Single-ply,SBD,M
Boys,74.84,1,Nate McLemore,Iowa Park,71.49,183.7,133.81,188.24,505.76,Single-ply,SBD,M
Boys,82.1,2,Magnum Sampson,Ponder,75,201.85,102.06,174.63,478.54,Single-ply,SBD,M
Boys,74.84,3,Aron Velasco,Graham,68.13,185.97,97.52,192.78,476.27,Single-ply,SBD,M
Boys,74.84,4,Garrett Johnson,Ponder,72.94,183.7,88.45,204.12,476.27,Single-ply,SBD,M
Boys,74.84,5,Dakota Cruthrid,Iowa Park,72.76,174.63,95.25,181.44,451.32,Single-ply,SBD,M
Boys,74.84,6,Colten McCarroll,Ponder,70.85,163.29,99.79,172.37,435.45,Single-ply,SBD,M
Boys,74.84,7,Marcus Thomas,Decatur,74.12,136.08,81.65,174.63,392.36,Single-ply,SBD,M
Boys,74.84,8,Jocob Hull,Jacksboro,70.76,133.81,79.38,167.83,381.02,Single-ply,SBD,M
Boys,74.84,9,William Kurnes,Chico,71.85,127.01,70.31,136.08,333.39,Single-ply,SBD,M
Boys,74.84,10,Allan Allsbrooks,Decatur,69.22,113.4,65.77,120.2,299.37,Single-ply,SBD,M
Boys,82.1,11,Noah Elliott,Decatur,75,104.33,63.5,111.13,278.96,Single-ply,SBD,M
Boys,82.1,12,Dakota Barney,Decatur,75,83.91,56.7,120.2,260.82,Single-ply,SBD,M
Boys,82.1,1,Austin Bennett,Ponder,80.38,208.65,111.13,201.85,521.63,Single-ply,SBD,M
Boys,82.1,2,Dre Gresham,Iowa Park,76.38,188.24,113.4,199.58,501.22,Single-ply,SBD,M
Boys,82.1,3,Jacob Whited,Ponder,76.75,192.78,106.59,174.63,474,Single-ply,SBD,M
Boys,82.1,4,Cole Gardner,Ponder,78.74,181.44,88.45,172.37,442.25,Single-ply,SBD,M
Boys,82.1,5,Logan Ramsey,Perrin-Whitt,82.1,170.1,99.79,149.69,419.57,Single-ply,SBD,M
Boys,82.1,6,Preston Guerra,Olney,79.38,142.88,95.25,154.22,392.36,Single-ply,SBD,M
Boys,82.1,7,Johnathan Green,Jacksboro,76.2,147.42,86.18,149.69,383.29,Single-ply,SBD,M
Boys,82.1,8,Zach Cardenas,Olney,80.2,115.67,70.31,113.4,299.37,Single-ply,SBD,M
Boys,82.1,9,Alex Nieto,Decatur,82.1,136.08,,,136.08,Single-ply,S,M
Boys,89.81,1,Ben Dankesreiter,Ponder,86.09,226.8,106.59,185.97,519.36,Single-ply,SBD,M
Boys,89.81,2,Taylor Hood,Chico,82.92,197.31,117.93,172.37,487.61,Single-ply,SBD,M
Boys,89.81,3,Hunter Shawver,Iowa Park,86.91,181.44,92.99,195.04,469.47,Single-ply,SBD,M
Boys,89.81,4,Mike Galindo,Chico,87.72,181.44,97.52,190.51,469.47,Single-ply,SBD,M
Boys,89.81,5,Lucas Ramsey,Perrin-Whitt,86,181.44,99.79,156.49,437.72,Single-ply,SBD,M
Boys,89.81,6,Channing Hamilton,Paradise,88.9,174.63,108.86,145.15,428.64,Single-ply,SBD,M
Boys,89.81,7,Damon Lewis,Decatur,84.37,161.03,88.45,174.63,424.11,Single-ply,SBD,M
Boys,89.81,8,Kyle Barnett,Decatur,84.46,156.49,88.45,167.83,412.77,Single-ply,SBD,M
Boys,89.81,9,Kevin White,Decatur,85.46,151.95,81.65,161.03,394.63,Single-ply,SBD,M
Boys,89.81,10,Tristan Barbare,Perrin-Whitt,84.37,142.88,86.18,145.15,374.21,Single-ply,SBD,M
Boys,99.79,11,Jake Kemp,Decatur,89.99,133.81,83.91,151.95,369.68,Single-ply,SBD,M
Boys,89.81,12,Hector Zaragosa,Chico,83.64,140.61,81.65,,222.26,Single-ply,SB,M
Boys,99.79,1,Drew McVicker,Olney,95.8,272.16,161.03,199.58,632.76,Single-ply,SBD,M
Boys,99.79,2,Alfonso Duran,Graham,96.8,213.19,106.59,190.51,510.29,Single-ply,SBD,M
Boys,99.79,3,Mitch Fruth,Ponder,92.26,204.12,106.59,188.24,498.95,Single-ply,SBD,M
Boys,99.79,4,Cody Holaway,Decatur,96.62,190.51,102.06,174.63,467.2,Single-ply,SBD,M
Boys,99.79,5,Blake Martin,Alvord,96.98,185.97,92.99,185.97,464.93,Single-ply,SBD,M
Boys,99.79,6,Dylan Hudson,Olney,92.8,170.1,106.59,181.44,458.13,Single-ply,SBD,M
Boys,99.79,7,Cody Armstrong,Chico,91.9,181.44,90.72,174.63,446.79,Single-ply,SBD,M
Boys,99.79,8,Brendan Fruth,Ponder,90.63,174.63,102.06,158.76,435.45,Single-ply,SBD,M
Boys,109.77,1,Allen Mullis,Ponder,102.6,242.67,165.56,197.31,605.55,Single-ply,SBD,M
Boys,109.77,2,Saul Landaverde,Bowie,109.59,244.94,120.2,217.72,582.87,Single-ply,SBD,M
Boys,109.77,3,Deric Conner,Paradise,103.6,222.26,154.22,183.7,560.19,Single-ply,SBD,M
Boys,109.77,4,Justin Wagner,Ponder,106.14,249.48,108.86,188.24,546.58,Single-ply,SBD,M
Boys,109.77,5,David Palacios,Graham,102.33,195.04,99.79,158.76,453.59,Single-ply,SBD,M
Boys,109.77,6,JD Brown,Chico,105.87,172.37,104.33,163.29,439.98,Single-ply,SBD,M
Boys,109.77,7,John Salazar,Chico,105.05,154.22,97.52,167.83,419.57,Single-ply,SBD,M
Boys,109.77,8,Jt Fallon,Iowa Park,108.32,172.37,,142.88,315.25,Single-ply,SD,M
Boys,124.74,1,Tanner Edwards,Paradise,110.68,254.01,149.69,199.58,603.28,Single-ply,SBD,M
Boys,124.74,2,David Correa,Bowie,114.67,249.48,138.35,208.65,596.47,Single-ply,SBD,M
Boys,124.74,3,Hector Alejo,Graham,115.67,224.53,129.27,183.7,537.51,Single-ply,SBD,M
Boys,124.74,4,Cody Caballero,Iowa Park,120.2,190.51,117.93,208.65,517.1,Single-ply,SBD,M
Boys,124.74,5,Tyler Wagner,Ponder,116.03,181.44,90.72,145.15,417.3,Single-ply,SBD,M
Boys,124.74,6,Tyler Yzaguirre,Alvord,119.39,147.42,104.33,140.61,392.36,Single-ply,SBD,M
Boys,124.74,7,Johnathan Fawley,Decatur,111.04,120.2,74.84,122.47,317.51,Single-ply,SBD,M
Boys,124.74,8,Thomas Waite,Ponder,120.11,272.16,,,272.16,Single-ply,S,M
Boys,124.74+,1,Taylor Hopkins,Graham,132.63,235.87,167.83,206.38,610.08,Single-ply,SBD,M
Boys,124.74+,2,Jacob Poole,Ponder,136.71,219.99,95.25,158.76,474,Single-ply,SBD,M
