-- Merging decision tree log ---
application
INJECTED from /home/descombes/dev/appdom/android/app/src/main/AndroidManifest.xml:3:4-33:19
MERGED from [androidx.window:window:1.0.0-beta04] /home/descombes/.gradle/caches/transforms-2/files-2.1/03c633e46d75bfb21f082f0417f55161/jetified-window-1.0.0-beta04/AndroidManifest.xml:24:5-31:19
MERGED from [androidx.window:window:1.0.0-beta04] /home/descombes/.gradle/caches/transforms-2/files-2.1/03c633e46d75bfb21f082f0417f55161/jetified-window-1.0.0-beta04/AndroidManifest.xml:24:5-31:19
MERGED from [androidx.core:core:1.6.0] /home/descombes/.gradle/caches/transforms-2/files-2.1/122df2e57d294d1a53db26bbc3b813c1/core-1.6.0/AndroidManifest.xml:24:5-89
MERGED from [androidx.core:core:1.6.0] /home/descombes/.gradle/caches/transforms-2/files-2.1/122df2e57d294d1a53db26bbc3b813c1/core-1.6.0/AndroidManifest.xml:24:5-89
MERGED from [androidx.versionedparcelable:versionedparcelable:1.1.1] /home/descombes/.gradle/caches/transforms-2/files-2.1/884708a9396f81808c0ac10f4b98ea32/versionedparcelable-1.1.1/AndroidManifest.xml:24:5-25:19
MERGED from [androidx.versionedparcelable:versionedparcelable:1.1.1] /home/descombes/.gradle/caches/transforms-2/files-2.1/884708a9396f81808c0ac10f4b98ea32/versionedparcelable-1.1.1/AndroidManifest.xml:24:5-25:19
	android:appComponentFactory
		ADDED from [androidx.core:core:1.6.0] /home/descombes/.gradle/caches/transforms-2/files-2.1/122df2e57d294d1a53db26bbc3b813c1/core-1.6.0/AndroidManifest.xml:24:18-86
	android:name
		INJECTED from /home/descombes/dev/appdom/android/app/src/main/AndroidManifest.xml
manifest
ADDED from /home/descombes/dev/appdom/android/app/src/main/AndroidManifest.xml:1:1-34:12
INJECTED from /home/descombes/dev/appdom/android/app/src/main/AndroidManifest.xml:1:1-34:12
INJECTED from /home/descombes/dev/appdom/android/app/src/main/AndroidManifest.xml:1:1-34:12
INJECTED from /home/descombes/dev/appdom/android/app/src/main/AndroidManifest.xml:1:1-34:12
MERGED from /home/descombes/dev/appdom/android/app/src/main/AndroidManifest.xml:1:1-34:12
MERGED from [androidx.window:window-java:1.0.0-beta04] /home/descombes/.gradle/caches/transforms-2/files-2.1/ad201fac15a88598107ec645f351f5b4/jetified-window-java-1.0.0-beta04/AndroidManifest.xml:17:1-23:12
MERGED from [androidx.window:window:1.0.0-beta04] /home/descombes/.gradle/caches/transforms-2/files-2.1/03c633e46d75bfb21f082f0417f55161/jetified-window-1.0.0-beta04/AndroidManifest.xml:17:1-33:12
MERGED from [androidx.fragment:fragment:1.1.0] /home/descombes/.gradle/caches/transforms-2/files-2.1/8601dd65e0c6893d5abc5ccde1e2cab3/fragment-1.1.0/AndroidManifest.xml:17:1-24:12
MERGED from [androidx.viewpager:viewpager:1.0.0] /home/descombes/.gradle/caches/transforms-2/files-2.1/ae39e38aa58f5c391f29a4bfad4a41a4/viewpager-1.0.0/AndroidManifest.xml:17:1-22:12
MERGED from [androidx.loader:loader:1.0.0] /home/descombes/.gradle/caches/transforms-2/files-2.1/92d1f830d8a4f76d15ea1f849fb6f29f/loader-1.0.0/AndroidManifest.xml:17:1-22:12
MERGED from [androidx.activity:activity:1.0.0] /home/descombes/.gradle/caches/transforms-2/files-2.1/172ae1f46f014e6681a2cc350fa8b737/jetified-activity-1.0.0/AndroidManifest.xml:17:1-24:12
MERGED from [androidx.customview:customview:1.0.0] /home/descombes/.gradle/caches/transforms-2/files-2.1/9ccab238727e236e8aff01a0f95cebe4/customview-1.0.0/AndroidManifest.xml:17:1-22:12
MERGED from [androidx.core:core:1.6.0] /home/descombes/.gradle/caches/transforms-2/files-2.1/122df2e57d294d1a53db26bbc3b813c1/core-1.6.0/AndroidManifest.xml:17:1-26:12
MERGED from [androidx.lifecycle:lifecycle-runtime:2.2.0] /home/descombes/.gradle/caches/transforms-2/files-2.1/61ef02e8f0f19ac7089cb3c73160753b/lifecycle-runtime-2.2.0/AndroidManifest.xml:17:1-24:12
MERGED from [androidx.savedstate:savedstate:1.0.0] /home/descombes/.gradle/caches/transforms-2/files-2.1/8d7928c9f52af5f964a662866fcebb3e/jetified-savedstate-1.0.0/AndroidManifest.xml:17:1-24:12
MERGED from [androidx.lifecycle:lifecycle-livedata:2.0.0] /home/descombes/.gradle/caches/transforms-2/files-2.1/8108bc8c5f35a568f919dbab3be0e175/lifecycle-livedata-2.0.0/AndroidManifest.xml:17:1-22:12
MERGED from [androidx.lifecycle:lifecycle-livedata-core:2.0.0] /home/descombes/.gradle/caches/transforms-2/files-2.1/403e5322101e882ebd13d146c86f92ca/lifecycle-livedata-core-2.0.0/AndroidManifest.xml:17:1-22:12
MERGED from [androidx.tracing:tracing:1.0.0] /home/descombes/.gradle/caches/transforms-2/files-2.1/6c6575c923e75933616af1a602db32e0/jetified-tracing-1.0.0/AndroidManifest.xml:17:1-24:12
MERGED from [androidx.arch.core:core-runtime:2.0.0] /home/descombes/.gradle/caches/transforms-2/files-2.1/c8d7e3b2963d9fc9e8f1cf9aeb870fb3/core-runtime-2.0.0/AndroidManifest.xml:17:1-22:12
MERGED from [androidx.versionedparcelable:versionedparcelable:1.1.1] /home/descombes/.gradle/caches/transforms-2/files-2.1/884708a9396f81808c0ac10f4b98ea32/versionedparcelable-1.1.1/AndroidManifest.xml:17:1-27:12
MERGED from [androidx.lifecycle:lifecycle-viewmodel:2.1.0] /home/descombes/.gradle/caches/transforms-2/files-2.1/9a0e475eb211916dfa0da9de1d6c02a3/lifecycle-viewmodel-2.1.0/AndroidManifest.xml:17:1-22:12
MERGED from [androidx.annotation:annotation-experimental:1.1.0] /home/descombes/.gradle/caches/transforms-2/files-2.1/5bfc0955e244073bdc8cc139cda5e092/jetified-annotation-experimental-1.1.0/AndroidManifest.xml:17:1-24:12
INJECTED from /home/descombes/dev/appdom/android/app/src/debug/AndroidManifest.xml:1:1-7:12
INJECTED from /home/descombes/dev/appdom/android/app/src/debug/AndroidManifest.xml:1:1-7:12
INJECTED from /home/descombes/dev/appdom/android/app/src/debug/AndroidManifest.xml:1:1-7:12
	package
		ADDED from /home/descombes/dev/appdom/android/app/src/main/AndroidManifest.xml:2:5-34
		INJECTED from /home/descombes/dev/appdom/android/app/src/main/AndroidManifest.xml
		INJECTED from /home/descombes/dev/appdom/android/app/src/debug/AndroidManifest.xml
	android:versionName
		INJECTED from /home/descombes/dev/appdom/android/app/src/main/AndroidManifest.xml
		ADDED from /home/descombes/dev/appdom/android/app/src/main/AndroidManifest.xml:1:1-34:12
		INJECTED from /home/descombes/dev/appdom/android/app/src/debug/AndroidManifest.xml
	android:versionCode
		INJECTED from /home/descombes/dev/appdom/android/app/src/main/AndroidManifest.xml
		ADDED from /home/descombes/dev/appdom/android/app/src/main/AndroidManifest.xml:1:1-34:12
		INJECTED from /home/descombes/dev/appdom/android/app/src/debug/AndroidManifest.xml
	xmlns:android
		ADDED from /home/descombes/dev/appdom/android/app/src/main/AndroidManifest.xml:1:11-69
uses-sdk
INJECTED from /home/descombes/dev/appdom/android/app/src/main/AndroidManifest.xml reason: use-sdk injection requested
INJECTED from /home/descombes/dev/appdom/android/app/src/main/AndroidManifest.xml
INJECTED from /home/descombes/dev/appdom/android/app/src/main/AndroidManifest.xml
MERGED from [androidx.window:window-java:1.0.0-beta04] /home/descombes/.gradle/caches/transforms-2/files-2.1/ad201fac15a88598107ec645f351f5b4/jetified-window-java-1.0.0-beta04/AndroidManifest.xml:19:5-21:41
MERGED from [androidx.window:window-java:1.0.0-beta04] /home/descombes/.gradle/caches/transforms-2/files-2.1/ad201fac15a88598107ec645f351f5b4/jetified-window-java-1.0.0-beta04/AndroidManifest.xml:19:5-21:41
MERGED from [androidx.window:window:1.0.0-beta04] /home/descombes/.gradle/caches/transforms-2/files-2.1/03c633e46d75bfb21f082f0417f55161/jetified-window-1.0.0-beta04/AndroidManifest.xml:20:5-22:41
MERGED from [androidx.window:window:1.0.0-beta04] /home/descombes/.gradle/caches/transforms-2/files-2.1/03c633e46d75bfb21f082f0417f55161/jetified-window-1.0.0-beta04/AndroidManifest.xml:20:5-22:41
MERGED from [androidx.fragment:fragment:1.1.0] /home/descombes/.gradle/caches/transforms-2/files-2.1/8601dd65e0c6893d5abc5ccde1e2cab3/fragment-1.1.0/AndroidManifest.xml:20:5-22:41
MERGED from [androidx.fragment:fragment:1.1.0] /home/descombes/.gradle/caches/transforms-2/files-2.1/8601dd65e0c6893d5abc5ccde1e2cab3/fragment-1.1.0/AndroidManifest.xml:20:5-22:41
MERGED from [androidx.viewpager:viewpager:1.0.0] /home/descombes/.gradle/caches/transforms-2/files-2.1/ae39e38aa58f5c391f29a4bfad4a41a4/viewpager-1.0.0/AndroidManifest.xml:20:5-44
MERGED from [androidx.viewpager:viewpager:1.0.0] /home/descombes/.gradle/caches/transforms-2/files-2.1/ae39e38aa58f5c391f29a4bfad4a41a4/viewpager-1.0.0/AndroidManifest.xml:20:5-44
MERGED from [androidx.loader:loader:1.0.0] /home/descombes/.gradle/caches/transforms-2/files-2.1/92d1f830d8a4f76d15ea1f849fb6f29f/loader-1.0.0/AndroidManifest.xml:20:5-44
MERGED from [androidx.loader:loader:1.0.0] /home/descombes/.gradle/caches/transforms-2/files-2.1/92d1f830d8a4f76d15ea1f849fb6f29f/loader-1.0.0/AndroidManifest.xml:20:5-44
MERGED from [androidx.activity:activity:1.0.0] /home/descombes/.gradle/caches/transforms-2/files-2.1/172ae1f46f014e6681a2cc350fa8b737/jetified-activity-1.0.0/AndroidManifest.xml:20:5-22:41
MERGED from [androidx.activity:activity:1.0.0] /home/descombes/.gradle/caches/transforms-2/files-2.1/172ae1f46f014e6681a2cc350fa8b737/jetified-activity-1.0.0/AndroidManifest.xml:20:5-22:41
MERGED from [androidx.customview:customview:1.0.0] /home/descombes/.gradle/caches/transforms-2/files-2.1/9ccab238727e236e8aff01a0f95cebe4/customview-1.0.0/AndroidManifest.xml:20:5-44
MERGED from [androidx.customview:customview:1.0.0] /home/descombes/.gradle/caches/transforms-2/files-2.1/9ccab238727e236e8aff01a0f95cebe4/customview-1.0.0/AndroidManifest.xml:20:5-44
MERGED from [androidx.core:core:1.6.0] /home/descombes/.gradle/caches/transforms-2/files-2.1/122df2e57d294d1a53db26bbc3b813c1/core-1.6.0/AndroidManifest.xml:20:5-22:41
MERGED from [androidx.core:core:1.6.0] /home/descombes/.gradle/caches/transforms-2/files-2.1/122df2e57d294d1a53db26bbc3b813c1/core-1.6.0/AndroidManifest.xml:20:5-22:41
MERGED from [androidx.lifecycle:lifecycle-runtime:2.2.0] /home/descombes/.gradle/caches/transforms-2/files-2.1/61ef02e8f0f19ac7089cb3c73160753b/lifecycle-runtime-2.2.0/AndroidManifest.xml:20:5-22:41
MERGED from [androidx.lifecycle:lifecycle-runtime:2.2.0] /home/descombes/.gradle/caches/transforms-2/files-2.1/61ef02e8f0f19ac7089cb3c73160753b/lifecycle-runtime-2.2.0/AndroidManifest.xml:20:5-22:41
MERGED from [androidx.savedstate:savedstate:1.0.0] /home/descombes/.gradle/caches/transforms-2/files-2.1/8d7928c9f52af5f964a662866fcebb3e/jetified-savedstate-1.0.0/AndroidManifest.xml:20:5-22:41
MERGED from [androidx.savedstate:savedstate:1.0.0] /home/descombes/.gradle/caches/transforms-2/files-2.1/8d7928c9f52af5f964a662866fcebb3e/jetified-savedstate-1.0.0/AndroidManifest.xml:20:5-22:41
MERGED from [androidx.lifecycle:lifecycle-livedata:2.0.0] /home/descombes/.gradle/caches/transforms-2/files-2.1/8108bc8c5f35a568f919dbab3be0e175/lifecycle-livedata-2.0.0/AndroidManifest.xml:20:5-44
MERGED from [androidx.lifecycle:lifecycle-livedata:2.0.0] /home/descombes/.gradle/caches/transforms-2/files-2.1/8108bc8c5f35a568f919dbab3be0e175/lifecycle-livedata-2.0.0/AndroidManifest.xml:20:5-44
MERGED from [androidx.lifecycle:lifecycle-livedata-core:2.0.0] /home/descombes/.gradle/caches/transforms-2/files-2.1/403e5322101e882ebd13d146c86f92ca/lifecycle-livedata-core-2.0.0/AndroidManifest.xml:20:5-44
MERGED from [androidx.lifecycle:lifecycle-livedata-core:2.0.0] /home/descombes/.gradle/caches/transforms-2/files-2.1/403e5322101e882ebd13d146c86f92ca/lifecycle-livedata-core-2.0.0/AndroidManifest.xml:20:5-44
MERGED from [androidx.tracing:tracing:1.0.0] /home/descombes/.gradle/caches/transforms-2/files-2.1/6c6575c923e75933616af1a602db32e0/jetified-tracing-1.0.0/AndroidManifest.xml:20:5-22:41
MERGED from [androidx.tracing:tracing:1.0.0] /home/descombes/.gradle/caches/transforms-2/files-2.1/6c6575c923e75933616af1a602db32e0/jetified-tracing-1.0.0/AndroidManifest.xml:20:5-22:41
MERGED from [androidx.arch.core:core-runtime:2.0.0] /home/descombes/.gradle/caches/transforms-2/files-2.1/c8d7e3b2963d9fc9e8f1cf9aeb870fb3/core-runtime-2.0.0/AndroidManifest.xml:20:5-44
MERGED from [androidx.arch.core:core-runtime:2.0.0] /home/descombes/.gradle/caches/transforms-2/files-2.1/c8d7e3b2963d9fc9e8f1cf9aeb870fb3/core-runtime-2.0.0/AndroidManifest.xml:20:5-44
MERGED from [androidx.versionedparcelable:versionedparcelable:1.1.1] /home/descombes/.gradle/caches/transforms-2/files-2.1/884708a9396f81808c0ac10f4b98ea32/versionedparcelable-1.1.1/AndroidManifest.xml:20:5-22:41
MERGED from [androidx.versionedparcelable:versionedparcelable:1.1.1] /home/descombes/.gradle/caches/transforms-2/files-2.1/884708a9396f81808c0ac10f4b98ea32/versionedparcelable-1.1.1/AndroidManifest.xml:20:5-22:41
MERGED from [androidx.lifecycle:lifecycle-viewmodel:2.1.0] /home/descombes/.gradle/caches/transforms-2/files-2.1/9a0e475eb211916dfa0da9de1d6c02a3/lifecycle-viewmodel-2.1.0/AndroidManifest.xml:20:5-44
MERGED from [androidx.lifecycle:lifecycle-viewmodel:2.1.0] /home/descombes/.gradle/caches/transforms-2/files-2.1/9a0e475eb211916dfa0da9de1d6c02a3/lifecycle-viewmodel-2.1.0/AndroidManifest.xml:20:5-44
MERGED from [androidx.annotation:annotation-experimental:1.1.0] /home/descombes/.gradle/caches/transforms-2/files-2.1/5bfc0955e244073bdc8cc139cda5e092/jetified-annotation-experimental-1.1.0/AndroidManifest.xml:20:5-22:41
MERGED from [androidx.annotation:annotation-experimental:1.1.0] /home/descombes/.gradle/caches/transforms-2/files-2.1/5bfc0955e244073bdc8cc139cda5e092/jetified-annotation-experimental-1.1.0/AndroidManifest.xml:20:5-22:41
INJECTED from /home/descombes/dev/appdom/android/app/src/debug/AndroidManifest.xml
INJECTED from /home/descombes/dev/appdom/android/app/src/debug/AndroidManifest.xml
	android:targetSdkVersion
		INJECTED from /home/descombes/dev/appdom/android/app/src/main/AndroidManifest.xml
		INJECTED from /home/descombes/dev/appdom/android/app/src/debug/AndroidManifest.xml
	android:minSdkVersion
		INJECTED from /home/descombes/dev/appdom/android/app/src/main/AndroidManifest.xml
		INJECTED from /home/descombes/dev/appdom/android/app/src/debug/AndroidManifest.xml
uses-permission#android.permission.INTERNET
ADDED from /home/descombes/dev/appdom/android/app/src/debug/AndroidManifest.xml:6:5-66
	android:name
		ADDED from /home/descombes/dev/appdom/android/app/src/debug/AndroidManifest.xml:6:22-64
uses-library#androidx.window.extensions
ADDED from [androidx.window:window:1.0.0-beta04] /home/descombes/.gradle/caches/transforms-2/files-2.1/03c633e46d75bfb21f082f0417f55161/jetified-window-1.0.0-beta04/AndroidManifest.xml:25:9-27:40
	android:required
		ADDED from [androidx.window:window:1.0.0-beta04] /home/descombes/.gradle/caches/transforms-2/files-2.1/03c633e46d75bfb21f082f0417f55161/jetified-window-1.0.0-beta04/AndroidManifest.xml:27:13-37
	android:name
		ADDED from [androidx.window:window:1.0.0-beta04] /home/descombes/.gradle/caches/transforms-2/files-2.1/03c633e46d75bfb21f082f0417f55161/jetified-window-1.0.0-beta04/AndroidManifest.xml:26:13-54
uses-library#androidx.window.sidecar
ADDED from [androidx.window:window:1.0.0-beta04] /home/descombes/.gradle/caches/transforms-2/files-2.1/03c633e46d75bfb21f082f0417f55161/jetified-window-1.0.0-beta04/AndroidManifest.xml:28:9-30:40
	android:required
		ADDED from [androidx.window:window:1.0.0-beta04] /home/descombes/.gradle/caches/transforms-2/files-2.1/03c633e46d75bfb21f082f0417f55161/jetified-window-1.0.0-beta04/AndroidManifest.xml:30:13-37
	android:name
		ADDED from [androidx.window:window:1.0.0-beta04] /home/descombes/.gradle/caches/transforms-2/files-2.1/03c633e46d75bfb21f082f0417f55161/jetified-window-1.0.0-beta04/AndroidManifest.xml:29:13-51
