{
  "connection": "default",
  "collectionName": "etapes",
  "info": {
    "name": "etape",
    "description": ""
  },
  "options": {
    "increments": true,
    "timestamps": [
      "created_at",
      "updated_at"
    ],
    "comment": ""
  },
  "attributes": {
    "title": {
      "type": "string"
    },
    "lat": {
      "type": "decimal"
    },
    "lon": {
      "type": "decimal"
    },
    "adress": {
      "type": "string"
    },
    "mark": {
      "type": "integer",
      "max": 5,
      "default": "5"
    },
    "comment": {
      "type": "text"
    },
    "pictures": {
      "collection": "file",
      "via": "related",
      "plugin": "upload"
    },
    "interests": {
      "collection": "interest",
      "via": "etape"
    },
    "user": {
      "model": "user",
      "via": "etapes",
      "plugin": "users-permissions"
    },
    "voyage": {
      "model": "voyage",
      "via": "etapes"
    },
    "start": {
      "type": "date"
    }
  }
}