{
  "connection": "default",
  "collectionName": "users-permissions_user",
  "info": {
    "name": "user",
    "description": ""
  },
  "options": {
    "timestamps": [
      "created_at",
      "updated_at"
    ]
  },
  "attributes": {
    "username": {
      "type": "string",
      "minLength": 3,
      "unique": true,
      "configurable": false,
      "required": true
    },
    "email": {
      "type": "email",
      "minLength": 6,
      "configurable": false,
      "required": true
    },
    "provider": {
      "type": "string",
      "configurable": false
    },
    "password": {
      "type": "password",
      "minLength": 6,
      "configurable": false,
      "private": true
    },
    "resetPasswordToken": {
      "type": "string",
      "configurable": false,
      "private": true
    },
    "confirmed": {
      "type": "boolean",
      "default": false,
      "configurable": false
    },
    "blocked": {
      "type": "boolean",
      "default": false,
      "configurable": false
    },
    "role": {
      "model": "role",
      "via": "users",
      "plugin": "users-permissions",
      "configurable": false
    },
    "firstname": {
      "type": "string",
      "required": true,
      "maxLength": 128
    },
    "lastname": {
      "type": "string",
      "required": true,
      "maxLength": 128
    },
    "picture": {
      "model": "file",
      "via": "related",
      "plugin": "upload"
    },
    "interests": {
      "collection": "interest",
      "via": "user"
    },
    "adress": {
      "type": "string"
    },
    "phone": {
      "type": "string"
    },
    "follows": {
      "collection": "user",
      "via": "users",
      "plugin": "users-permissions"
    },
    "users": {
      "collection": "user",
      "via": "follows",
      "plugin": "users-permissions"
    },
    "voyages": {
      "collection": "voyage",
      "via": "user"
    },
    "likes": {
      "collection": "voyage",
      "via": "userslikes",
      "dominant": true
    },
    "etapes": {
      "collection": "etape",
      "via": "user"
    }
  }
}