[gd_scene load_steps=9 format=2]

[ext_resource path="res://Stages/Stage.tscn" type="PackedScene" id=1]
[ext_resource path="res://tileset_test.tres" type="TileSet" id=2]
[ext_resource path="res://Player/Player.tscn" type="PackedScene" id=3]
[ext_resource path="res://Objects/Wall.tscn" type="PackedScene" id=4]
[ext_resource path="res://Objects/Button.tscn" type="PackedScene" id=5]
[ext_resource path="res://Objects/MovingPlatform_OneWay.tscn" type="PackedScene" id=6]
[ext_resource path="res://Objects/Endgoal.tscn" type="PackedScene" id=7]
[ext_resource path="res://Stages/Tutorial/Event.tscn" type="PackedScene" id=8]

[node name="stage27" instance=ExtResource( 1 )]

ACT = 3
MAX_CLONES = 1

[node name="Real" type="ReferenceRect" parent="." index="0"]

anchor_left = 0.0
anchor_top = 0.0
anchor_right = 0.0
anchor_bottom = 0.0
margin_left = -363.0
margin_right = 1151.0
margin_bottom = 1025.0
rect_pivot_offset = Vector2( 0, 0 )
rect_clip_content = false
mouse_filter = 0
mouse_default_cursor_shape = 0
size_flags_horizontal = 1
size_flags_vertical = 1

[node name="TileMap" type="TileMap" parent="." index="1"]

mode = 0
tile_set = ExtResource( 2 )
cell_size = Vector2( 64, 64 )
cell_quadrant_size = 16
cell_custom_transform = Transform2D( 1, 0, 0, 1, 0, 0 )
cell_half_offset = 2
cell_tile_origin = 0
cell_y_sort = false
cell_clip_uv = false
collision_use_kinematic = false
collision_friction = 1.0
collision_bounce = 0.0
collision_layer = 1
collision_mask = 1
occluder_light_mask = 1
format = 1
tile_data = PoolIntArray( 65530, 11, 0, 65531, 11, 0, 65532, 11, 0, 65533, 11, 0, 65534, 11, 0, 65535, 11, 0, 0, 11, 0, 1, 11, 0, 2, 11, 0, 3, 11, 0, 4, 11, 0, 5, 11, 0, 6, 11, 0, 7, 11, 0, 8, 11, 0, 9, 11, 0, 10, 11, 0, 11, 1, 0, 12, 11, 0, 13, 11, 0, 14, 11, 0, 15, 11, 0, 16, 11, 0, 17, 1, 0, 131066, 536870919, 0, 131067, 3, 0, 131068, 3, 0, 131069, 3, 0, 131070, 7, 0, 65547, 1, 0, 65553, 1, 0, 196602, 536870919, 0, 196603, 3, 0, 196604, 3, 0, 196605, 3, 0, 196606, 7, 0, 131083, 1, 0, 131089, 1, 0, 262138, 536870919, 0, 262139, 3, 0, 262140, 3, 0, 262141, 3, 0, 262142, 7, 0, 196613, 536870914, 0, 196614, 0, 0, 196615, 0, 0, 196616, 0, 0, 196617, 0, 0, 196618, 0, 0, 196619, 2, 0, 196625, 1, 0, 327674, 536870919, 0, 327675, 3, 0, 327676, 3, 0, 327677, 3, 0, 327678, 7, 0, 262149, 536870920, 0, 262150, 6, 0, 262151, 6, 0, 262152, 6, 0, 262153, 6, 0, 262154, 6, 0, 262155, 8, 0, 262161, 1, 0, 393210, 536870919, 0, 393211, 3, 0, 393212, 3, 0, 393213, 3, 0, 393214, 7, 0, 327685, 536870919, 0, 327686, 536870915, 0, 327687, 536870915, 0, 327688, 536870915, 0, 327689, 536870915, 0, 327690, 536870915, 0, 327691, 7, 0, 327692, 0, 0, 327693, 0, 0, 327694, 2, 0, 327697, 1, 0, 458746, 536870919, 0, 458747, 3, 0, 458748, 3, 0, 458749, 3, 0, 458750, 7, 0, 458751, 536870912, 0, 393216, 536870912, 0, 393217, 2, 0, 393219, 536870914, 0, 393220, 536870912, 0, 393221, 536870919, 0, 393222, 536870915, 0, 393223, 536870915, 0, 393224, 536870915, 0, 393225, 536870915, 0, 393226, 536870915, 0, 393227, 7, 0, 393228, 6, 0, 393229, 6, 0, 393230, 8, 0, 393233, 1, 0, 524282, 536870919, 0, 524283, 3, 0, 524284, 3, 0, 524285, 3, 0, 524286, 7, 0, 524287, 536870918, 0, 458752, 536870918, 0, 458753, 8, 0, 458755, 536870920, 0, 458756, 536870918, 0, 458757, 536870919, 0, 458758, 536870915, 0, 458759, 536870915, 0, 458760, 536870915, 0, 458761, 536870915, 0, 458762, 536870915, 0, 458763, 3, 0, 458764, 3, 0, 458765, 3, 0, 458766, 7, 0, 458769, 1, 0, 589818, 536870919, 0, 589819, 3, 0, 589820, 3, 0, 589821, 3, 0, 589822, 3, 0, 589823, 3, 0, 524288, 3, 0, 524289, 7, 0, 524291, 536870919, 0, 524292, 3, 0, 524293, 3, 0, 524294, 536870915, 0, 524295, 536870915, 0, 524296, 536870915, 0, 524297, 536870915, 0, 524298, 536870915, 0, 524299, 3, 0, 524300, 3, 0, 524301, 3, 0, 524302, 7, 0, 524305, 1, 0, 655354, 536870919, 0, 655355, 3, 0, 655356, 3, 0, 655357, 3, 0, 655358, 3, 0, 655359, 3, 0, 589824, 3, 0, 589825, 7, 0, 589827, 536870919, 0, 589828, 3, 0, 589829, 3, 0, 589830, 3, 0, 589831, 536870915, 0, 589832, 536870915, 0, 589833, 536870915, 0, 589834, 536870915, 0, 589835, 3, 0, 589836, 3, 0, 589837, 3, 0, 589838, 7, 0, 589841, 1, 0, 720890, 536870919, 0, 720891, 3, 0, 720892, 3, 0, 720893, 3, 0, 720894, 3, 0, 720895, 3, 0, 655360, 3, 0, 655361, 7, 0, 655363, 536870919, 0, 655364, 3, 0, 655365, 3, 0, 655366, 536870915, 0, 655367, 536870915, 0, 655368, 536870915, 0, 655369, 536870915, 0, 655370, 536870915, 0, 655371, 3, 0, 655372, 3, 0, 655373, 3, 0, 655374, 7, 0, 655377, 1, 0, 786426, 536870919, 0, 786427, 3, 0, 786428, 3, 0, 786429, 3, 0, 786430, 3, 0, 786431, 3, 0, 720896, 3, 0, 720897, 7, 0, 720899, 536870919, 0, 720900, 3, 0, 720901, 3, 0, 720902, 536870915, 0, 720903, 536870915, 0, 720904, 536870915, 0, 720905, 536870915, 0, 720906, 536870915, 0, 720907, 3, 0, 720908, 3, 0, 720909, 3, 0, 720910, 7, 0, 720913, 1, 0, 851962, 536870919, 0, 851963, 3, 0, 851964, 3, 0, 851965, 3, 0, 851966, 3, 0, 851967, 3, 0, 786432, 3, 0, 786433, 7, 0, 786435, 536870919, 0, 786436, 3, 0, 786437, 3, 0, 786438, 536870915, 0, 786439, 536870915, 0, 786440, 536870915, 0, 786441, 536870915, 0, 786442, 536870915, 0, 786443, 3, 0, 786444, 3, 0, 786445, 3, 0, 786446, 7, 0, 786449, 1, 0, 917498, 536870919, 0, 917499, 3, 0, 917500, 3, 0, 917501, 3, 0, 917502, 3, 0, 917503, 3, 0, 851968, 3, 0, 851969, 7, 0, 851971, 536870922, 0, 851972, 9, 0, 851973, 9, 0, 851974, 9, 0, 851975, 9, 0, 851976, 9, 0, 851977, 9, 0, 851978, 9, 0, 851979, 9, 0, 851980, 9, 0, 851981, 9, 0, 851982, 10, 0, 851985, 1, 0, 983034, 536870922, 0, 983035, 9, 0, 983036, 9, 0, 983037, 9, 0, 983038, 9, 0, 983039, 9, 0, 917504, 9, 0, 917505, 10, 0, 917521, 1, 0, 1048570, 1073741830, 0, 1048571, 1073741830, 0, 1048572, 1073741830, 0, 1048573, 1073741830, 0, 1048574, 1073741830, 0, 1048575, 1073741830, 0, 983040, 1073741830, 0, 983041, 1073741830, 0, 983042, 0, 0, 983043, 0, 0, 983044, 0, 0, 983045, 0, 0, 983046, 0, 0, 983047, 0, 0, 983048, 0, 0, 983049, 0, 0, 983050, 0, 0, 983051, 0, 0, 983052, 0, 0, 983053, 0, 0, 983054, 0, 0, 983055, 0, 0, 983056, 0, 0, 983057, 1, 0 )

[node name="Players" type="Node" parent="." index="2"]

[node name="Player1" parent="Players" index="0" instance=ExtResource( 3 )]

position = Vector2( 377.979, 157.408 )

[node name="Objects" type="Node2D" parent="." index="3"]

__meta__ = {
"_edit_lock_": true
}

[node name="Wall" parent="Objects" index="0" groups=[
"Button2",
"Button1",
"Button3",
] instance=ExtResource( 4 )]

position = Vector2( 463.219, 127.879 )
scale = Vector2( 1, 1.9743 )
activation = 1

[node name="Button1" parent="Objects" index="1" groups=[
"Button1",
] instance=ExtResource( 5 )]

position = Vector2( 280.002, 381.003 )

[node name="Button2" parent="Objects" index="2" groups=[
"Button2",
] instance=ExtResource( 5 )]

position = Vector2( 583.21, 953.131 )

[node name="Button3" parent="Objects" index="3" groups=[
"Button3",
] instance=ExtResource( 5 )]

position = Vector2( 860.292, 316.083 )

[node name="MovingPlatform" parent="Objects" index="4" instance=ExtResource( 6 )]

position = Vector2( 1019.99, 594.721 )
motion = Vector2( 0, 300 )
cycle = 20.0
big = 0

[node name="Endgoal" parent="." index="4" instance=ExtResource( 7 )]

position = Vector2( 672.065, 160.868 )

[node name="Event" parent="." index="5" instance=ExtResource( 8 )]

events = [ Vector2( 120, 640 ), Vector2( 840, 940 ), Vector2( 840, 290 ) ]
labels = [ "Não importa quantas vezes", "Você tente me prender aqui", "Eu vou voltar pra casa!" ]
pos = [ Vector2( 0, 85 ), Vector2( 0, 85 ), Vector2( 0, 85 ) ]


