; Engine configuration file.
; It's best edited using the editor UI and not directly,
; since the parameters that go here are not all obvious.
;
; Format:
;   [section] ; section goes between []
;   param=value ; assign values to parameters

config_version=4

_global_script_classes=[ {
"base": "Node",
"class": "Note",
"language": "GDScript",
"path": "res://Entities/Note.gd"
}, {
"base": "Node",
"class": "PlayerInput",
"language": "GDScript",
"path": "res://Entities/PlayerInput.gd"
}, {
"base": "Node",
"class": "Projectile",
"language": "GDScript",
"path": "res://Entities/Projectile.gd"
}, {
"base": "Node",
"class": "Song",
"language": "GDScript",
"path": "res://Entities/Song.gd"
} ]
_global_script_class_icons={
"Note": "",
"PlayerInput": "",
"Projectile": "",
"Song": ""
}

[application]

config/name="Star Shooter"
run/main_scene="res://Menu/Main_Menu.tscn"
config/icon="res://Assets/Star.png"

[autoload]

AUDIO="*res://Config/Audio.gd"
DISPLAY="*res://Config/Display.gd"
GLOBAL="*res://Global.gd"

[debug]

settings/fps/force_fps=60
settings/stdout/verbose_stdout=true

[display]

window/size/width=1080
window/size/height=720
window/size/resizable=false

[gdnative]

singletons=[ "res://pythonscript.gdnlib" ]

[input]

rhythm_action_1={
"deadzone": 0.5,
"events": [ Object(InputEventKey,"resource_local_to_scene":false,"resource_name":"","device":0,"alt":false,"shift":false,"control":false,"meta":false,"command":false,"pressed":false,"scancode":65,"unicode":0,"echo":false,"script":null)
 ]
}
rhythm_action_2={
"deadzone": 0.5,
"events": [ Object(InputEventKey,"resource_local_to_scene":false,"resource_name":"","device":0,"alt":false,"shift":false,"control":false,"meta":false,"command":false,"pressed":false,"scancode":83,"unicode":0,"echo":false,"script":null)
 ]
}
full_screen={
"deadzone": 0.5,
"events": [ Object(InputEventKey,"resource_local_to_scene":false,"resource_name":"","device":0,"alt":false,"shift":false,"control":false,"meta":false,"command":false,"pressed":false,"scancode":16777255,"unicode":0,"echo":false,"script":null)
 ]
}

[logging]

file_logging/enable_file_logging=true
file_logging/log_path="logs/logs.txt"

[rendering]

threads/thread_model=2
environment/default_environment="res://default_env.tres"
