<svg width="45" height="45" viewBox="0 0 45 45" version="1.1" xmlns="http://www.w3.org/2000/svg" xmlns:xlink="http://www.w3.org/1999/xlink">
<title>Rectangle</title>
<desc>Created using Figma</desc>
<g id="Canvas" transform="translate(10582 -1051)">
<rect x="-10582" y="1051" width="45" height="45" fill="#ffffff00"/>
<g id="Rectangle">
<use xlink:href="#path0_fill" transform="matrix(0.497781 -0.862182 0.86106 0.517175 -10582 1078.99)" fill="url(#paint0_linear)"/>
</g>
</g>
<defs>
<linearGradient id="paint0_linear" x1="0" y1="0" x2="1" y2="0" gradientUnits="userSpaceOnUse" gradientTransform="matrix(-28.0557 58.6087 -59.6907 -27.618 61.7007 1.20013)">
<stop offset="0" stop-color="#00A8FF"/>
<stop offset="1" stop-color="#DC3FDA"/>
</linearGradient>
<path id="path0_fill" d="M 0 0L 32.4597 0L 32.4597 32.3939L 0 32.3939L 0 0Z"/>
</defs>
</svg>
