/**** Summary of modelo 3, where the Input Shape is: 15x35x1 

_________________________________________________________________
Layer (type)                 Output Shape              Param #   
=================================================================
conv2d_13 (Conv2D)           (None, 11, 31, 4)         104       
_________________________________________________________________
batch_normalization_3 (Batch (None, 11, 31, 4)         16        
_________________________________________________________________
activation_15 (Activation)   (None, 11, 31, 4)         0         
_________________________________________________________________
conv2d_14 (Conv2D)           (None, 8, 27, 5)          405       
_________________________________________________________________
activation_16 (Activation)   (None, 8, 27, 5)          0         
_________________________________________________________________
conv2d_15 (Conv2D)           (None, 7, 23, 5)          255       
_________________________________________________________________
activation_17 (Activation)   (None, 7, 23, 5)          0         
_________________________________________________________________
conv2d_16 (Conv2D)           (None, 6, 19, 6)          306       
_________________________________________________________________
activation_18 (Activation)   (None, 6, 19, 6)          0         
_________________________________________________________________
conv2d_17 (Conv2D)           (None, 6, 16, 6)          150       
_________________________________________________________________
activation_19 (Activation)   (None, 6, 16, 6)          0         
_________________________________________________________________
max_pooling2d_3 (MaxPooling2 (None, 3, 8, 6)           0         
_________________________________________________________________
conv2d_18 (Conv2D)           (None, 2, 6, 7)           259       
_________________________________________________________________
activation_20 (Activation)   (None, 2, 6, 7)           0         
_________________________________________________________________
flatten_fpg_a2d_3 (FlattenFP (None, 84)                0         
_________________________________________________________________
dense_5 (Dense)              (None, 100)               8500      
_________________________________________________________________
dense_6 (Dense)              (None, 4)                 404       
_________________________________________________________________
activation_21 (Activation)   (None, 4)                 0         
=================================================================
Total params: 10,399
Trainable params: 10,391
Non-trainable params: 8
_________________________________________________________________


****/

