/**** Summary of modelo 5, where the Input Shape is: 15x35x1 

_________________________________________________________________
Layer (type)                 Output Shape              Param #   
=================================================================
conv2d_25 (Conv2D)           (None, 11, 31, 3)         78        
_________________________________________________________________
batch_normalization_5 (Batch (None, 11, 31, 3)         12        
_________________________________________________________________
activation_29 (Activation)   (None, 11, 31, 3)         0         
_________________________________________________________________
conv2d_26 (Conv2D)           (None, 8, 27, 4)          244       
_________________________________________________________________
activation_30 (Activation)   (None, 8, 27, 4)          0         
_________________________________________________________________
conv2d_27 (Conv2D)           (None, 7, 23, 6)          246       
_________________________________________________________________
activation_31 (Activation)   (None, 7, 23, 6)          0         
_________________________________________________________________
conv2d_28 (Conv2D)           (None, 6, 19, 7)          427       
_________________________________________________________________
activation_32 (Activation)   (None, 6, 19, 7)          0         
_________________________________________________________________
conv2d_29 (Conv2D)           (None, 6, 16, 9)          261       
_________________________________________________________________
activation_33 (Activation)   (None, 6, 16, 9)          0         
_________________________________________________________________
max_pooling2d_5 (MaxPooling2 (None, 3, 8, 9)           0         
_________________________________________________________________
conv2d_30 (Conv2D)           (None, 2, 6, 10)          550       
_________________________________________________________________
activation_34 (Activation)   (None, 2, 6, 10)          0         
_________________________________________________________________
flatten_fpg_a2d_5 (FlattenFP (None, 120)               0         
_________________________________________________________________
dense_9 (Dense)              (None, 70)                8470      
_________________________________________________________________
dense_10 (Dense)             (None, 4)                 284       
_________________________________________________________________
activation_35 (Activation)   (None, 4)                 0         
=================================================================
Total params: 10,572
Trainable params: 10,566
Non-trainable params: 6
_________________________________________________________________


****/

