/**** Summary of modelo 2, where the Input Shape is: 15x35x1 

_________________________________________________________________
Layer (type)                 Output Shape              Param #   
=================================================================
conv2d_7 (Conv2D)            (None, 11, 31, 4)         104       
_________________________________________________________________
batch_normalization_2 (Batch (None, 11, 31, 4)         16        
_________________________________________________________________
activation_8 (Activation)    (None, 11, 31, 4)         0         
_________________________________________________________________
conv2d_8 (Conv2D)            (None, 8, 27, 5)          405       
_________________________________________________________________
activation_9 (Activation)    (None, 8, 27, 5)          0         
_________________________________________________________________
conv2d_9 (Conv2D)            (None, 7, 23, 5)          255       
_________________________________________________________________
activation_10 (Activation)   (None, 7, 23, 5)          0         
_________________________________________________________________
conv2d_10 (Conv2D)           (None, 6, 19, 6)          306       
_________________________________________________________________
activation_11 (Activation)   (None, 6, 19, 6)          0         
_________________________________________________________________
conv2d_11 (Conv2D)           (None, 6, 16, 6)          150       
_________________________________________________________________
activation_12 (Activation)   (None, 6, 16, 6)          0         
_________________________________________________________________
max_pooling2d_2 (MaxPooling2 (None, 3, 8, 6)           0         
_________________________________________________________________
conv2d_12 (Conv2D)           (None, 2, 6, 7)           259       
_________________________________________________________________
activation_13 (Activation)   (None, 2, 6, 7)           0         
_________________________________________________________________
flatten_fpg_a2d_2 (FlattenFP (None, 84)                0         
_________________________________________________________________
dense_3 (Dense)              (None, 70)                5950      
_________________________________________________________________
dense_4 (Dense)              (None, 4)                 284       
_________________________________________________________________
activation_14 (Activation)   (None, 4)                 0         
=================================================================
Total params: 7,729
Trainable params: 7,721
Non-trainable params: 8
_________________________________________________________________


****/

