%YAML 1.1
%TAG !u! tag:unity3d.com,2011:
--- !u!74 &7400000
AnimationClip:
  m_ObjectHideFlags: 0
  m_CorrespondingSourceObject: {fileID: 0}
  m_PrefabInstance: {fileID: 0}
  m_PrefabAsset: {fileID: 0}
  m_Name: saltar
  serializedVersion: 6
  m_Legacy: 0
  m_Compressed: 0
  m_UseHighQualityCurve: 1
  m_RotationCurves: []
  m_CompressedRotationCurves: []
  m_EulerCurves: []
  m_PositionCurves: []
  m_ScaleCurves: []
  m_FloatCurves: []
  m_PPtrCurves:
  - curve:
    - time: 0
      value: {fileID: 21300000, guid: 9de9d36c74ff1a0449c6a96feea4ae03, type: 3}
    - time: 0.083333336
      value: {fileID: 21300000, guid: 66ceb419dfc6abd419c244793a473a11, type: 3}
    - time: 0.16666667
      value: {fileID: 21300000, guid: 529286ef51f9fd24ab35cb2181d4f0eb, type: 3}
    - time: 0.25
      value: {fileID: 21300000, guid: a8ddd15fbfb976445bb550111624a66f, type: 3}
    - time: 0.33333334
      value: {fileID: 21300000, guid: cd960d14fe8416a4fa9c919b18533da6, type: 3}
    - time: 0.41666666
      value: {fileID: 21300000, guid: 86e2eaaa41b6504408f8bb0c4a7d81a1, type: 3}
    - time: 0.5
      value: {fileID: 21300000, guid: 7d8a24c27d3601949a458f90367c6627, type: 3}
    - time: 0.5833333
      value: {fileID: 21300000, guid: 03aba495d0a7fc443a285bcfecbd3c79, type: 3}
    - time: 0.6666667
      value: {fileID: 21300000, guid: 24bd925cbfe3a4448b3ae4d57306cc42, type: 3}
    - time: 0.75
      value: {fileID: 21300000, guid: 7881e01180464fb499299781be6af6db, type: 3}
    attribute: m_Sprite
    path: 
    classID: 212
    script: {fileID: 0}
  m_SampleRate: 12
  m_WrapMode: 0
  m_Bounds:
    m_Center: {x: 0, y: 0, z: 0}
    m_Extent: {x: 0, y: 0, z: 0}
  m_ClipBindingConstant:
    genericBindings:
    - serializedVersion: 2
      path: 0
      attribute: 0
      script: {fileID: 0}
      typeID: 212
      customType: 23
      isPPtrCurve: 1
    pptrCurveMapping:
    - {fileID: 21300000, guid: 9de9d36c74ff1a0449c6a96feea4ae03, type: 3}
    - {fileID: 21300000, guid: 66ceb419dfc6abd419c244793a473a11, type: 3}
    - {fileID: 21300000, guid: 529286ef51f9fd24ab35cb2181d4f0eb, type: 3}
    - {fileID: 21300000, guid: a8ddd15fbfb976445bb550111624a66f, type: 3}
    - {fileID: 21300000, guid: cd960d14fe8416a4fa9c919b18533da6, type: 3}
    - {fileID: 21300000, guid: 86e2eaaa41b6504408f8bb0c4a7d81a1, type: 3}
    - {fileID: 21300000, guid: 7d8a24c27d3601949a458f90367c6627, type: 3}
    - {fileID: 21300000, guid: 03aba495d0a7fc443a285bcfecbd3c79, type: 3}
    - {fileID: 21300000, guid: 24bd925cbfe3a4448b3ae4d57306cc42, type: 3}
    - {fileID: 21300000, guid: 7881e01180464fb499299781be6af6db, type: 3}
  m_AnimationClipSettings:
    serializedVersion: 2
    m_AdditiveReferencePoseClip: {fileID: 0}
    m_AdditiveReferencePoseTime: 0
    m_StartTime: 0
    m_StopTime: 0.8333333
    m_OrientationOffsetY: 0
    m_Level: 0
    m_CycleOffset: 0
    m_HasAdditiveReferencePose: 0
    m_LoopTime: 1
    m_LoopBlend: 0
    m_LoopBlendOrientation: 0
    m_LoopBlendPositionY: 0
    m_LoopBlendPositionXZ: 0
    m_KeepOriginalOrientation: 0
    m_KeepOriginalPositionY: 1
    m_KeepOriginalPositionXZ: 0
    m_HeightFromFeet: 0
    m_Mirror: 0
  m_EditorCurves: []
  m_EulerEditorCurves: []
  m_HasGenericRootTransform: 0
  m_HasMotionFloatCurves: 0
  m_Events: []
