Name,Sex,WeightClassKg,BodyweightKg,BirthYear,Division,Team,Bench1Kg,Bench2Kg,Bench3Kg,Best3BenchKg,TotalKg,Place,Event,Equipment,BirthDate
Sonja Jungreitmayr,F,57.00,55.00,1978,Masters 1,ASVÖ SK Kraftwerk Untersberg Grödig,60,62.5,-65,62.5,62.5,1,B,Raw,1978-09-18
Leonie Eichinger,F,69.00,68.80,2004,Sub-Juniors,PSV Salzburg/KDK,45,-52.5,-52.5,45,45,1,B,Raw,2004-01-07
Melissa Eder,F,69.00,66.40,1994,Open,ASVÖ SK Kraftwerk Untersberg Grödig,70,75,-77.5,75,75,1,B,Raw,1994-03-17
Carina Kals,F,76.00,75.40,1996,Open,PSV Salzburg/KDK,80,85,-92.5,85,85,1,B,Raw,1996-05-18
Manuela Steiner,F,76.00,75.60,1978,Masters 1,ASVÖ SK Kraftwerk Untersberg Grödig,65,-67.5,-67.5,65,65,1,B,Raw,1978-04-23
Herwig Feichtinger,M,66.00,60.00,1977,Masters 1,PSV Salzburg/KDK,40,50,-60,50,50,1,B,Raw,1977-05-27
Matthias Winkler,M,83.00,75.20,1951,Masters 4,AK Bodyform Salzburg,85,-90,-90,85,85,1,B,Raw,1951-04-25
Rudolf Gratz,M,83.00,82.90,1962,Masters 3,AK Bodyform Salzburg,100,105,-110,105,105,1,B,Raw,1962-01-16
Alessio Dumitru,M,74.00,66.10,2007,Sub-Juniors,PSV Salzburg/KDK,55,62.5,70,70,70,1,B,Raw,2007-02-04
Marco Cavalli,M,93.00,90.20,1992,Guest,Team Supakraft KDK Klosterneuburg,107.5,112.5,115,115,115,G,B,Raw,1992-02-12
Oriol Solergibert,M,93.00,92.40,1996,Open,PSV Salzburg/KDK,145,-152.5,152.5,152.5,152.5,1,B,Raw,1996-07-17
Elmar Barang,M,93.00,90.10,1989,Guest,Team Vegan.at Wien,100,110,-115,110,110,G,B,Raw,1989-02-18
Constantin Resch,M,83.00,76.80,2000,Juniors,AK Bodyform Salzburg,90,100,-107.5,100,100,1,B,Raw,2000-01-23
Corvin Resch,M,83.00,80.90,1997,Open,AK Bodyform Salzburg,100,120,-130,120,120,2,B,Raw,1997-04-10
Nicolas Bachleitner,M,93.00,91.30,2003,Juniors,Salzburg Brutality Powerlifting,95,100,107.5,107.5,107.5,1,B,Raw,2003-06-14
Stephan Lechner,M,93.00,90.70,1984,Open,Salzburg Brutality Powerlifting,135,142.5,-150,142.5,142.5,2,B,Raw,1984-04-15
Florian Kottermeier,M,93.00,86.60,1993,Open,Salzburg Brutality Powerlifting,90,100,110,110,110,3,B,Raw,1993-04-26
Werner Strohofer,M,74.00,70.40,1951,Masters 4,PSV Salzburg/KDK,55,62.5,-67.5,62.5,62.5,1,B,Raw,1951-01-17
Enno Vogel,M,83.00,82.80,1990,Open,PSV Salzburg/KDK,150,157.5,160,160,160,1,B,Raw,1990-06-30
Thoralf Eichmair,M,74.00,72.60,1979,Masters 1,PSV Salzburg/KDK,115,120,-125,120,120,1,B,Raw,1979-07-27
Dominik Katzenmayer,M,83.00,78.10,1996,Open,ASVÖ SK Kraftwerk Untersberg Grödig,100,-107.5,-107.5,100,100,3,B,Raw,1996-06-04
Alexander Toferer,M,93.00,91.00,1978,Masters 1,PSV Salzburg/KDK,115,125,-130,125,125,1,B,Raw,1978-03-14
Jonas Farfeleder,M,105.00,103.80,2004,Sub-Juniors,PSV Salzburg/KDK,110,-120,-120,110,110,1,B,Raw,2004-03-02
Franz Huemer,M,105.00,103.60,1963,Masters 2,AK Bodyform Salzburg,155,-162.5,-163.5,155,155,1,B,Raw,1963-01-26
Christoph Toferer,M,105.00,96.80,2001,Juniors,PSV Salzburg/KDK,140,155,-170,155,155,1,B,Raw,2001-06-16
Alexander Zwickl,M,120.00,118.00,1992,Open,KSV Pinzgau,165,-170,-170,165,165,2,B,Raw,1992-07-07
Markus Mayer,M,120.00,119.90,1975,Masters 1,AK Bodyform Salzburg,150,157.5,-162.5,157.5,157.5,1,B,Raw,1975-10-01
Eric Roithner,M,120.00,110.10,2002,Juniors,PSV Salzburg/KDK,90,100,105,105,105,1,B,Raw,2002-01-08
Christoph Würflinger,M,120+,157.20,1988,Open,PSV Salzburg/KDK,190,200,-207.5,200,200,1,B,Raw,1988-07-31
Josef Schnaderbek,M,120+,124.30,1959,Masters 3,AK Bodyform Salzburg,125,132.5,-140,132.5,132.5,G,B,Raw,1959-07-14
Rene Brunner,M,105.00,104.10,1976,Masters 1,Salzburg Brutality Powerlifting,182.5,190,195,195,195,1,B,Raw,1976-07-22
Markus Glück,M,120.00,118.40,1990,Open,Salzburg Brutality Powerlifting,185,-192.5,192.5,192.5,192.5,1,B,Raw,1990-02-15
Andrej Woltschanskiy,M,120.00,109.60,1982,Masters 1,PSV Salzburg/KDK,130,135,-137.5,135,135,2,B,Raw,1982-07-10
Simon Klose,M,105.00,103.30,1990,Open,Salzburg Brutality Powerlifting,135,142.5,-147.5,142.5,142.5,1,B,Raw,1990-03-04
