,precision,recall,f1-score,support
1,1.0,0.0,0.0,69.0
2,0.35714285714285715,0.10204081632653061,0.15873015873015872,49.0
3,0.2980132450331126,0.9574468085106383,0.4545454545454546,47.0
accuracy,0.30303030303030304,0.30303030303030304,0.30303030303030304,0.30303030303030304
macro avg,0.5517187007253233,0.35316254161238964,0.20442520442520443,165.0
weighted avg,0.6091310455548866,0.30303030303030304,0.17661463116008572,165.0
