text;sentiment;urls;mentions;hashtags;reserved_words;emojis;smileys;numbers
I`d have responded, if I were going;neutral; ; ; ; ; ; ; 
Sooo SAD I will miss you here in San Diego!!!;negative; ; ; ; ; ; ; 
my boss is bullying me...;negative; ; ; ; ; ; ; 
what interview! leave me alone;negative; ; ; ; ; ; ; 
Sons of ****, why couldn`t they put them on the releases we already bought;negative; ; ; ; ; ; ; 
- some shameless plugging for the best Rangers forum on earth;neutral;http://www.dothebouncy.com/smf; ; ; ; ; ; 
am feedings for the baby are fun when he is all smiles and coos;positive; ; ; ; ; ; ;2
Soooo high;neutral; ; ; ; ; ; ; 
Both of you;neutral; ; ; ; ; ; ; 
Journey!? Wow... u just became cooler. hehe... (is that possible!?);positive; ; ; ; ; ; ; 
as much as i love to be hopeful, i reckon the chances are minimal i`m never gonna get my cake and stuff;neutral; ; ; ; ; ;=P; 
I really really like the song Love Story by Taylor Swift;positive; ; ; ; ; ; ; 
My Sharpie is running DANGERously low on ink;negative; ; ; ; ; ; ; 
i want to go to music tonight but i lost my voice.;negative; ; ; ; ; ; ; 
test test from the LG enV2;neutral; ; ; ; ; ; ; 
Uh oh, I am sunburned;negative; ; ; ; ; ; ; 
S`ok, trying to plot alternatives as we speak *sigh*;negative; ; ; ; ; ; ; 
i`ve been sick for the past few days and thus, my hair looks wierd. if i didnt have a hat on it would look...;negative;http://tinyurl.com/mnf4kw; ; ; ; ; ; 
is back home now gonna miss every one;negative; ; ; ; ; ; ; 
Hes just not that into you;neutral; ; ; ; ; ; ; 
oh Marly, I`m so sorry!! I hope you find her soon!! <3 <3;neutral; ; ; ; ; ; ; 
Playing Ghost Online is really interesting. The new updates are Kirin pet and Metamorph for third job. Can`t wait to have a dragon pet;positive; ; ; ; ; ; ; 
is cleaning the house for her family who is comming later today..;neutral; ; ; ; ; ; ; 
gotta restart my computer .. I thought Win7 was supposed to put an end to the constant rebootiness;neutral; ; ; ; ; ; ; 
SEe waT I Mean bOuT FoLL0w fRiiDaYs... It`S cALLed LoSe f0LloWeRs FridAy... smH;neutral; ; ; ; ; ; ; 
the free fillin` app on my ipod is fun, im addicted;positive; ; ; ; ; ; ; 
I`m sorry.;negative; ; ; ; ; ; ; 
On the way to Malaysia...no internet access to Twit;negative; ; ; ; ; ; ; 
"juss came backk from Berkeleyy ; omg its madd fun out there havent been out there in a minute . whassqoodd ?";positive; ; ; ; ; ; ; 
Went to sleep and there is a power cut in Noida Power back up not working too;negative; ; ; ; ; ; ; 
I`m going home now. Have you seen my new twitter design? Quite....heavenly isn`****?;positive; ; ; ; ; ; ; 
i hope unni will make the audition . fighting dahye unni !;positive; ; ; ; ; ; ; 
If it is any consolation I got my BMI tested hahaha it says I am obesed well so much for being unhappy for about minutes.;negative; ; ; ; ; ; ; 10
That`s very funny. Cute kids.;positive; ; ; ; ; ; ; 
Ahhh, I slept through the game. I`m gonna try my best to watch tomorrow though. I hope we play Army.;neutral; ; ; ; ; ; ; 
Thats it, its the end. Tears for Fears vs Eric Prydz, DJ Hero;neutral;http://bit.ly/2Hpbg4; ; ; ; ; ; 
Born and raised in NYC and living in Texas for the past years! I still miss NY;negative; ; ; ; ; ; ; 10
just in case you wonder, we are really busy today and this coming with with adding tons of new blogs and updates stay tuned;neutral; ; ; ; ; ; ; 
i`m soooooo sleeeeepy!!! the last day o` school was today....sniffle....;negative; ; ; ; ; ; ; 
A little happy for the wine jeje ok it`sm my free time so who cares, jaja i love this day;positive; ; ; ; ; ; ; 
Car not happy, big big dent in boot! Hoping theyre not going to write it off, crossing fingers and waiting;neutral; ; ; ; ; ; ; 
im an avid fan of **** magazine and i love your magazines;positive; ; ; ; ; ; ; 
MAYDAY?!;neutral; ; ; ; ; ; ; 
RATT ROCKED NASHVILLE TONITE..ONE THING SUCKED, NO ENCORE! LIKE IN THE `S THEY STILL HAVE A FUN SHOW. PEARCY HAS THAT HOTT BAD BOY LOOK;neutral; ; ; ; ; ; ; 80
I love to! But I`m only available from pm. and where dear? Would love to help convert her vids.;positive; ; ; ; ; ; ; 5
The girl in the hair salon asked me 'Shall I trim your eyebrows!' How old do I feel?;neutral; ; ; ; ; ; ; 
egh blah and boooooooooooo i dunno wanna go to work HANGOVERS SUCKKKKKK Im a drunk mess!;negative; ; ; ; ; ; ; 
:visiting my friendster and facebook;neutral; ; ; ; ; ; ; 
i donbt like to peel prawns, i also dont like going shopping, running out of money and crawling round the car looking for more;negative; ; ; ; ; ; ; 
which case? I got a new one last week and I`m not thrilled at all with mine.;negative; ; ; ; ; ; ; 
Then you should check out and connect with other tweeple who hate twitter;neutral;http://twittersucks.com; ; ; ; ; ; 
also bored at school, its my third freelesson( freistunde );neutral; ; ; ; ; ; ; 
hm... Both of us I guess...;neutral; ; ; ; ; ; ; 
it is ****...u have dissappointed me that past few days;negative; ; ; ; ; ; ; 
romance zero is funny;positive; ; ; ; ; ; ; 
I`d rather do the early run..but I am a morning runner;neutral; ; ; ; ; ; ; 
Bah a coworker ran into work late and her bag smacked into my knee it really hurts now;negative; ; ; ; ; ; ; 
will be back later.;neutral;http://plurk.com/p/rp3k7; ; ; ; ; ; 
Aw. Torn ace of hearts;negative; ; ;#Hunchback; ; ; ; 
what fun are you speaking of?;neutral; ; ; ; ; ; ; 
i lost all my friends, i`m alone and sleepy..i wanna go home;negative; ; ; ; ; ; ; 
haha yes;neutral; ; ; ; ; ; ; 
I give in to easily;negative; ; ; ; ; ; ; 
What better way to spoil mum than to let her kick back and relax over a nice meal and a bottle of her favorite wine? Our wine was a red;positive; ; ; ; ; ; ; 
mannnn..... _ got an iphone!!! im jealous....;negative;http://bit.ly/NgnaR; ; ; ; ; ; 
Is at a photoshoot.;neutral; ; ; ; ; ; ; 
He`s awesome... Have you worked with him before? He`s a good friend.;positive; ; ; ; ; ; ; 
Yay playing a show tonight! Boo it`s gonna soggy and I`m at work right before playing;neutral; ; ; ; ; ; ; 
Chilliin;positive; ; ; ; ; ; ; 
If you know such agent, do let me know;neutral; ; ; ; ; ; ; 
I still smell of smoke;neutral; ; ;#kitchenfire; ; ; ; 
a celtics-lakers rematch sounds better don`t you think? lol;positive; ; ; ; ; ; ; 
Anyone have an extra Keane ticket? I promise to buy you a drink and take rad pics for your FB / Blog / Flickr., etc;neutral; ; ; ; ; ; ; 
'you can ride one, you can catch one, but its not summer til you pop open one' ?;neutral; ; ; ; ; ; ; 
she is good! so gor-juz yea i kno i asked her yesterday when we were at tha hospital if she talked to u and she said no;neutral; ; ; ; ; ; ; 
OK - I`m out of here for now. Just popped in to say Hi and check on things. I`ll probably head to the guttah later on tonight;neutral; ; ; ; ; ; ; 
WOW, i AM REALLY MiSSiN THE FAM(iLY) TODAY. BADDD.;negative; ; ; ; ; ; ; 
My sources say no;neutral; ; ; ; ; ; ; 
I am sooo tired;negative; ; ; ; ; ; ; 
Hey, you change your twitter account, and you didn`t even tell me...;neutral; ; ; ; ; ; ; 
THANK YYYYYYYYYOOOOOOOOOOUUUUU!;positive; ; ; ; ; ; ; 
lucky kid...i so wanna see loserville pity im in oz....;positive; ; ; ; ; ; ; 
fell asleep waiting for my ride!;neutral; ; ; ; ; ; ; 
Sick. With a flu like thing.;negative; ; ; ; ; ; ; 
Still no reply from about my SimFinger problem So no iRape parody video until I get a response, sorry guys;negative; ; ; ; ; ; ; 
Happy Star Wars day everyone! and Enjoy the holiday (UK);positive; ; ; ; ; ; ; 
Miles from you I`m in Essex so give me plenty of warning so I can arrive in time to get at least one of those free beers.;neutral; ; ; ; ; ; ; 
His snoring is so annoying n it keeps me from sleeping (like right now, lol) but I honestly wud miss it if it eva left I love him.;neutral; ; ; ; ; ; ; 
i miss you bby wish you were going tomorrow to make me do good.;negative; ; ; ; ; ; ; 
Well what im working on isn`t QUITE ready to post about publicly (still beta testing) but its a cool new script I coded;positive; ; ; ; ; ; ; 
SWEEEEET - San Fran is awesome!!!! Love it there;positive; ; ; ; ; ; ; 
_Mounce yes and it lasts way past my bedtime!;neutral; ; ; ; ; ; ; 
Hi how are you doing ??? *just joined twitter...*;neutral; ; ; ; ; ; ; 
waiting for sleeping pills to kick in... gonna be so tired at work tomorrow;negative; ; ; ; ; ; ; 
eating ice cream and then getting ready for graduation.;neutral; ; ; ; ; ; ; 
Happy Mothers day to all you Mums out there;positive; ; ; ; ; ; ; 
CASEY`S GONE?!?! BUT WHY?! So, she piddled a little on the carpet. She`s prolly freaked cause it`s new. Can we get her back?;negative; ; ; ; ; ; ; 
hemp cloth is marvelous but unfortunately no;negative; ; ; ; ; ; ; 
Gonna read a story bout adam lambert online then bed. Nighty night;neutral; ; ; ; ; ; ; 
We saw that in none D - the baddie`s the best;positive; ; ; ; ; ; ; 3
am. And Im on the beach. Pretty;positive; ; ; ; ; ; ;4
Certainly not Cheers than, huh?;neutral; ; ; ; ; ; ; 
week post my'horrible, traumatic jumping cholla accident.'-cholla`s next dirty trickieces are starting to emerge from my hand! Ouch!;negative; ; ; ; ; ;:p;1
i realy wanted to go out cause its so nice but everybodys busy;negative; ; ; ; ; ; ; 
Awesome. I`m down in Ocean Beach (if you know where that is.) By the way. 'YourBiggestFan' I`m a re-al big fan of you-rs.;positive; ; ; ; ; ; ; 
at least I get to watch over time Let`s go Pens!!;neutral; ; ; ; ; ; ; 
cool i wear black most of the time when i go out;neutral; ; ; ; ; ; ; 
haha I do not know how to work blip apart from the obvious! thanks for reblipping my song have a nice day ****;positive; ; ; ; ; ; ; 
have a safe trip joshy poo.......you`ll knock them dead at your speech;positive; ; ; ; ; ; ; 
woof, I wish I was allowed to go;positive; ; ; ; ; ; ; 
if u have a friendster add me!!!!!!!!! my email adress add me loco_crime_1st.com add me leave some comment;neutral; ; ; ; ; ; ; 
has tickets.......?;neutral; ; ; ; ; ; ; 
Thank you, Afrin Nasal Spray! Also, I got a giant teacup tonight!;positive; ; ; ; ; ; ; 
ACSM. it`s unfathomable. i think the other one .. and the .. is one that should be kept to the comfort of our bedrooms. yes?;neutral; ; ; ; ; ; ; 
Aww, I love my daddy! He works days a week almost all day and still tries to go to SF with all of us;positive; ; ; ; ; ; ; 7
So many tests todayyy I don`t feel confident about anyy.;negative; ; ; ; ; ; ; 
graduation is done im a little sad.. anyone want to hang out???;negative; ; ; ; ; ; ; 
hahaa your awesomee !;positive; ; ; ; ; ; ; 
holy smokes! star trek was freaking awesomeeeee;positive; ; ; ; ; ; ; 
I hate Fallout it keeps making me jump, I`m also low on health, money, ammo and food don`t worry I`ll get through it.;neutral; ; ; ; ; ; ; 3
I had it! On my itunes, but then I lost all my songs.;neutral; ; ; ; ; ; ; 
What`s with the gloomy weather? The sun must be too tired to come out and play heading to victoria gardens for some impulse buys haha;neutral; ; ; ; ; ; ; 
Not looking forward to next week: Maths, Geography, English and French exams, totalling hours;negative; ; ; ; ; ; ; 7
Poor you Get outside and sleep in the garden, the sun will do you good. But don`t forget suncream!!!;negative; ; ; ; ; ; ; 
not well;negative; ; ; ; ; ; ; 
Not a prob hun;positive; ; ; ; ; ; ; 
at dads, watching some mtv and am going on sims2 in a minutee;neutral; ; ; ; ; ; ; 
Absolutely;neutral; ; ; ; ; ; ; 
what`s the matter chickadee?;neutral; ; ; ; ; ; ; 
hey mia! totally adore your music. when will your cd be out?;positive; ; ; ; ; ; ; 
Shopping. Cleaning. BMFing. Webcam chatting with nephews. Nothing spesh, but a good bank holiday Monday nonetheless;positive; ; ; ; ; ; ; 
you need to ask him something? Lmao I love him too;positive; ; ; ; ; ;=O; 
those splinters look very painful...but you were being very heroic saving mr. Pickle;negative; ; ; ; ; ; ; 
why are you sad?;negative; ; ; ; ; ; ; 
Nice to see you tweeting! It`s Sunday th May and we`re celebrating Mother`s Day here today. So be nice to yer Mom;positive; ; ; ; ; ; ; 10
decided trans frm relaxed natural hair but i wish my whole head looked like my roots. Age of the instant gratification....;positive; ; ; ; ; ; ; 2
Namaskar & Namaste r both the same. Marathi people say Namaskar! its a marathi word.... should i ? ...naaaah !;neutral; ; ; ; ; ; ; 
Congrats! I cuss like that in a matter of minutes, But didn`t know until now there is a reward for it.;neutral; ; ; ; ; ; ; 
Humous and Dorito`s.... Oh yes;neutral; ; ; ; ; ; ; 
missed all the awesome weather, because she was in a movie!;negative; ; ; ; ; ; ; 
Today is going to be a normal day for I hope. We had a group of pilots from a large airline come in last night so it was too much drink;neutral; ; ; ; ; ; ; 
These kids are terrible! If I was in Good Evans, I`d call Childline;negative; ; ; ; ; ; ; 
Unfortunatley, AerLingus no longer fly to Copenhagen so we`re have to fly Ryanair to Billund and drive up to Copenhagen one of the days!;negative; ; ; ; ; ; ; 
What`s sad is that I actually had to google that term. That sucks, tho.;negative; ; ; ; ; ; ; 
Hate fighting;negative; ; ; ; ; ; ; 
I watched that too!!! I didnt want her to win, but she put up a good fight..lol;neutral; ; ; ; ; ; ; 
Car-warmed Sprite tastes like sore throat;negative; ; ; ; ; ; ; 
Just came th in cross country and beat dumbo;neutral; ; ; ; ; ; ; 11
Candle wax is very enjoyable.;positive; ; ; ; ; ; ; 
She`s unassuming and unpretentious. She`s just, as. I suppose that`s why she`s so endearing--because we can relate to her;positive; ; ; ; ; ; ; 
tomorrow valeria`s lunch!!! going to get my hair done but im arraving late got my cousins babtizm or whatever you spell it;neutral; ; ; ; ; ; ; 
goooooddd morning tweets!! week three OF my workout. did i mention i got my new glasses yesterday?!?;positive; ; ; ; ; ; ; 
me too. I hate my computer so much..;negative; ; ; ; ; ; ; 
fine! Going to do my big walk today or so miles;positive; ; ; ; ; ; ; 20
I WANT RED CRUISERS!! i don`t like the other ones. LMFAO!;negative; ; ; ; ; ; ; 
Mmmmmmmm... ? it in the morning;neutral; ; ; ; ; ; ; 
me neither;neutral; ; ; ; ; ; ; 
Has about hours work to do, on a Sunday. Boo. I will find time for a two hour lunchbreak though. Yeah;neutral; ; ; ; ; ; ; 10
Bugger. forgot I still have washing in my machine;negative; ; ; ; ; ; ; 
_Laurie sending love, blessings & healing thoughts to you & family peace;positive; ; ; ; ; ; ; 
My back hurts...really bad;negative; ; ; ; ; ; ; 
ah yes, I know that feeling;neutral; ; ; ; ; ; ; 
Night of the cookers with my dad;neutral; ; ; ; ; ; ; 
My modem has been offline for a week now... God bless the g network. Tim just left... Again!! May schedule has been brutal;negative; ; ; ; ; ; ; 3
Nope I am in Coquitlam;neutral; ; ; ; ; ; ; 
Had parent teacher thing yesterday!! So boring going to skl on saturday!! lol;negative; ; ; ; ; ; ; 
sounds like fun Hope to see you and everyone else there!;positive; ; ;#tweetup; ; ; ; 
Big booming thunder storm almost here. Maybe we can all go home early??? Ah... probably not.;neutral; ; ; ; ; ; ; 
Few Bevvies day in twn..great on a day off!!;positive; ; ; ; ; ; ; 2
first night in myers. just not the same w/out lydia! but i`m actually excited about this summer!;positive; ; ; ; ; ; ; 
good morning;positive; ; ; ; ; ; ; 
its the best show EVER!;positive; ; ; ; ; ; ; 
URL in previous post (to timer job) should be . I`d removed space which messed up URL. ^ES;negative;http://bit.ly/a4Fdb; ; ; ; ; ; 
i think iv hurt my tooth and eilish and cassie are having a drawing competiton to draw cookies and pineapples haha :L .;neutral; ; ; ; ; ; ; 
I want to know when the auditions are Mander! Text or...reply please!;neutral; ; ; ; ; ; ; 
or even NOOOOO NOT THE SECRET NAMEREBECCA PLEASE;negative; ; ; ; ; ; ; 
I miss my neice can`t wait to see her bad n grown ****! Lol;negative; ; ; ; ; ; ; 
i need to get my computer fixed;neutral; ; ; ; ; ; ; 
really hopes her car`s illness is not terminal...;negative; ; ; ; ; ; ; 
All the cool people I want to find for following today are , and I guess the English don`t tweet.;neutral; ; ;#English; ; ; ; 
no sir...i woulda put honey...but i don`t have any;neutral; ; ; ; ; ; ; 
who watched X-men origins: wolverine? i totally loved it! haha;positive; ; ; ; ; ; ; 
I VOTED!!! do u have a personal myspace? i keep talking to fakes i <3 you. u helped me thru the hrdest time of my life! (: x;positive; ; ; ; ; ; ; 
I`m sad that I missed you guys last night!;negative; ; ; ; ; ; ; 
Finally got a call for marriage counseling days late....;neutral; ; ; ; ; ; ; 3
ok then;neutral; ; ; ; ; ; ; 
_420 why baby?;neutral; ; ; ; ; ; ; 
today was the last day of high school for me and i ended up going home sick! ... stupid dead rats;negative; ; ; ; ; ; ; 
We`re having an impromptu pool party... Except I don`t know how to swim so I can`t get in;neutral; ; ; ; ; ; ; 
lost my tooth day whilst i was eating gum...oww;negative; ; ; ; ; ; ; 2
happy year! <3;positive; ; ; ; ; ; ; 1
Oh, I HELLA forgot to say my official good morning Like to hear it? Here it go! Goooooooooooood Morrrrrrrrning Twitterville! Lol;positive; ; ; ; ; ; ; 
*phew* Will make a note in case anyone else runs into the same issue;neutral; ; ; ; ; ; ; 
WHAT ABOUT ME ?? I VOTE EVERY DAY FOR YOU !!!!!;negative; ; ; ; ; ; ; 
I`m starving!! This diet is killing me but I can`t eat after pm;negative; ; ; ; ; ; ; 8
i talk to you;neutral; ; ; ; ; ; ; 
im soo bored...im deffo missing my music channels;negative; ; ; ; ; ; ; 
nite nite bday girl have fun at concert;positive; ; ; ; ; ; ; 
Had nicotine replacement patch on for hours. So far, so good, but I did sleep for most of those hours. Getting a bit twitchy now;neutral; ; ; ; ; ; ; 4
_Sanderson What`s with Twatter lately? Either I can`t get on or the replies don`t turn up!;neutral; ; ; ; ; ; ; 
should be sleeping. lost my voice a couple day ago.;negative; ; ; ; ; ; ; 
- hate when my PARKED car gets hit;negative;http://twitpic.com/66xlm; ; ; ; ; ; 
I`ve heard this fall. I`m waiting too!;neutral; ; ; ; ; ; ; 
more nightmares? *huggles*;neutral; ; ; ; ; ; ; 
I AM SUCH A CREEPER I feel disappointed because of it. **** my cyberstalking skills the internet = no more privacy.;negative; ; ; ; ; ; ; 
going to bed its late and I have headache;negative; ; ; ; ; ; ; 
happy mother`s day to all moms out there...;positive; ; ; ; ; ; ; 
Grabbing coffee from then making mom breakfast;neutral; ; ; ; ; ; ; 
im thinking that im going to have fun tonight....and maybe some changes are coming;positive; ; ; ; ; ; ; 
thanks. before the major chop.;neutral; ; ; ; ; ; ; 
Haha I know, I cant handle the fame! and thank you!;positive; ; ; ; ; ; ; 
just got up and updated my ipod;neutral; ; ; ; ; ; ; 
yes! sober HAHAHA tanghaling tapat dude! haha WILD. i don`t knowwww plan plan before you go to US!;positive; ; ; ; ; ; ; 
We never miss ICarly - my son has a huge crush on Miranda;positive; ; ; ; ; ; ; 
Saw James carville in the store today. His head is really that bald;neutral; ; ; ; ; ; ; 
yellow for ?;neutral;http://blip.fm/~5z05g; ; ; ; ; ; 
which means you`re just going to have to come back to vancouver and have it our way! hahah;neutral; ; ; ; ; ; ; 
Feeling smooth like chrome;positive; ; ; ; ; ; ; 
Ew traffic;negative; ; ; ; ; ; ; 
downloading songs while trying to sneak a lil homework in too, which should be my main priority not songs lol;neutral; ; ; ; ; ; ; 
your not alone...i need coffee too.;neutral; ;@_Ra_Ra_; ; ; ; ; 
Sounds like me;neutral; ; ; ; ; ; ; 
Bad day The day you realize what mess you`ve put me through will be one of the happiest days of my life...;neutral; ; ; ; ; ; ; 
Walking to class. I hate not having a bike....especially mine.;negative; ; ; ; ; ; ; 
_nesmith;neutral; ; ; ; ; ; ; 
failed inspection. Did you know you can pass wo/oven, but not wo/anti-tip bracket, which is only sold w/oven? This is worse than taxes.;negative; ; ; ; ; ; ; 
JONAS BROTHERS - Live to party. It`s rocking so hard I love the song,;positive; ; ; ; ; ; ; 
happy mother`s day to all the mothers in the world.;positive; ; ; ; ; ; ; 
mins through the hr mins Google Wave demo, that looks a lot of fun, would love to test it though.;positive;http://bit.ly/WnMSc; ; ; ; ; ; 20
Sleepy Tabz is heading to bed. Fun night! Listened through the next episode of Joss`d!;positive; ; ; ; ; ; ; 
The exception for a short dude: Larenz fineass Tate yum;neutral; ; ; ; ; ; ; 
Screw the reviews, I thought Wolverine was awesome. But not enough Dominic Monaghan for my liking.;positive; ; ; ; ; ; ; 
If you followed us recently, PLEASE dont be offended that we haven`t followed back. We hit our limit. Hopefully we will be free soon.;positive; ; ; ; ; ; ; 
Yes i work to ...;neutral; ; ; ; ; ; ; 3
Hmmm, maybe that`s what they meant. They eluded to something brand new but you know how the media is;neutral; ; ; ; ; ; ; 
Done at the spa now meeting vic for some late lunch!;neutral; ; ; ; ; ; ; 
Happy monday up and about going to tavares today. Hope everyone has a blessed day!;positive; ; ; ; ; ; ; 
Always have wanted to go to Oz;neutral; ; ; ; ; ; ; 
Thx;neutral; ; ; ; ; ; ; 
- Cool... luv it;positive;http://twitpic.com/4jaz5; ; ; ; ; ; 
that`s why I need to be there...To represent the Blackberries;positive; ; ; ; ; ; ; 
Okay so I`m dedicating my th tweet to the fact that I`m going to the Apple store because there is a HUGE crack on the glass screen!;neutral; ; ; ; ; ; ; 300
If only we could ever actually be allowed to stay here and do that;neutral; ; ; ; ; ; ; 
Let me know how that turns out!!;neutral; ; ; ; ; ; ; 
was that sass I detect? As long as it isn`t back sass! Haha;neutral; ; ; ; ; ; ; 
yeah I was thinking about that ,ahaha;positive; ; ; ; ; ; ; 
Sports Bar Shatranjanpoli Rest Ph All Sports Bar Andheri W Dont know whether that helps. Google ki jai ho;neutral; ; ; ; ; ; ; 26733333
I`m not sleeping at all until accepts my appology;negative; ; ; ; ; ; ; 
Wolverine Was BOSS! Seriously, And Will.I.Am Was In It, What The **** ??;negative; ; ; ; ; ; ; 
I live for pain, bring it on;neutral; ; ; ; ; ; ; 
okay, i`m out for a while back later!;neutral; ; ; ; ; ; ; 
What is this powerblog challenge you keep talking about? I`m a newbie follower;neutral; ; ;#powerblog; ; ; ; 
almost died. Laptop screen was set to % brightness after I reinstalled Windows Vista. Got a headache now;positive; ; ;#insanedefaults; ; ; ; 100
Waiting for tish to get off. Got to drive my moms CRV to pick her up all my myself and duckie. First time;neutral; ; ; ; ; ; ; 
Trying to decide on a movie with the friends.. not going to well! lol No bible study nite, which means ****-day cake buy my own??;negative; ; ; ; ; ;:p; 2
going to shower because i don`t want to smell at school tomorrow;neutral; ; ; ; ; ; ; 
Sigh... you know I am...;neutral; ; ; ; ; ; ; 
discovered cause of a bug in the new build. Publishing bug fix now, hopefully new beta by tomorrow;positive; ; ;#NetPLAYER; ; ; ; 4
Here are FREE twitter tools will get you followers;neutral;http://2ve.org/xPG0/; ; ; ; ; ; 4
just got home from work.... and is chugging down a big bottle of apple juice.;neutral; ; ; ; ; ; ; 
Yes it does. Please dont` go. If you die I will cry.. which normally leads to small animals getting harmed;negative; ; ; ; ; ; ; 
writing report cards soooo tired but what an amazing day. check it out on fb soon!;positive; ; ; ; ; ; ; 
it was only once for my big brother...and I`m done now;neutral; ; ; ; ; ; ; 
good news: finally finished my workout that has been paused for hours. bad news: my resistance band is torn;neutral; ; ;#EASactive; ; ; ; 6
Well good morning all, What a wonderful day in the neighborhood Thanks for all those that are now following another this morning;positive; ; ; ; ; ; ; 60
FTSK and Mercy Mercedes were amazing tonight.. as always;positive; ; ; ; ; ; ; 
hope he is ok!;positive; ; ; ; ; ; ; 
can`t school just be done already? it hurts too much... seeing him every day;positive; ; ; ; ; ; ; 
I waited, listening to wind blowing through the tumbleweed? Are none of you old enough to know what to do when someone says 'Crackerack'?;neutral; ; ; ; ; ; ; 
Hell Yeah!;neutral; ; ; ; ; ; ; 
HIM shirt at dinner? Do you need to ask?? Does it actually have Ville on it?;neutral; ; ; ; ; ; ; 
i know!!;neutral; ; ; ; ; ; ; 
huh what the ****? Smelly? Noooo. I love alex Vixon;neutral; ; ; ; ; ; ; 
Went to a party last night. Dindin and I showed up in matching outfits ) GREAT MINDS THINK ALIKE ) Anyway, happy birthday, ate lara;positive; ; ; ; ; ; ; 
Happy b-day! Just woke up on this side of Earth, so wishes are bit late;positive; ; ; ; ; ; ; 
thank you for teaching me values and to be a better person each day I LOVE SO MUCH, YOU`RE THE BEST MUM IN THE WORLD;positive; ; ; ; ; ; ; 
HAPPY MOTHERS DAY.!;positive; ; ; ; ; ; ; 
*laughs* I`m glad that you have self confidence - it`s a wonderful trait to have I`ll applaud extra loud for it, okay?;positive; ; ; ; ; ; ; 
Thanks;positive; ; ; ; ; ; ; 
twittering after days!;neutral; ; ; ; ; ; ; 2
Getting ready for week Its too nice today to be stuck inside working!;positive; ; ; ; ; ; ; 
I am tres depressed;negative; ; ; ; ; ; ; 
"Felt like ****, behaved like my son; ate to compensate. Pigged out on home-roasted sugar almonds. Painful tum, threw up, still feel sick.";negative; ; ; ; ; ; ; 
Happy Mothers Day people. i love my mom a lot still;positive; ; ; ; ; ; ; 
I`m sorry to hear that.;negative; ; ; ; ; ; ; 
That`s awesome dude, yay for surprise celebrities! I got to meet him a few years ago, he was soooo friendly.;positive; ; ; ; ; ; ; 
it makes me happy to hear a girl talk, or tweet, about the nba. but... could you give my nuggets some love?!;positive; ; ; ; ; ; ; 
Is getting the hang of Twitter.;neutral; ; ; ; ; ; ; 
You know your neck is jacked up when you are forced to pay for parking bc you can`t turn you head to parallel park in the free spaces...;negative; ; ; ; ; ; ; 
I want it BACK NOW!:;neutral;http://bit.ly/PP1WZ; ; ; ; ; ; 
Going to miss my roomie ... We will no longer be roomies starting tomorrow;negative; ; ; ; ; ; ; 
bathing with two little angels, Keyla and Janice.;neutral; ; ; ; ; ; ; 
Yep, finished, chocked full of spelling and grammatical errors, but I`m cleaning it up tomorrow and popping it up hehe;negative; ; ; ; ; ; ; 
HAHAHHA lol true that! i always remember my BD but i can never remember what date or even day it is;neutral; ; ; ; ; ; ; 
Family is here,hanging with them;neutral; ; ; ; ; ; ; 
Watching Ellen Love her!! then doing the dishes and tanning ...it`s gorgeous out!;positive; ; ; ; ; ; ; 
what`s goin on hun? I`m worried about you;negative; ; ; ; ; ; ; 
Im not bannished... but I am at work till;negative; ; ; ; ; ; ; 6
Morning! If I get to see it, I`ll let you know. Right now, I`m going to go see Wolverine.;neutral; ; ; ; ; ; ; 
red top tabloids, build em up, knock em down;neutral; ; ; ; ; ; ; 
tonight in party w/ my girls (minus vita);positive; ; ; ; ; ; ; 
why not now you made me sad I thought you`d be jumping for joy;neutral; ; ; ; ; ; ; 
Simple my a;neutral; ;@;#; ; ; ; 
The pics I just uploaded are the baby pics of my cats. Missy is now an adult and a pretty little kitty, but Batty is in kitten heaven now;neutral; ; ; ; ; ; ; 
I saw the play of it here, it was amazing;positive; ; ; ; ; ; ; 
_ i am glad to break my twitter virginity with you two.;positive; ; ; ; ; ; ; 
Dinner with the fam... I have missed them;negative; ; ; ; ; ; ; 
_Live That`s what I want. More the better. Bound to be a few bad eggs though, but they will soon learn.;neutral; ; ; ; ; ; ; 
Hell yeah Kellynn got a Twitter. Finally.;neutral; ; ; ; ; ; ; 
I know It was worth a shot, though!;positive; ; ; ; ; ; ; 
Just opened a facebook account, I`m a little confused I don`t really get it. Twitter seems much better;positive; ; ; ; ; ; ; 
Ship. I`m stuck.;negative; ; ; ; ; ; ; 
DUSTBIN BABY ON AT Cannot wait x;positive; ; ; ; ; ; ; 11.30
Not going to dwell on it. It happened, it`s passed. Just a shame as he was so supportive! Such is life! x;negative; ; ; ; ; ; ; 
It looks like the office TV DOES get MLB Network... and it looks like MLBN will NOT be televising the DET/BAL game today;neutral; ; ;#wieters; ; ; ; 
Home empty handed. No comics found today. I shall now indulge in my cupcakes from Magnolia Bakery.;neutral; ; ; ; ; ; ; 
Laying in bed til workkk... Oh the life. Definitely pinched a nerve.;negative; ; ; ; ; ; ; 
today is a busy day. exhausting!;negative; ; ; ; ; ; ; 
I was going to go on Sunday, but now I`ve got too much going on that weekend;neutral; ; ; ; ; ; ; 
Sorry to hear ur flight got cancelled that blows!!!;negative; ; ; ; ; ; ; 
ohh my tooth is hurts ohh im sad it very hurts;negative; ; ; ; ; ; ; 
Before I get too distracted, I`d like to thank my new followers for taking the trouble to follow me! And to my others: feelin the love;positive; ; ; ; ; ; ; 
u think u have bills Ha!Ii just finished paying mine that`s y I`m broke;negative; ; ; ; ; ; ; 
Not sure it didn`t say it was big. I jst saw the pics of u on ur last bday. You looked so pretty!! I miss you!!;neutral; ; ; ; ; ; ; 2
sore throat. Planning the TET outing to Marwell though...good times;neutral; ; ; ; ; ; ; 
mcfly gig last nightt omg it was amazin didnt sit down through the whole thing mcfly did you see me and ma best mate we were in tutus;positive; ; ; ; ; ; ; 
days without sleep and now a migraine. I thought life postR01 was meant to be relaxing;negative; ; ; ; ; ; ;2
There!;neutral; ; ; ; ; ; ; 
?sucks!?..;negative; ; ; ; ; ; ; 
whens the sway sway winner announced?;neutral; ; ; ; ; ; ; 
K will check it out...;neutral; ; ; ; ; ; ; 
doing pretty well, up and wide awake;positive; ; ; ; ; ; ; 
i want to wake up early, and get a coffee tomorrow (today) ! it`s going to be a busyy day! but have to keep writing.. booo whoo!;neutral; ; ; ; ; ; ; 
I Miss Daddy and Mommy;negative; ; ; ; ; ; ; 
My dog is officially depressed that my brother`s dogs are gone. He doesn`t want to go outside and when we did, he play half-heartedly.;negative; ; ; ; ; ; ; 
I just realized that I can`t forward text msgs with my iPhone.;neutral; ; ; ; ; ; ; 
My frist post... Off to find a new car for my parents, exciting!;positive; ; ; ; ; ; ; 
Argh noo! Missed The Killers on Wossy! That sucks! Missed out on Brandon. Total failure! Anyone know if it`s repeated? Must investigate!;negative; ; ; ; ; ; ; 
seriously bored without anyone to talk to... but not tired enough for sleep;negative; ; ; ; ; ; ; 
I am lost. Please help me find a good home.;negative; ; ; ; ; ; ; 
It`s a Peter & Gordon morning -> And I, go to pieces and I wanna hide / Go to pieces and I almost die / Ever... ?;neutral;http://blip.fm/~5yk38; ; ; ; ; ; 
Ok so I`ve now got a bit of a bad back after lifting all drum hardware into my car downer.;negative; ; ; ; ; ; ; 
LMAO... Smh! that one threw me off.;neutral; ; ; ; ; ; ; 
oh nice going!;positive; ; ; ; ; ; ; 
Is getting ready for work... Working all weekend;neutral; ; ; ; ; ; ; 
Gonna celebrate Mothers Day with the family but gonna start the partying tonite;positive; ; ; ; ; ; ; 
i agree with you!;positive; ; ; ; ; ; ; 
I only do computers. Am hopeless at everything else;negative; ; ; ; ; ; ; 
degrees, gross skies, and thunderstorms...perfect match for my mood lol;positive; ; ; ; ; ; ;90
_2nd aww thanks!;positive; ; ; ; ; ; ; 
Sorry RB is on PS3 for me;negative; ; ; ; ; ; ; 
I saw amazing heeels. But they were too big;neutral; ; ; ; ; ; ; 
I just stuck my finger down my throat and there are a bunch of bumps on my tongue & throat.;negative; ; ; ; ; ; ; 
dang last url went down ?;negative;http://blip.fm/~7aigm; ; ; ; ; ; 
ohoh i missed all ur tweets im gonna have to stay awake all night to see the announcement now, **** time difference;negative; ; ; ; ; ; ; 
Damnit all. That sucks. You were one of the ones I thought I`d drag back lol;negative; ; ; ; ; ; ; 
my boss. She`s moving to NYC;neutral; ; ; ; ; ; ; 
this is sooo crazy i have fever..;negative; ; ; ; ; ; ; 
is spending her Saturday morning taking notes for a research essay because some stupid **** recalled the book I`m using. Not fair;negative; ; ; ; ; ; ; 
I think i need some new friends;neutral; ; ; ; ; ; ; 
Looking forward to your gig in Ireland!!! See ya there!;neutral; ; ; ; ; ; ; 
Please Review Sunehre Ad Placement;positive;http://tinyurl.com/oow6mk; ; ; ; ; ; 
aww you loooove me;positive; ; ; ; ; ; ; 
is hungry, twitter. i want food. </3;neutral; ; ; ; ; ; ; 
awesome lucky you;positive; ; ; ; ; ; ; 
yea, i should know.. but tell me EVERYTHING! ps: send me direct messages telling.. haha;neutral; ; ; ; ; ; ; 
haha im jewish, i love that one;positive; ; ; ; ; ; ; 
had a great time out in the beer garden wit the boyos !! I think the sun got to me a bit though, feel a bit ill !!;neutral; ; ; ; ; ; ; 
l`m on days too matt. No fun this weekend.;negative; ; ; ; ; ; ; 3
u really don`t think so? maybe ur right....lol. btw what phone u using? think u told me b4...i might have an app for u;neutral; ; ; ; ; ; ; 
I feel your pain. Mine is the same way;negative; ; ; ; ; ; ; 
comes home in two days;neutral; ; ; ; ; ; ; 
Sadly no. It didn`t come with one...;negative; ; ; ; ; ; ; 
Cant wait to see my boy tomorrow;positive; ; ; ; ; ; ; 
ehhh no. just a check up. I have a dentist app next week though. getting my molar pulled/root canal.;neutral; ; ; ; ; ; ; 
aww I miss driving down elmwood;negative; ; ; ; ; ; ; 
Omg Wango Tango was **** AWSOME! I love my baby for taking me;positive; ; ; ; ; ; ; 
Version of our live, interactive Trans-Siberian ticket planner is launched: - its very cool;positive;http://tinyurl.com/c5ljwm; ; ; ; ; ; 2
_30439 I really wish I could go!;positive; ; ; ; ; ; ; 
yeah real hard, but I know you`ll get by with it... smile;neutral; ; ; ; ; ; ; 
I`m in december that`s not good at all next big birthday is after it flys by for sure;negative; ; ; ; ; ; ; 21
This has made my night!! Way too funny!!;positive; ; ; ; ; ; ; 
Woo CAVS. Happy Mother`s Day!;positive; ; ; ; ; ; ; 
I make that same face when I get home and your mom is watching soaps.;neutral; ; ; ; ; ; ; 
I have to go to work now.;neutral; ; ; ; ; ; ; 
I can`t believe you went and got boba without me.;neutral; ; ; ; ; ; ; 
And to you too, how are you today?;neutral; ; ; ; ; ; ; 
Thanks for the warm welcome! We didn`t make plans because our arrival time was so up in the air.;positive; ; ; ; ; ; ; 
days and counting;neutral; ; ; ; ; ; ;19
sorry friends - I`m swamped with deadlines right now and we have family visiting to boot! No charades for me.;negative; ; ; ; ; ; ; 
BRAINFREEZE;neutral; ; ; ; ; ; ; 
Just discovered a shortcoming of Gravity. When you use Twitpic (integrated) it doesn`t subtract the pic URL from the character limit;neutral; ; ; ; ; ; ; 140
My sunburn is peeling,;negative; ; ; ; ; ; ; 
perky purple nail polish isn`t as perky when its chipped;neutral; ; ; ; ; ; ; 
- before they put a CAMERA in the smokers pit. i can no longer vandalize that door, without being caught.;neutral;http://twitpic.com/4sx96; ; ; ; ; ; 
Laying ALONE!! Since Mook`s soo comfy in his f`n play pen. I thought it was ill at first now I don`t have no one to cuddle with...;negative; ; ; ; ; ; ; 
I hate the dentist;negative; ; ; ; ; ; ; 
nothing aimed at you, just joining in...sorry;negative; ; ; ; ; ; ; 
I`m taking a twitter break. Cell is dying;negative; ; ; ; ; ; ; 
qood morninq;neutral; ; ; ; ; ; ; 
writing my english original writing storyyyyy. and listening to `a little respect` by erasure aaaaaah.;neutral; ; ; ; ; ; ; 
needs more followers;neutral; ; ; ; ; ; ; 
I wish I could get my nails done stupid job;negative; ; ; ; ; ; ; 
The little wormy from labyrinth sadly passed away today but its ok as hes still around in a happy ghost form aww;neutral;http://twitpic.com/67aim; ; ; ; ; ; 
the 'no pants' idea could be the new attempt world-wide to attract business back to the airlines.;neutral; ; ; ; ; ; ; 
Have a good one;positive; ; ; ; ; ; ; 
yep infact she is popular, miss india , talented film actress .... and lot more;positive; ; ; ; ; ; ; 99
Dosen`t Want To Go To Work Tomorrow;negative; ; ; ; ; ; ; 
Daniel has won DSDS. His voice is great.;positive; ; ; ; ; ; ; 
[-O] i wish the birthday massacre would come to australia i think they said they`re thinking about it tho..;neutral;http://tinyurl.com/p6lfch; ; ; ; ; ; 
was hoping to go to Red Lobster this weekend;neutral; ; ; ; ; ; ; 
_x_ATL u mean jack barakat`s?! wow so have u ever gone to his house? Hehe i mean ur ssoo lucky to have the address!;positive; ; ; ; ; ; ; 
I sure do hope it becomes :20 this afternoon ...;positive; ; ; ; ; ; ; 4
it means that you are now FAMOUS. Congrats!;positive; ; ; ; ; ; ; 
My phone passed away yesterday.. He jumped off the table Searching for a new phone...;negative; ; ; ; ; ; ; 
I have such fantastic friends, including several ones met through here! thanks for being in my life - you are such amazing people!;positive; ; ; ; ; ; ; 
tamlyn wishes she was as cool as my sock draw;positive; ; ; ; ; ; ; 
so no rice or crusty bread with the chili .... aawww;neutral; ; ; ; ; ; ; 
We are of like minds this evening , my dear!;neutral; ; ; ; ; ; ; 
come and save me from my packing please?!;neutral; ; ; ; ; ; ; 
Yes, I love tea. If that makes me typically English then so be it;positive; ; ; ; ; ; ; 
a mouth for sure;positive; ; ; ; ; ; ; 
_dec0de I finally just have hour of history... at pm! but I went to my highschool at am to make some homework with a friend;neutral; ; ; ; ; ; ; 8.00
pancakes!! with lemon and sugar thanks!;positive; ; ; ; ; ; ; 
Si, no bueno I guess I just don`t entertain him :/;negative; ; ; ; ; ; ; 
I`m so hunrgy right now and these heels kill me I can hardly walk in them;negative; ; ; ; ; ; ; 
both electronic keys stopped working. there is no keyhole! cant get in my car. so much for technology;negative; ; ; ; ; ; ; 
Yay, three followers! Good to know more than one person in this big wide world likes fishies.;positive; ; ; ; ; ; ; 
'my name is Tony!!!!!! ...not hey!!!!' - poor tony;negative; ; ; ; ; ; ; 
Goodmorning;positive; ; ; ; ; ; ; 
Took a shift tomorrow. I don`t really feel like working right now.;negative; ; ; ; ; ; ; 
I love mine, too . happy mothers day to your mom , John Taylor . much love to you, too .;positive; ; ; ; ; ; ; 
Saw a black snake in the garden. Went back for a picture and it was gone;neutral; ; ; ; ; ; ; 
- We bought Ludi her own rug. Dogs are the best;positive;http://twitpic.com/4wukt; ; ; ; ; ; 
No waterfront anymore faccia luna and clarendon will have to do;negative; ; ; ; ; ; ; 
loves her mum very much! Happy Mothers Day to all the wonderful mothers out there;positive; ; ; ; ; ; ; 
Slipped up and caught the flu feeling like poop!;negative; ; ; ; ; ; ; 
i have an urge to play wow but i have to wait weeks til im at my dads! +47DAYS TIL MCFLY, im so excited (L);positive; ; ; ; ; ; ; 5
Ok ... the passengers ... no one is alive ... they`re all dead ... you just don`t know it til the end ... then you cry ...;negative; ; ; ; ; ; ; 
Discovered and are sharing on G reader with me and didn`t even know it. Sigh.... I`m such a G reader newb.;neutral; ; ; ; ; ; ; 
is chilled out tonite, so cannot spew venom or write funny. Seems like these are the only styles she has;neutral; ; ; ; ; ; ; 2
If u do, please pray me. Lord knows I need it.;neutral; ; ; ; ; ; ; 4
aaaaaw i want to live in the USA;neutral; ; ; ; ; ; ; 
Morning tweeple;positive; ; ; ; ; ; ; 
Hey, I didn`t get any !!!;neutral; ; ; ; ; ; ; 
Now you only have hours to sleep... - Rest if you need it.;positive; ; ; ; ; ; ; 2
That makes my day so much better, it`s been a rough one. Did I mention I love the new photo!;neutral; ; ; ; ; ; ; 
I don`t want to sit at home on prom night. Someone hang out with me;negative; ; ; ; ; ; ; 
Is heading home from foot surgery and wishing she had a boyfriend to come over and cuddle with;positive; ; ; ; ; ; ; 
concert tonight chackin out and not coming tomorrow!;neutral; ; ; ; ; ; ; 
what happened? I thought you were coming back today....;neutral; ; ; ; ; ; ; 
lol dammit well then next time then;negative; ; ; ; ; ; ; 
lol. just don`t ever forget me;positive; ; ; ; ; ; ; 
Still jealous;negative; ; ; ; ; ; ; 
- Me at Forever Ethan couldn`t be there;negative;http://twitpic.com/67qv3; ; ; ; ; ; 21
NOW IM SAD BUT IM NOT GIVING IN FIRST..I DIDNT DO NOTHING!!!! :**-(;negative; ; ; ; ; ; ; 
this week of mine was not easy! but finally it`s over! (:;negative; ; ; ; ; ; ; 
Wow what a beautiful picture... and by the way....I am straight....just wanted to let you know!!! Bella;positive; ; ; ; ; ; ; 
In Arch. Drawing. Checking out MVCC`s CAD degree. Looks good to me;positive; ; ; ; ; ; ; 
'there are people and then there are pencils' some are sharp, some are not and some can be sharpened my pencil philosophy.....;neutral; ; ; ; ; ; ; 
just about to go home. I`m usually `mr. positive` but this has been one of those daze. well, mins until tomorrow!;neutral; ; ; ; ; ; ; 15
but you always have lee. Let`s go to Paris;neutral; ; ; ; ; ; ; 
you know you want to come keep me company whilst mum`s at her friends for the night it`s such a nice evening!;positive; ; ; ; ; ; ; 
cooking with my dad having lots of fun in the kitchen together;positive; ; ; ; ; ; ; 
Bouncing Rush makes me feel nauseous;negative; ; ; ; ; ; ; 
Off to Woolsery this morning to (hopefully) see North Molton U16 clinch the North Devon League title. Lovely day for it;positive; ; ; ; ; ; ; 
playing singstar without my fave duetter;negative; ; ; ; ; ; ; 
you`re missing out, bb! i`m such a cereal nut, i think i like every kind available.;positive; ; ; ; ; ; ; 
That`s just weird... Oh, and what was it you were drawing for me?;negative; ; ; ; ; ;:\; 
Just woke up mums singing to her new gn`r cd replacement i bought because im a good daughter;positive; ; ; ; ; ;:o; 
The birds are out,, oh man... That`s NOT cool && I didn`t sleep yet for the night!!!;negative; ; ; ; ; ; ; 
miles down, only to go. Thats ok, u2 on the radio alwas helps.;positive; ; ; ; ; ; ; 1750
My Street Fighter IV skills are lacking, can`t beat Seth on easy.;negative; ; ; ; ; ; ; 
FIL with cool people like me;positive; ; ; ; ; ; ; 461
Good Morning!!! Work and then it`s ESPN`s Sunday night Baseball. hopefully it won`t get rained out;positive; ; ; ; ; ; ; 
i think it`s under a honeymoon by the good life -- either that or it`s under a honey moon by joseph arthur.;neutral; ; ; ; ; ; ; 
my son got stung by a bug for the first time his little finger is slightly swollen.;negative; ; ; ; ; ; ; 
it was hours ago i came in.... and it`s only now i realised when i went to buy something online;neutral; ; ; ; ; ; ; 
oh just referring to our lil exchange on LJ with regards to twitter archive postings.;neutral; ; ; ; ; ; ; 
Bumping dj opus in the drunk in the car. lmao. Don`t act like u don`t know.;negative; ; ; ; ; ; ; 
Why kiss the feet of the people who kick you when you can be anything that you want to? morning everyone! Hope you have the best day ever;positive; ; ; ; ; ; ; 
Here`s a brief preview: OMG James is creepy in that role! I`m scared of him;negative;http://bit.ly/eHCfP; ; ; ; ; ; 
I`m missing crab legs and attending my going away instead!;negative; ; ; ; ; ; ; 
Hicks are mean!;negative; ; ; ; ; ; ; 
gettn ready to take a trip to Jersey my dad`s not doing so good, he needs a new heart~whoeva see`s this please say a prayer for my dad;negative; ; ; ; ; ; ; 
back soon, need to run to the shops and cut the grass;neutral; ; ; ; ; ; ; 
I`m up. I have a plan to transform my bedroom today. Random.;neutral; ; ; ; ; ; ; 
Home until tomorrow. Did my running and spinning. Now time for chiropractor, laundry, shopping, and visiting family. Missing nathan;negative; ; ; ; ; ; ; 
thats another sponsor;neutral; ; ; ; ; ; ; 
And most of us are going to be stuck in an office, some without windows;negative; ; ; ; ; ; ; 
No it`s not sad. Should make you proud;negative; ; ; ; ; ; ; 
Sorry, we`ll try to keep it down.;negative; ; ; ; ; ; ; 
is home alone.. Doing hw;neutral; ; ; ; ; ; ; 
According to , a quarter of families under six live in poverty.;negative; ; ; ; ; ; ; 
the plan to not spend money is not going well;negative; ; ; ; ; ; ; 
uploading all my bamboozle pictures of facebook;neutral; ; ; ; ; ; ; 
congratulations ! you guys finish a month early than we do. booo;positive; ; ; ; ; ; ; 
actually, I wish I was back in Tahoe. I miss it there.;negative; ; ; ; ; ; ; 
Woke Up,I Wanna Stay In My bed;neutral; ; ; ; ; ; ; 
