,precision,recall,f1-score,support
1,0.45161290322580644,0.4057971014492754,0.42748091603053434,69.0
2,0.29545454545454547,0.2653061224489796,0.2795698924731183,49.0
3,0.3220338983050847,0.40425531914893614,0.3584905660377358,47.0
accuracy,0.36363636363636365,0.36363636363636365,0.36363636363636365,0.36363636363636365
macro avg,0.35636711566181223,0.3584528476823971,0.3551804581804628,165.0
weighted avg,0.3683282198193476,0.36363636363636365,0.36390402752159545,165.0
