,precision,recall,f1-score,support
1,0.44516129032258067,1.0,0.6160714285714286,69.0
2,1.0,0.08163265306122448,0.15094339622641506,49.0
3,0.5,0.06382978723404255,0.11320754716981131,47.0
accuracy,0.46060606060606063,0.46060606060606063,0.46060606060606063,0.46060606060606063
macro avg,0.6483870967741936,0.3818208134317557,0.29340745732255163,165.0
weighted avg,0.6255522971652004,0.46060606060606063,0.33470248305153966,165.0
