time;algorithm;balanced_accuracy
Sun Jul 17 20:45:48 2022;SVC;0.49981225916206756
Sun Jul 17 20:45:48 2022;MLP;0.3818208134317557
Sun Jul 17 20:45:48 2022;11-NN;0.3584528476823971
Sun Jul 17 20:45:49 2022;RandomForest;0.44059733051407424
Sun Jul 17 20:45:52 2022;GaussianProcessClassifier;0.3333333333333333
Sun Jul 17 20:45:52 2022;GaussianNB;0.35316254161238964
Sun Jul 17 20:45:58 2022;GradientBoostingClassifier;0.44985851263107773