<svg width="40" height="32" viewBox="0 0 40 32" fill="none" xmlns="http://www.w3.org/2000/svg">
<path d="M13.0001 21.9999C12.8507 21.9999 12.7013 22.0218 12.5588 22.0681C11.7488 22.3312 10.8969 22.4999 10.0001 22.4999C9.1032 22.4999 8.25133 22.3312 7.44071 22.0681C7.29821 22.0218 7.14946 21.9999 7.00008 21.9999C3.12134 21.9999 -0.020524 25.1549 0.000100967 29.0387C0.00885095 30.6799 1.35822 31.9999 3.00009 31.9999H17.0001C18.6419 31.9999 19.9913 30.6799 20.0001 29.0387C20.0207 25.1549 16.8788 21.9999 13.0001 21.9999ZM10.0001 20C13.3138 20 16.0001 17.3137 16.0001 14C16.0001 10.6862 13.3138 7.99998 10.0001 7.99998C6.68633 7.99998 4.00009 10.6862 4.00009 14C4.00009 17.3137 6.68633 20 10.0001 20ZM37 0H13.0001C11.3457 0 10.0001 1.39062 10.0001 3.09937V5.99998C11.4638 5.99998 12.8188 6.42373 14.0001 7.11248V3.99999H36V21.9999H32V18H24V21.9999H19.2351C20.4288 23.0431 21.305 24.4206 21.7157 25.9999H37C38.6544 25.9999 40 24.6093 40 22.9006V3.09937C40 1.39062 38.6544 0 37 0Z" fill="white"/>
</svg>
