{
    "defaultSeverity": "error",
    "extends": [
        "tslint:recommended"
    ],
    "jsRules": {},
    "rules": {
        "interface-name": [ true, "never-prefix" ],
        "member-access": [
            false
        ],
        "ordered-imports": [
            false
        ],
        "no-console": [
            false
        ],
        "no-var-requires": false
    },
    "rulesDirectory": []
}
