{
    "storage_asset_presets": [
        {
            "key": "thumbnail",
            "fit": "contain",
            "width": "200",
            "height": "150",
            "quality": 80,
            "withoutEnlargement": true
        },
        {
            "key": "thumbnail-vertically",
            "fit": "contain",
            "width": "150",
            "height": "200",
            "quality": 80,
            "withoutEnlargement": true
        },
        {
            "key": "fullurl",
            "fit": "contain",
            "width": "1407",
            "height": "1052",
            "quality": 100
        },
        {
            "key": "fullurl-vertically",
            "fit": "contain",
            "width": "1052",
            "height": "1407",
            "quality": 100
        }
    ]
}