[
    {
        "bookmark": null,
        "role": null,
        "collection": "admins",
        "search": null,
        "filters": null,
        "layout": "tabular",
        "layout_query": {
            "tabular": {
                "page": 1
            }
        },
        "layout_options": null,
        "refresh_interval": null
    },
    {
        "bookmark": null,
        "role": null,
        "collection": "catalogs",
        "search": null,
        "filters": [
            {
                "key": "hide-archived",
                "field": "status",
                "operator": "neq",
                "value": "archived",
                "locked": true
            }
        ],
        "layout": "tabular",
        "layout_query": {
            "tabular": {
                "fields": [
                    "title",
                    "order_start_time",
                    "order_stop_time",
                    "status"
                ],
                "page": 1,
                "sort": "sort"
            }
        },
        "layout_options": {
            "tabular": {
                "widths": {
                    "title": 225.03131103515625,
                    "order_start_time": 137.45770263671875,
                    "order_stop_time": 136.602783203125,
                    "status": 106.060791015625
                }
            }
        },
        "refresh_interval": null
    },
    {
        "bookmark": null,
        "role": null,
        "collection": "products",
        "search": null,
        "filters": [
            {
                "key": "hide-archived",
                "field": "status",
                "operator": "neq",
                "value": "archived",
                "locked": true
            }
        ],
        "layout": "tabular",
        "layout_query": {
            "tabular": {
                "page": 1,
                "sort": "sort",
                "fields": [
                    "image",
                    "title",
                    "catalogs",
                    "prices",
                    "subtitle",
                    "status",
                    "state"
                ]
            }
        },
        "layout_options": {
            "tabular": {
                "widths": {
                    "status": 109.44729614257812,
                    "image": 113.5592041015625,
                    "title": 194.11865234375,
                    "catalogs": 108.27899169921875,
                    "prices": 95.1446533203125,
                    "subtitle": 211.947998046875
                }
            }
        },
        "refresh_interval": null
    }
]