[
    {
        "collection": "order_units",
        "field": "order",
        "related_collection": "orders",
        "schema": {
            "table": "order_units",
            "column": "order",
            "foreign_key_table": "orders",
            "foreign_key_column": "id",
            "on_update": "NO ACTION",
            "on_delete": "NO ACTION",
            "constraint_name": null
        },
        "meta": {
            "many_collection": "order_units",
            "many_field": "order",
            "one_collection": "orders",
            "one_field": "units",
            "one_collection_field": null,
            "one_allowed_collections": null,
            "junction_field": null,
            "sort_field": null,
            "one_deselect_action": "nullify"
        }
    },
    {
        "collection": "order_units",
        "field": "product",
        "related_collection": "products",
        "schema": {
            "table": "order_units",
            "column": "product",
            "foreign_key_table": "products",
            "foreign_key_column": "id",
            "on_update": "NO ACTION",
            "on_delete": "SET NULL",
            "constraint_name": null
        },
        "meta": {
            "many_collection": "order_units",
            "many_field": "product",
            "one_collection": "products",
            "one_field": null,
            "one_collection_field": null,
            "one_allowed_collections": null,
            "junction_field": null,
            "sort_field": null,
            "one_deselect_action": "nullify"
        }
    }
]