{
  "collection": "cart_items",
  "fields": {
    "id": {
      "field": "id",
      "datatype": "INT",
      "unique": false,
      "primary_key": true,
      "auto_increment": true,
      "default_value": null,
      "note": "",
      "signed": false,
      "type": "integer",
      "sort": 0,
      "interface": "primary-key",
      "hidden_detail": true,
      "hidden_browse": true,
      "required": true,
      "options": null,
      "locked": 0,
      "translation": null,
      "readonly": false,
      "width": "full",
      "validation": null,
      "group": null,
      "length": "10"
    },
    "created_on": {
      "field": "created_on",
      "datatype": "DATETIME",
      "unique": false,
      "primary_key": false,
      "auto_increment": false,
      "default_value": null,
      "note": "",
      "signed": true,
      "type": "datetime_created",
      "sort": 0,
      "interface": "datetime-created",
      "hidden_detail": true,
      "hidden_browse": true,
      "required": false,
      "options": null,
      "locked": 0,
      "translation": null,
      "readonly": true,
      "width": "full",
      "validation": null,
      "group": null,
      "length": null
    },
    "modified_on": {
      "field": "modified_on",
      "datatype": "DATETIME",
      "unique": false,
      "primary_key": false,
      "auto_increment": false,
      "default_value": null,
      "note": "",
      "signed": true,
      "type": "datetime_updated",
      "sort": 0,
      "interface": "datetime-updated",
      "hidden_detail": true,
      "hidden_browse": true,
      "required": false,
      "options": null,
      "locked": 0,
      "translation": null,
      "readonly": true,
      "width": "full",
      "validation": null,
      "group": null,
      "length": null
    },
    "cart_id": {
      "field": "cart_id",
      "datatype": "INT",
      "unique": false,
      "primary_key": false,
      "auto_increment": false,
      "default_value": null,
      "note": "",
      "signed": false,
      "type": "m2o",
      "sort": null,
      "interface": "many-to-one",
      "hidden_detail": false,
      "hidden_browse": false,
      "required": true,
      "options": {
        "placeholder": "Select one",
        "threshold": 20
      },
      "locked": 0,
      "translation": null,
      "readonly": false,
      "width": "full",
      "validation": null,
      "group": null,
      "length": "10"
    },
    "item_id": {
      "field": "item_id",
      "datatype": "INT",
      "unique": false,
      "primary_key": false,
      "auto_increment": false,
      "default_value": null,
      "note": "",
      "signed": false,
      "type": "m2o",
      "sort": null,
      "interface": "many-to-one",
      "hidden_detail": false,
      "hidden_browse": false,
      "required": true,
      "options": {
        "placeholder": "Select one",
        "threshold": 20
      },
      "locked": 0,
      "translation": null,
      "readonly": false,
      "width": "full",
      "validation": null,
      "group": null,
      "length": "10"
    }
  }
}