{
  "host": "localhost",
  "port": 3030,
  "public": "../public/",
  "paginate": {
    "default": 10,
    "max": 50
  },
  "authentication": {
    "entity": null,
    "service": null,
    "secret": "Y21sjuGjBiLDtz+6DCXD8Go3NM0=",
    "authStrategies": [
      "jwt",
      "natadecoco"
    ],
    "jwtOptions": {
      "header": {
        "typ": "access"
      },
      "audience": "serverapp",
      "issuer": "serverapp",
      "algorithm": "HS256",
      "expiresIn": "1d"
    },
    "natadecoco": {
      "tokenField": "token"
    }
  }
}
