<svg width="512" height="512" viewBox="0 0 512 512" fill="none" xmlns="http://www.w3.org/2000/svg">
<rect width="512" height="512" fill="#FFCE22"/>
<rect width="512" height="256" fill="#2137FC"/>
</svg>
