{
    "bottom_outside": {
        "start": [0, 16.6],
        "parts": []
    },
    "bottom_inside": {
        "start": [0, 17],
        "parts": [
            [5.7, 0],
            [4.2, 3],
            [5.1, 2],
            [4.85, 3],
            [2.1, 0, 2],
            [1, 3, 2],
            [2.1, 2],
            [4.85, 3],
            [26.9, 0],
            [4.85, 1],
            [2.1, 2, 2],
            [1, 1, 2],
            [2.1, 0],
            [4.85, 1],
            [5.1, 2],
            [4.2, 1],
            [5.7, 0]
        ]
    },
    "top_outside": {
        "start": [0, 19.3],
        "parts": [
            [5.4, 0],
            [3.4, 1],
            [5.1, 2],
            [9.8, 1],
            [27.5, 0],
            [9.8, 3],
            [5.1, 2],
            [3.4, 3],
            [5.4, 0]
        ]
    },
    "top_inside": {
        "start": [0, 18.9],
        "parts": [
            [5.7, 0],
            [4.2, 1],
            [5.1, 2],
            [9, 1],
            [12.9, 0],
            [4, 3, 2],
            [1, 0, 2],
            [4, 1],
            [12.9, 0],
            [9, 3],
            [5.1, 2],
            [4.2, 3],
            [5.7, 0]
        ]
    },
    "bl_corner": {
        "start": [3.3, 11.1],
        "parts": [
            [2, 0, 2],
            [4, 3, 2],
            [1, 2, 2],
            [3, 1, 2],
            [2, 2, 2],
            [1, 1, 2],
            [1, 0, 2]
        ]
    },
    "br_corner": {
        "start": [24.5, 11.1],
        "parts": [
            [1, 0, 2],
            [1, 3, 2],
            [2, 2, 2],
            [3, 3, 2],
            [1, 2, 2],
            [4, 1, 2],
            [2, 0, 2]
        ]
    },
    "bl_edge": {
        "start": [8.5, 7],
        "parts": [
            [2, 3, 2],
            [3, 0, 2],
            [1, 3, 2],
            [9, 2, 2],
            [1, 1, 2],
            [5, 0, 2],
            [3, 1, 2],
            [1, 0, 2],
            [1, 3, 2]
        ]
    },
    "br_edge": {
        "start": [20.5, 7],
        "parts": [
            [2, 3, 2],
            [5, 0, 2],
            [1, 3, 2],
            [9, 2, 2],
            [1, 1, 2],
            [3, 0, 2],
            [3, 1, 2],
            [1, 0, 2],
            [1, 3, 2]
        ]
    },
    "bc_edge": {
        "start": [14.5, 8],
        "parts": [
            [3, 0, 2],
            [1, 3, 2],
            [3, 2, 2],
            [3, 3, 2],
            [1, 2, 2],
            [3, 1, 2],
            [3, 2, 2],
            [1, 1, 2],
            [4, 0, 2]
        ]
    },
    "bml_edge": {
        "start": [9.5, 11],
        "parts": [
            [2, 0, 2],
            [1, 3, 2],
            [4, 2, 2],
            [1, 1, 2],
            [2, 0, 2]
        ]
    },
    "bmr_edge": {
        "start": [18.5, 11],
        "parts": [
            [2, 0, 2],
            [1, 3, 2],
            [4, 2, 2],
            [1, 1, 2],
            [2, 0, 2]
        ]
    },
    "bcc_edge": {
        "start": [14.5, 14],
        "parts": [
            [3, 0, 2],
            [1, 3, 2],
            [3, 2, 2],
            [3, 3, 2],
            [1, 2, 2],
            [3, 1, 2],
            [3, 2, 2],
            [1, 1, 2],
            [4, 0, 2]
        ]
    },
    "cl_edge": {
        "start": [8.5, 16],
        "parts": [
            [3, 3, 2],
            [1, 2, 2],
            [4, 1, 2],
            [1, 0, 2],
            [1, 3, 2]
        ]
    },
    "cr_edge": {
        "start": [20.5, 16],
        "parts": [
            [3, 3, 2],
            [1, 2, 2],
            [4, 1, 2],
            [1, 0, 2],
            [1, 3, 2]
        ]
    },
    "mh_outside": {
        "start": [15, 20],
        "parts": [
            [2.5, 0, 100],
            [4, 3, 100],
            [7, 2, 100],
            [4, 1, 100],
            [2.5, 0, 100]
        ]
    },
    "mh_inside": {
        "start": [15, 19.6],
        "parts": [
            [2.1, 0, 100],
            [3.2, 3, 100],
            [6.2, 2, 100],
            [3.2, 1, 100],
            [2.1, 0, 100]
        ]
    },
    "tl_edge": {
        "start": [8.5, 25],
        "parts": [
            [2, 3, 2],
            [3, 0, 2],
            [1, 3, 2],
            [3, 2, 2],
            [3, 3, 2],
            [1, 2, 2],
            [7, 1, 2],
            [1, 0, 2],
            [1, 3, 2]
        ]
    },
    "tr_edge": {
        "start": [19.5, 25],
        "parts": [
            [2, 3, 2],
            [3, 2, 2],
            [1, 3, 2],
            [3, 0, 2],
            [3, 3, 2],
            [1, 0, 2],
            [7, 1, 2],
            [1, 2, 2],
            [1, 3, 2]
        ]
    },
    "tc_edge": {
        "start": [14.5, 26],
        "parts": [
            [3, 0, 2],
            [1, 3, 2],
            [3, 2, 2],
            [3, 3, 2],
            [1, 2, 2],
            [3, 1, 2],
            [3, 2, 2],
            [1, 1, 2],
            [4, 0, 2]
        ]
    },
    "tfl_edge": {
        "start": [4.5, 26],
        "parts": [
            [1, 0, 2],
            [1, 3, 2],
            [3, 2, 2],
            [1, 1, 2],
            [2, 0, 2]
        ]
    },
    "tfr_edge": {
        "start": [24.5, 26],
        "parts": [
            [1, 0, 2],
            [1, 3, 2],
            [3, 2, 2],
            [1, 1, 2],
            [2, 0, 2]
        ]
    },
    "tfl_box": {
        "start": [4.5, 30],
        "parts": [
            [1, 0, 2],
            [2, 3, 2],
            [3, 2, 2],
            [2, 1, 2],
            [2, 0, 2]
        ]
    },
    "tl_box": {
        "start": [9.5, 30],
        "parts": [
            [2, 0, 2],
            [2, 3, 2],
            [4, 2, 2],
            [2, 1, 2],
            [2, 0, 2]
        ]
    },
    "tr_box": {
        "start": [18.5, 30],
        "parts": [
            [2, 0, 2],
            [2, 3, 2],
            [4, 2, 2],
            [2, 1, 2],
            [2, 0, 2]
        ]
    },
    "tfr_box": {
        "start": [24.5, 30],
        "parts": [
            [1, 0, 2],
            [2, 3, 2],
            [3, 2, 2],
            [2, 1, 2],
            [2, 0, 2]
        ]
    }
}
