<svg width="24" height="25" viewBox="0 0 24 25" fill="none" xmlns="http://www.w3.org/2000/svg">
<path d="M17.51 4.85984L15.73 3.08984L5.84003 12.9898L15.74 22.8898L17.51 21.1198L9.38003 12.9898L17.51 4.85984Z" fill="#0B0D17"/>
</svg>
