
{
    "tehran_metro_mobile_app"           : "اپلیکیشن موبایل مترو تهران",
    "tehran_metro"                      : "متروی تهران",
    "present_app"                       : "Present your app in beautiful way with Kane.",
    "available_app_on"                  : "Available on App Store and Play Store",
    "dl_app"                            : "دریافت اپلیکیشن",
    "amazing_features"                  : "Amazing Features",
    "features_details"                  : "List your app features and all the details Lorem ipsum dolor kadr",
    "left_detail_1"                     : "Responsive Design",
    "left_desc_1"                       : "Lorem ipsum dolor sit amet, ed do eiusmod tempor incididunt ut labore et dolore magna.",
    "left_detail_2"                     : "Bootstrap 3.1",
    "left_desc_2"                       : "Lorem ipsum dolor sit amet, ed do eiusmod tempor incididunt ut labore et dolore magna.",
    "left_detail_3"                     : "Cross-Browser Support",
    "left_desc_3"                       : "Lorem ipsum dolor sit amet, ed do eiusmod tempor incididunt ut labore et dolore magn.",
    "right_detail_1"                    : "360+ Icon Fonts",
    "right_desc_1"                      : " Lorem ipsum dolor sit amet, ed do eiusmod tempor incididunt ut labore et dolore magna.",
    "right_detail_2"                    : "Creative Design",
    "right_desc_2"                      : "Lorem ipsum dolor sit amet, ed do eiusmod tempor incididunt ut labore et dolore magna.",
    "right_detail_3"                    : "More Features",
    "right_desc_3"                      : "Lorem ipsum dolor sit amet, ed do eiusmod tempor incididunt ut labore et dolore magna.",
    "dl_app_on"                         : "دانلود کنید از",
    "app_store"                         : "App Store",
    "play_store"                        : "Play Store"
}
