{
    "rebate" : {
        "1"   :  "1" ,
        "3"   :  "90",
        "6"   :  "85" ,
        "12"  :  "80"
    },

    "service" : {
        "0" : {
            "name" : "web",
            "regionCount" : {
                "1" : {
                    "price" : "50"
                },
                "2" : {
                    "price" : "70"
                },
                "3" : {
                    "price" : "90"
                },
                "4" : {
                    "price" : "110"
                },
                "5" : {
                    "price" : "130"
                },
                "6" : {
                    "price" : "150"
                },
                "7" : {
                    "price" : "170"
                },
                "8" : {
                    "price" : "190"
                },
                "9" : {
                    "price" : "210"
                },
                "10" : {
                    "price" : "225"
                },
                "11" : {
                    "price" : "240"
                },
                "12" : {
                    "price" : "255"
                },
                "13" : {
                    "price" : "270"
                },
                "14" : {
                    "price" : "285"
                },
                "15" : {
                    "price" : "300"
                },
                "16" : {
                    "price" : "315"
                },
                "17" : {
                    "price" : "330"
                },
                "18" : {
                    "price" : "345"
                },
                "19" : {
                    "price" : "360"
                },
                "20" : {
                    "price" : "375"
                },
                "21" : {
                    "price" : "385"
                },
                "22" : {
                    "price" : "395"
                },
                "23" : {
                    "price" : "405"
                },
                "24" : {
                    "price" : "415"
                },
                "25" : {
                    "price" : "425"
                }
            }
        },

        "1" : {
            "name" : "android",
            "regionCount" : {
                "1" : {
                    "price" : "50"
                },
                "2" : {
                    "price" : "70"
                },
                "3" : {
                    "price" : "90"
                },
                "4" : {
                    "price" : "110"
                },
                "5" : {
                    "price" : "130"
                },
                "6" : {
                    "price" : "150"
                },
                "7" : {
                    "price" : "170"
                },
                "8" : {
                    "price" : "190"
                },
                "9" : {
                    "price" : "210"
                },
                "10" : {
                    "price" : "225"
                },
                "11" : {
                    "price" : "240"
                },
                "12" : {
                    "price" : "255"
                },
                "13" : {
                    "price" : "270"
                },
                "14" : {
                    "price" : "285"
                },
                "15" : {
                    "price" : "300"
                },
                "16" : {
                    "price" : "315"
                },
                "17" : {
                    "price" : "330"
                },
                "18" : {
                    "price" : "345"
                },
                "19" : {
                    "price" : "360"
                },
                "20" : {
                    "price" : "375"
                },
                "21" : {
                    "price" : "385"
                },
                "22" : {
                    "price" : "395"
                },
                "23" : {
                    "price" : "405"
                },
                "24" : {
                    "price" : "415"
                },
                "25" : {
                    "price" : "425"
                }
            }
        },

        "2" : {
            "name" : "android_web",
            "regionCount" : {
                "1" : {
                    "price" : "65"
                },
                "2" : {
                    "price" : "85"
                },
                "3" : {
                    "price" : "105"
                },
                "4" : {
                    "price" : "125"
                },
                "5" : {
                    "price" : "145"
                },
                "6" : {
                    "price" : "165"
                },
                "7" : {
                    "price" : "185"
                },
                "8" : {
                    "price" : "205"
                },
                "9" : {
                    "price" : "225"
                },
                "10" : {
                    "price" : "240"
                },
                "11" : {
                    "price" : "255"
                },
                "12" : {
                    "price" : "270"
                },
                "13" : {
                    "price" : "285"
                },
                "14" : {
                    "price" : "300"
                },
                "15" : {
                    "price" : "315"
                },
                "16" : {
                    "price" : "330"
                },
                "17" : {
                    "price" : "345"
                },
                "18" : {
                    "price" : "360"
                },
                "19" : {
                    "price" : "375"
                },
                "20" : {
                    "price" : "390"
                },
                "21" : {
                    "price" : "400"
                },
                "22" : {
                    "price" : "410"
                },
                "23" : {
                    "price" : "420"
                },
                "24" : {
                    "price" : "430"
                },
                "25" : {
                    "price" : "440"
                }
            }
        }
    }

} 