<svg xmlns="http://www.w3.org/2000/svg" width="160" height="142" viewBox="0 0 160 142">
  <g id="Group_41" data-name="Group 41" transform="translate(1543 -617)">
    <g id="Ellipse_14" data-name="Ellipse 14" transform="translate(-1510 627)" fill="#fff" stroke="#54ce79" stroke-width="5">
      <ellipse cx="48.5" cy="49" rx="48.5" ry="49" stroke="none"/>
      <ellipse cx="48.5" cy="49" rx="46" ry="46.5" fill="none"/>
    </g>
    <text id="_" data-name="$" transform="translate(-1461.614 693.399)" fill="none" stroke="#54ce79" stroke-width="2" font-size="46" font-family="Roboto-Bold, Roboto" font-weight="700"><tspan x="-13.196" y="0">$</tspan></text>
    <g id="Ellipse_16" data-name="Ellipse 16" transform="translate(-1543 617)" fill="#fff" stroke="#54ce79" stroke-width="3">
      <circle cx="26" cy="26" r="26" stroke="none"/>
      <circle cx="26" cy="26" r="24.5" fill="none"/>
    </g>
    <g id="Ellipse_18" data-name="Ellipse 18" transform="translate(-1487 707)" fill="#fff" stroke="#54ce79" stroke-width="3">
      <circle cx="26" cy="26" r="26" stroke="none"/>
      <circle cx="26" cy="26" r="24.5" fill="none"/>
    </g>
    <g id="Ellipse_17" data-name="Ellipse 17" transform="translate(-1435 617)" fill="#fff" stroke="#54ce79" stroke-width="3">
      <circle cx="26" cy="26" r="26" stroke="none"/>
      <circle cx="26" cy="26" r="24.5" fill="none"/>
    </g>
    <g id="Group_40" data-name="Group 40" transform="translate(-1418.952 635.176)">
      <path id="ic_payment_24px" d="M20.4,4H4.045A2,2,0,0,0,2.01,5.988L2,17.916A2.01,2.01,0,0,0,4.045,19.9H20.4a2.01,2.01,0,0,0,2.045-1.988V5.988A2.01,2.01,0,0,0,20.4,4Zm0,13.916H4.045V11.952H20.4Zm0-9.94H4.045V5.988H20.4Z" transform="translate(-2 -4)" fill="#54ce79"/>
      <circle id="Ellipse_19" data-name="Ellipse 19" cx="0.909" cy="0.909" r="0.909" transform="translate(12.781 10.614)" fill="#a5b0b7"/>
      <circle id="Ellipse_20" data-name="Ellipse 20" cx="0.909" cy="0.909" r="0.909" transform="translate(15.52 10.614)" fill="#a5b0b7"/>
    </g>
    <path id="ic_store_mall_directory_24px" d="M22.312,4H4.136V6.556H22.312Zm1.136,12.78V14.224l-1.136-6.39H4.136L3,14.224V16.78H4.136v7.668H15.5V16.78H20.04v7.668h2.272V16.78ZM13.224,21.892H6.408V16.78h6.816Z" transform="translate(-1474.661 718.873)" fill="#54ce79"/>
    <path id="ic_phonelink_24px" d="M3.408,5.988H18.744V4H3.408A1.868,1.868,0,0,0,1.7,5.988V16.922H0V19.9H11.928V16.922H3.408ZM19.6,7.976H14.484a.934.934,0,0,0-.852.994v9.94a.934.934,0,0,0,.852.994H19.6a.934.934,0,0,0,.852-.994V8.97A.934.934,0,0,0,19.6,7.976Zm-.852,8.946H15.336V9.964h3.408Z" transform="translate(-1527.096 631.176)" fill="#54ce79"/>
  </g>
</svg>
