<svg xmlns="http://www.w3.org/2000/svg" width="142.947" height="148.543" viewBox="0 0 142.947 148.543">
  <path id="ic_alarm_24px" d="M139.4,29.4,107.8,1.86,98.939,12.775l31.6,27.536ZM42.4,12.775,33.6,1.86,2,29.325l8.863,10.915L42.4,12.775Zm31.74,32.886H63.832v42.8l32.634,20.331,5.153-8.774L74.137,83.112ZM70.7,17.126c-34.145,0-61.832,28.749-61.832,64.2s27.618,64.2,61.832,64.2c34.145,0,61.832-28.749,61.832-64.2S104.847,17.126,70.7,17.126Zm0,114.139c-26.588,0-48.092-22.328-48.092-49.936S44.114,31.393,70.7,31.393s48.092,22.328,48.092,49.936S97.29,131.265,70.7,131.265Z" transform="translate(0.772 1.011)" fill="none" stroke="#54ce79" stroke-width="4"/>
</svg>
