{
    "BlockItems": {
        "millennium_0": {
            "ports": [
                {
                    "name": "complete",
                    "orientation": 0
                }
            ],
            "pos": [
                -411.0,
                -291.0
            ]
        },
        "millennium_1": {
            "ports": [
                {
                    "name": "startup",
                    "orientation": 2
                },
                {
                    "name": "complete",
                    "orientation": 0
                }
            ],
            "pos": [
                -284.0,
                -290.0
            ]
        },
        "millennium_1,millennium_0,complete,startup,SubscriptionConnection": {},
        "millennium_2": {
            "ports": [
                {
                    "name": "startup",
                    "orientation": 2
                },
                {
                    "name": "complete",
                    "orientation": 0
                }
            ],
            "pos": [
                -155.0,
                -291.0
            ]
        },
        "millennium_2,millennium_1,complete,startup,SubscriptionConnection": {},
        "millennium_3": {
            "ports": [
                {
                    "name": "startup",
                    "orientation": 2
                },
                {
                    "name": "complete",
                    "orientation": 0
                }
            ],
            "pos": [
                -9.0,
                -287.0
            ]
        },
        "millennium_3,millennium_2,complete,startup,SubscriptionConnection": {},
        "millennium_4": {
            "ports": [
                {
                    "name": "startup",
                    "orientation": 2
                },
                {
                    "name": "complete",
                    "orientation": 0
                }
            ],
            "pos": [
                128.0,
                -290.0
            ]
        },
        "millennium_4,millennium_3,complete,startup,SubscriptionConnection": {},
        "millennium_5": {
            "ports": [
                {
                    "name": "startup",
                    "orientation": 2
                },
                {
                    "name": "complete",
                    "orientation": 0
                }
            ],
            "pos": [
                256.0,
                -286.0
            ]
        },
        "millennium_5,millennium_4,complete,startup,SubscriptionConnection": {},
        "millennium_6": {
            "ports": [
                {
                    "name": "startup",
                    "orientation": 2
                },
                {
                    "name": "complete",
                    "orientation": 0
                }
            ],
            "pos": [
                389.0,
                -288.0
            ]
        },
        "millennium_6,millennium_5,complete,startup,SubscriptionConnection": {},
        "millennium_7": {
            "ports": [
                {
                    "name": "startup",
                    "orientation": 2
                },
                {
                    "name": "complete",
                    "orientation": 0
                }
            ],
            "pos": [
                523.0,
                -287.0
            ]
        },
        "millennium_7,millennium_6,complete,startup,SubscriptionConnection": {},
        "millennium_8": {
            "ports": [
                {
                    "name": "startup",
                    "orientation": 2
                },
                {
                    "name": "complete",
                    "orientation": 0
                }
            ],
            "pos": [
                648.0,
                -286.0
            ]
        },
        "millennium_8,millennium_7,complete,startup,SubscriptionConnection": {},
        "millennium_9": {
            "ports": [
                {
                    "name": "startup",
                    "orientation": 2
                }
            ],
            "pos": [
                764.0,
                -286.0
            ]
        },
        "millennium_9,millennium_8,complete,startup,SubscriptionConnection": {}
    },
    "TaskViews": []
}
