{
    "BlockItems": {
        "<group>,Cowtime_9,complete,complete,RequiresPort": {
            "orientation": 0,
            "pos": [
                -617.6770833333334,
                77.5
            ]
        },
        "<group>,Cowtime_9,complete,complete,SubscriptionConnection": {},
        "Cowtime_0": {
            "ports": [
                {
                    "name": "startup",
                    "orientation": 2
                },
                {
                    "name": "complete",
                    "orientation": 0
                }
            ],
            "pos": [
                -527.6770833333334,
                -66.94791666666666
            ]
        },
        "Cowtime_0,<group>,startup,startup,ProvidesPort": {
            "orientation": 0,
            "pos": [
                -623.6770833333334,
                -50.44791666666666
            ]
        },
        "Cowtime_0,<group>,startup,startup,SubscriptionConnection": {},
        "Cowtime_1": {
            "ports": [
                {
                    "name": "startup",
                    "orientation": 2
                },
                {
                    "name": "complete",
                    "orientation": 0
                }
            ],
            "pos": [
                -420.67708333333337,
                -66.94791666666666
            ]
        },
        "Cowtime_1,Cowtime_0,complete,startup,SubscriptionConnection": {},
        "Cowtime_2": {
            "ports": [
                {
                    "name": "startup",
                    "orientation": 2
                },
                {
                    "name": "complete",
                    "orientation": 0
                }
            ],
            "pos": [
                -311.67708333333337,
                -67.94791666666666
            ]
        },
        "Cowtime_2,Cowtime_1,complete,startup,SubscriptionConnection": {},
        "Cowtime_3": {
            "ports": [
                {
                    "name": "startup",
                    "orientation": 2
                },
                {
                    "name": "complete",
                    "orientation": 0
                }
            ],
            "pos": [
                -204.67708333333334,
                -69.94791666666666
            ]
        },
        "Cowtime_3,Cowtime_2,complete,startup,SubscriptionConnection": {},
        "Cowtime_4": {
            "ports": [
                {
                    "name": "startup",
                    "orientation": 2
                },
                {
                    "name": "complete",
                    "orientation": 0
                }
            ],
            "pos": [
                -83.67708333333334,
                -70.94791666666666
            ]
        },
        "Cowtime_4,Cowtime_3,complete,startup,SubscriptionConnection": {},
        "Cowtime_5": {
            "ports": [
                {
                    "name": "startup",
                    "orientation": 0
                },
                {
                    "name": "complete",
                    "orientation": 2
                }
            ],
            "pos": [
                -80.67708333333334,
                38.05208333333334
            ]
        },
        "Cowtime_5,Cowtime_4,complete,startup,SubscriptionConnection": {},
        "Cowtime_6": {
            "ports": [
                {
                    "name": "startup",
                    "orientation": 0
                },
                {
                    "name": "complete",
                    "orientation": 2
                }
            ],
            "pos": [
                -187.67708333333334,
                39.05208333333334
            ]
        },
        "Cowtime_6,Cowtime_5,complete,startup,SubscriptionConnection": {},
        "Cowtime_7": {
            "ports": [
                {
                    "name": "complete",
                    "orientation": 2
                },
                {
                    "name": "startup",
                    "orientation": 0
                }
            ],
            "pos": [
                -302.67708333333337,
                39.05208333333334
            ]
        },
        "Cowtime_7,Cowtime_6,complete,startup,SubscriptionConnection": {},
        "Cowtime_8": {
            "ports": [
                {
                    "name": "startup",
                    "orientation": 0
                },
                {
                    "name": "complete",
                    "orientation": 2
                }
            ],
            "pos": [
                -420.67708333333337,
                40.05208333333334
            ]
        },
        "Cowtime_8,Cowtime_7,complete,startup,SubscriptionConnection": {},
        "Cowtime_9": {
            "ports": [
                {
                    "name": "startup",
                    "orientation": 0
                },
                {
                    "name": "complete",
                    "orientation": 2
                }
            ],
            "pos": [
                -530.6770833333334,
                41.05208333333334
            ]
        },
        "Cowtime_9,Cowtime_8,complete,startup,SubscriptionConnection": {}
    },
    "TaskViews": []
}
