{
    "BlockItems": {
        "<group>,century_9,complete,complete,RequiresPort": {
            "orientation": 2,
            "pos": [
                158.5,
                -267.5
            ]
        },
        "<group>,century_9,complete,complete,SubscriptionConnection": {},
        "century_0": {
            "ports": [
                {
                    "name": "startup",
                    "orientation": 2
                },
                {
                    "name": "complete",
                    "orientation": 0
                }
            ],
            "pos": [
                -954.0,
                -275.0
            ]
        },
        "century_0,<group>,startup,startup,ProvidesPort": {
            "orientation": 0,
            "pos": [
                -1035.5,
                -259.5
            ]
        },
        "century_0,<group>,startup,startup,SubscriptionConnection": {},
        "century_1": {
            "ports": [
                {
                    "name": "startup",
                    "orientation": 2
                },
                {
                    "name": "complete",
                    "orientation": 0
                }
            ],
            "pos": [
                -841.0,
                -276.0
            ]
        },
        "century_1,century_0,complete,startup,SubscriptionConnection": {},
        "century_2": {
            "ports": [
                {
                    "name": "startup",
                    "orientation": 2
                },
                {
                    "name": "complete",
                    "orientation": 0
                }
            ],
            "pos": [
                -732.0,
                -274.0
            ]
        },
        "century_2,century_1,complete,startup,SubscriptionConnection": {},
        "century_3": {
            "ports": [
                {
                    "name": "startup",
                    "orientation": 2
                },
                {
                    "name": "complete",
                    "orientation": 0
                }
            ],
            "pos": [
                -620.0,
                -275.0
            ]
        },
        "century_3,century_2,complete,startup,SubscriptionConnection": {},
        "century_4": {
            "ports": [
                {
                    "name": "startup",
                    "orientation": 2
                },
                {
                    "name": "complete",
                    "orientation": 0
                }
            ],
            "pos": [
                -506.0,
                -276.0
            ]
        },
        "century_4,century_3,complete,startup,SubscriptionConnection": {},
        "century_5": {
            "ports": [
                {
                    "name": "startup",
                    "orientation": 2
                },
                {
                    "name": "complete",
                    "orientation": 0
                }
            ],
            "pos": [
                -393.0,
                -279.0
            ]
        },
        "century_5,century_4,complete,startup,SubscriptionConnection": {},
        "century_6": {
            "ports": [
                {
                    "name": "startup",
                    "orientation": 2
                },
                {
                    "name": "complete",
                    "orientation": 0
                }
            ],
            "pos": [
                -279.0,
                -282.0
            ]
        },
        "century_6,century_5,complete,startup,SubscriptionConnection": {},
        "century_7": {
            "ports": [
                {
                    "name": "startup",
                    "orientation": 2
                },
                {
                    "name": "complete",
                    "orientation": 0
                }
            ],
            "pos": [
                -167.0,
                -282.0
            ]
        },
        "century_7,century_6,complete,startup,SubscriptionConnection": {},
        "century_8": {
            "ports": [
                {
                    "name": "startup",
                    "orientation": 2
                },
                {
                    "name": "complete",
                    "orientation": 0
                }
            ],
            "pos": [
                -53.0,
                -282.0
            ]
        },
        "century_8,century_7,complete,startup,SubscriptionConnection": {},
        "century_9": {
            "ports": [
                {
                    "name": "complete",
                    "orientation": 0
                },
                {
                    "name": "startup",
                    "orientation": 2
                }
            ],
            "pos": [
                58.0,
                -284.0
            ]
        },
        "century_9,century_8,complete,startup,SubscriptionConnection": {}
    },
    "TaskViews": []
}
