<svg width="64" height="64" viewBox="0 0 64 64" fill="none" xmlns="http://www.w3.org/2000/svg">
<g filter="url(#filter0_d_927_4070)">
<path d="M32.0638 9.6665C20.0805 9.6665 10.3665 19.3669 10.3665 31.3332C10.3665 43.2995 20.0805 52.9998 32.0638 52.9998C44.047 52.9998 53.7611 43.2995 53.7611 31.3332C53.7611 19.3669 44.047 9.6665 32.0638 9.6665ZM37.2033 24.6391H33.9419C33.5555 24.6391 33.126 25.1469 33.126 25.8217V28.1734H37.2056L36.5886 31.5273H33.126V41.5955H29.277V31.5273H25.7851V28.1734H29.277V26.2009C29.277 23.3707 31.2433 21.0708 33.9419 21.0708H37.2033V24.6391Z" fill="#3598DC"/>
</g>
<defs>
<filter id="filter0_d_927_4070" x="0.366455" y="0.666504" width="63.3945" height="63.3335" filterUnits="userSpaceOnUse" color-interpolation-filters="sRGB">
<feFlood flood-opacity="0" result="BackgroundImageFix"/>
<feColorMatrix in="SourceAlpha" type="matrix" values="0 0 0 0 0 0 0 0 0 0 0 0 0 0 0 0 0 0 127 0" result="hardAlpha"/>
<feOffset dy="1"/>
<feGaussianBlur stdDeviation="5"/>
<feComposite in2="hardAlpha" operator="out"/>
<feColorMatrix type="matrix" values="0 0 0 0 0 0 0 0 0 0 0 0 0 0 0 0 0 0 0.25 0"/>
<feBlend mode="normal" in2="BackgroundImageFix" result="effect1_dropShadow_927_4070"/>
<feBlend mode="normal" in="SourceGraphic" in2="effect1_dropShadow_927_4070" result="shape"/>
</filter>
</defs>
</svg>
