<svg width="43" height="43" viewBox="0 0 43 43" fill="none" xmlns="http://www.w3.org/2000/svg">
<path d="M32.2498 3.58337H10.7498C8.779 3.58337 7.1665 5.19587 7.1665 7.16671V35.8334C7.1665 37.8042 8.779 39.4167 10.7498 39.4167H32.2498C34.2207 39.4167 35.8332 37.8042 35.8332 35.8334V7.16671C35.8332 5.19587 34.2207 3.58337 32.2498 3.58337ZM10.7498 7.16671H19.7082V21.5L15.229 18.8125L10.7498 21.5V7.16671Z" fill="black" fill-opacity="0.54"/>
</svg>
