
     Program PWSCF v.6.1 (gpu tag v1.0) starts on  6Sep2018 at 16: 8:24 

     This program is part of the open-source Quantum ESPRESSO suite
     for quantum simulation of materials; please cite
         "P. Giannozzi et al., J. Phys.:Condens. Matter 21 395502 (2009);
          URL http://www.quantum-espresso.org", 
     in publications or presentations arising from this work. More details at
     http://www.quantum-espresso.org/quote

     Parallel version (MPI & OpenMP), running on       4 processor cores
     Number of MPI processes:                 4
     Threads/MPI process:                     1

     GPU accelerated version

     R & G space division:  proc/nbgrp/npool/nimage =       4
     Waiting for input...
     Reading input from standard input
Warning: card &IONS ignored
Warning: card ION_DYNAMICS= 'BFGS', ignored
Warning: card / ignored
Warning: card &CELL ignored
Warning: card CELL_DYNAMICS= 'BFGS', ignored
Warning: card PRESS=38.3, ignored
Warning: card PRESS_CONV_THR=0.1, ignored
Warning: card / ignored

     Current dimensions of program PWSCF are:
     Max number of different atomic species (ntypx) = 10
     Max number of k-points (npk) =  40000
     Max angular momentum in pseudopotentials (lmaxx) =  3

     IMPORTANT: XC functional enforced from input :
     Exchange-correlation      = PBESOL ( 1  4 10  8 0 0)
     Any further DFT definition will be discarded
     Please, verify this is what you really want

               file Pb.pbe-dn-rrkjus_psl.0.2.2.UPF: wavefunction(s)  6S renormalized
               file C.pbe-rrkjus.UPF: wavefunction(s)  2S 2P renormalized
               file H.pbe-rrkjus.UPF: wavefunction(s)  1S renormalized

     Subspace diagonalization in iterative solution of the eigenvalue problem:
     a serial algorithm will be used

 
     Parallelization info
     --------------------
     sticks:   dense  smooth     PW     G-vecs:    dense   smooth      PW
     Min       11419    3263    858              1834863   280157   37908
     Max       11420    3264    859              1834864   280158   37911
     Sum       45677   13053   3433              7339453  1120629  151635
 


     bravais-lattice index     =            0
     lattice parameter (alat)  =      21.3396  a.u.
     unit-cell volume          =    9717.6018 (a.u.)^3
     number of atoms/cell      =           96
     number of atomic types    =            5
     number of electrons       =       400.00
     number of Kohn-Sham states=          200
     kinetic-energy cutoff     =      90.0000  Ry
     charge density cutoff     =    1260.0000  Ry
     convergence threshold     =      1.0E-06
     mixing beta               =       0.7000
     number of iterations used =            8  plain     mixing
     Exchange-correlation      = PBESOL ( 1  4 10  8 0 0)

     celldm(1)=  21.339605  celldm(2)=   0.000000  celldm(3)=   0.000000
     celldm(4)=   0.000000  celldm(5)=   0.000000  celldm(6)=   0.000000

     crystal axes: (cart. coord. in units of alat)
               a(1) = (   1.000000   0.000000   0.000000 )  
               a(2) = (   0.000000   1.000000   0.000000 )  
               a(3) = (   0.000000   0.000000   1.000000 )  

     reciprocal axes: (cart. coord. in units 2 pi/alat)
               b(1) = (  1.000000  0.000000  0.000000 )  
               b(2) = (  0.000000  1.000000  0.000000 )  
               b(3) = (  0.000000  0.000000  1.000000 )  


     PseudoPot. # 1 for Pb read from file:
     ./pseudo/scalrela/Pb.pbe-dn-rrkjus_psl.0.2.2.UPF
     MD5 check sum: 7afc420059c37d6888fc09c0f121e83f
     Pseudo is Ultrasoft + core correction, Zval = 14.0
     Generated using "atomic" code by A. Dal Corso  v.5.0.2 svn rev. 9415
     Using radial grid of 1281 points,  6 beta functions with: 
                l(1) =   0
                l(2) =   0
                l(3) =   1
                l(4) =   1
                l(5) =   2
                l(6) =   2
     Q(r) pseudized with 0 coefficients 


     PseudoPot. # 2 for  I read from file:
     ./pseudo/scalrela/I.pbe-n-rrkjus_psl.0.2.UPF
     MD5 check sum: f9a5bb98cc7d7d8a1a5c1f9867e5ab3f
     Pseudo is Ultrasoft + core correction, Zval =  7.0
     Generated using "atomic" code by A. Dal Corso  v.5.0.2 svn rev. 9415
     Using radial grid of 1247 points,  4 beta functions with: 
                l(1) =   0
                l(2) =   0
                l(3) =   1
                l(4) =   1
     Q(r) pseudized with 0 coefficients 


     PseudoPot. # 3 for  N read from file:
     ./pseudo/scalrela/N.pbe-n-rrkjus_psl.0.1.UPF
     MD5 check sum: ed8b6a90f28a53b7d71920e7015d2dd6
     Pseudo is Ultrasoft + core correction, Zval =  5.0
     Generated using "atomic" code by A. Dal Corso  v.5.0.2 svn rev. 9415
     Using radial grid of 1085 points,  4 beta functions with: 
                l(1) =   0
                l(2) =   0
                l(3) =   1
                l(4) =   1
     Q(r) pseudized with 0 coefficients 


     PseudoPot. # 4 for C  read from file:
     ./pseudo/scalrela/C.pbe-rrkjus.UPF
     MD5 check sum: 00fb224312de0c5b6853bd333518df6f
     Pseudo is Ultrasoft, Zval =  4.0
     Generated by new atomic code, or converted to UPF format
     Using radial grid of  627 points,  4 beta functions with: 
                l(1) =   0
                l(2) =   0
                l(3) =   1
                l(4) =   1
     Q(r) pseudized with 0 coefficients 


     PseudoPot. # 5 for H  read from file:
     ./pseudo/scalrela/H.pbe-rrkjus.UPF
     MD5 check sum: 7cc9d459525c9a0585f487a71c3c9563
     Pseudo is Ultrasoft, Zval =  1.0
     Generated by new atomic code, or converted to UPF format
     Using radial grid of 1061 points,  2 beta functions with: 
                l(1) =   0
                l(2) =   0
     Q(r) pseudized with 0 coefficients 


     atomic species   valence    mass     pseudopotential
        Pb            14.00   207.20000     Pb( 1.00)
        I              7.00   126.90447      I( 1.00)
        N              5.00    14.00674      N( 1.00)
        C              4.00    12.01100     C ( 1.00)
        H              1.00     1.00794     H ( 1.00)

     No symmetry found



   Cartesian axes

     site n.     atom                  positions (alat units)
         1           Pb  tau(   1) = (   0.2500000   0.2500000   0.2500000  )
         2           I   tau(   2) = (   0.0000000   0.2233000   0.2722000  )
         3           I   tau(   3) = (   0.2722000   0.0000000   0.2233000  )
         4           I   tau(   4) = (   0.2233000   0.2722000   0.0000000  )
         5           C   tau(   5) = (   0.9638001   0.9638001   0.9638001  )
         6           N   tau(   6) = (   0.0361999   0.0361999   0.0361999  )
         7           H   tau(   7) = (   0.8947234   0.9494534   0.0042688  )
         8           H   tau(   8) = (   0.9495103   0.0042403   0.8946949  )
         9           H   tau(   9) = (   0.0171272   0.8933835   0.9552554  )
        10           H   tau(  10) = (   0.0504897   0.9957597   0.1053051  )
        11           H   tau(  11) = (   0.9828728   0.1066165   0.0447446  )
        12           H   tau(  12) = (   0.1052766   0.0505466   0.9957312  )
        13           Pb  tau(  13) = (   0.7500000   0.2500000   0.2500000  )
        14           I   tau(  14) = (   0.5000000   0.2767000   0.2278000  )
        15           I   tau(  15) = (   0.7278000   0.0000000   0.2233000  )
        16           I   tau(  16) = (   0.7767000   0.2722000   0.0000000  )
        17           C   tau(  17) = (   0.5000000   0.9373000   0.0000000  )
        18           N   tau(  18) = (   0.5000000   0.0627000   0.0000000  )
        19           H   tau(  19) = (   0.5380000   0.9100000   0.0658000  )
        20           H   tau(  20) = (   0.4240000   0.9100000   0.0000000  )
        21           H   tau(  21) = (   0.5380000   0.9100000   0.9342000  )
        22           H   tau(  22) = (   0.4620000   0.0900000   0.0658000  )
        23           H   tau(  23) = (   0.4620000   0.0900000   0.9342000  )
        24           H   tau(  24) = (   0.5760000   0.0900000   0.0000000  )
        25           Pb  tau(  25) = (   0.2500000   0.7500000   0.2500000  )
        26           I   tau(  26) = (   0.0000000   0.7767000   0.2722000  )
        27           I   tau(  27) = (   0.2278000   0.5000000   0.2767000  )
        28           I   tau(  28) = (   0.2233000   0.7278000   0.0000000  )
        29           C   tau(  29) = (   0.0000000   0.5000000   0.9373000  )
        30           N   tau(  30) = (   0.0000000   0.5000000   0.0627000  )
        31           H   tau(  31) = (   0.9342000   0.5380000   0.9100000  )
        32           H   tau(  32) = (   0.0658000   0.5380000   0.9100000  )
        33           H   tau(  33) = (   0.0000000   0.4240000   0.9100000  )
        34           H   tau(  34) = (   0.9342000   0.4620000   0.0900000  )
        35           H   tau(  35) = (   0.0000000   0.5760000   0.0900000  )
        36           H   tau(  36) = (   0.0658000   0.4620000   0.0900000  )
        37           Pb  tau(  37) = (   0.7500000   0.7500000   0.2500000  )
        38           I   tau(  38) = (   0.5000000   0.7233000   0.2278000  )
        39           I   tau(  39) = (   0.7722000   0.5000000   0.2767000  )
        40           I   tau(  40) = (   0.7767000   0.7278000   0.0000000  )
        41           C   tau(  41) = (   0.4373000   0.5000000   0.0000000  )
        42           N   tau(  42) = (   0.5627000   0.5000000   0.0000000  )
        43           H   tau(  43) = (   0.4100000   0.5658000   0.0380000  )
        44           H   tau(  44) = (   0.4100000   0.4342000   0.0380000  )
        45           H   tau(  45) = (   0.4100000   0.5000000   0.9240000  )
        46           H   tau(  46) = (   0.5900000   0.5000000   0.0760000  )
        47           H   tau(  47) = (   0.5900000   0.4342000   0.9620000  )
        48           H   tau(  48) = (   0.5900000   0.5658000   0.9620000  )
        49           Pb  tau(  49) = (   0.2500000   0.2500000   0.7500000  )
        50           I   tau(  50) = (   0.0000000   0.2233000   0.7278000  )
        51           I   tau(  51) = (   0.2722000   0.0000000   0.7767000  )
        52           I   tau(  52) = (   0.2767000   0.2278000   0.5000000  )
        53           C   tau(  53) = (   0.9373000   0.0000000   0.5000000  )
        54           N   tau(  54) = (   0.0627000   0.0000000   0.5000000  )
        55           H   tau(  55) = (   0.9100000   0.0658000   0.5380000  )
        56           H   tau(  56) = (   0.9100000   0.9342000   0.5380000  )
        57           H   tau(  57) = (   0.9100000   0.0000000   0.4240000  )
        58           H   tau(  58) = (   0.0900000   0.0000000   0.5760000  )
        59           H   tau(  59) = (   0.0900000   0.9342000   0.4620000  )
        60           H   tau(  60) = (   0.0900000   0.0658000   0.4620000  )
        61           Pb  tau(  61) = (   0.7500000   0.2500000   0.7500000  )
        62           I   tau(  62) = (   0.5000000   0.2767000   0.7722000  )
        63           I   tau(  63) = (   0.7278000   0.0000000   0.7767000  )
        64           I   tau(  64) = (   0.7233000   0.2278000   0.5000000  )
        65           C   tau(  65) = (   0.5000000   0.0000000   0.4373000  )
        66           N   tau(  66) = (   0.5000000   0.0000000   0.5627000  )
        67           H   tau(  67) = (   0.4342000   0.0380000   0.4100000  )
        68           H   tau(  68) = (   0.5658000   0.0380000   0.4100000  )
        69           H   tau(  69) = (   0.5000000   0.9240000   0.4100000  )
        70           H   tau(  70) = (   0.5000000   0.0760000   0.5900000  )
        71           H   tau(  71) = (   0.5658000   0.9620000   0.5900000  )
        72           H   tau(  72) = (   0.4342000   0.9620000   0.5900000  )
        73           Pb  tau(  73) = (   0.2500000   0.7500000   0.7500000  )
        74           I   tau(  74) = (   0.0000000   0.7767000   0.7278000  )
        75           I   tau(  75) = (   0.2278000   0.5000000   0.7233000  )
        76           I   tau(  76) = (   0.2767000   0.7722000   0.5000000  )
        77           C   tau(  77) = (   0.0000000   0.4373000   0.5000000  )
        78           N   tau(  78) = (   0.0000000   0.5627000   0.5000000  )
        79           H   tau(  79) = (   0.0380000   0.4100000   0.5658000  )
        80           H   tau(  80) = (   0.0380000   0.4100000   0.4342000  )
        81           H   tau(  81) = (   0.9240000   0.4100000   0.5000000  )
        82           H   tau(  82) = (   0.9620000   0.5900000   0.5658000  )
        83           H   tau(  83) = (   0.0760000   0.5900000   0.5000000  )
        84           H   tau(  84) = (   0.9620000   0.5900000   0.4342000  )
        85           Pb  tau(  85) = (   0.7500000   0.7500000   0.7500000  )
        86           I   tau(  86) = (   0.5000000   0.7233000   0.7722000  )
        87           I   tau(  87) = (   0.7722000   0.5000000   0.7233000  )
        88           I   tau(  88) = (   0.7233000   0.7722000   0.5000000  )
        89           C   tau(  89) = (   0.5361999   0.5361999   0.5361999  )
        90           N   tau(  90) = (   0.4638001   0.4638001   0.4638001  )
        91           H   tau(  91) = (   0.5504897   0.4957597   0.6053051  )
        92           H   tau(  92) = (   0.6052766   0.5505466   0.4957312  )
        93           H   tau(  93) = (   0.4828728   0.6066165   0.5447446  )
        94           H   tau(  94) = (   0.3947234   0.4494534   0.5042688  )
        95           H   tau(  95) = (   0.5171272   0.3933835   0.4552554  )
        96           H   tau(  96) = (   0.4495103   0.5042403   0.3946949  )

     number of k points=    36
                       cart. coord. in units 2pi/alat
        k(    1) = (   0.0000000   0.0000000   0.0000000), wk =   0.0312500
        k(    2) = (   0.0000000   0.0000000   0.2500000), wk =   0.0625000
        k(    3) = (   0.0000000   0.0000000  -0.5000000), wk =   0.0312500
        k(    4) = (   0.0000000   0.2500000   0.2500000), wk =   0.0625000
        k(    5) = (   0.0000000   0.2500000  -0.5000000), wk =   0.0625000
        k(    6) = (   0.0000000  -0.5000000  -0.5000000), wk =   0.0312500
        k(    7) = (   0.2500000   0.2500000   0.2500000), wk =   0.0625000
        k(    8) = (   0.2500000   0.2500000  -0.5000000), wk =   0.0625000
        k(    9) = (   0.2500000  -0.5000000  -0.5000000), wk =   0.0625000
        k(   10) = (  -0.5000000  -0.5000000  -0.5000000), wk =   0.0312500
        k(   11) = (   0.2500000   0.0000000   0.0000000), wk =   0.0625000
        k(   12) = (   0.0000000   0.2500000   0.0000000), wk =   0.0625000
        k(   13) = (  -0.5000000   0.0000000   0.0000000), wk =   0.0312500
        k(   14) = (   0.0000000  -0.5000000   0.0000000), wk =   0.0312500
        k(   15) = (   0.0000000  -0.2500000   0.2500000), wk =   0.0625000
        k(   16) = (   0.2500000   0.0000000  -0.2500000), wk =   0.0625000
        k(   17) = (  -0.2500000   0.0000000  -0.2500000), wk =   0.0625000
        k(   18) = (   0.2500000  -0.2500000   0.0000000), wk =   0.0625000
        k(   19) = (  -0.2500000  -0.2500000   0.0000000), wk =   0.0625000
        k(   20) = (   0.2500000   0.0000000   0.5000000), wk =   0.0625000
        k(   21) = (  -0.5000000  -0.2500000   0.0000000), wk =   0.0625000
        k(   22) = (   0.0000000  -0.5000000   0.2500000), wk =   0.0625000
        k(   23) = (   0.2500000  -0.5000000   0.0000000), wk =   0.0625000
        k(   24) = (  -0.5000000   0.0000000   0.2500000), wk =   0.0625000
        k(   25) = (  -0.5000000   0.0000000   0.5000000), wk =   0.0312500
        k(   26) = (  -0.5000000   0.5000000   0.0000000), wk =   0.0312500
        k(   27) = (  -0.2500000  -0.2500000   0.2500000), wk =   0.0625000
        k(   28) = (  -0.2500000   0.2500000  -0.2500000), wk =   0.0625000
        k(   29) = (   0.2500000  -0.2500000  -0.2500000), wk =   0.0625000
        k(   30) = (  -0.2500000   0.2500000   0.5000000), wk =   0.0625000
        k(   31) = (  -0.5000000  -0.2500000   0.2500000), wk =   0.0625000
        k(   32) = (   0.5000000  -0.2500000  -0.2500000), wk =   0.0625000
        k(   33) = (  -0.2500000  -0.5000000   0.2500000), wk =   0.0625000
        k(   34) = (  -0.2500000   0.5000000  -0.2500000), wk =   0.0625000
        k(   35) = (  -0.5000000   0.2500000   0.5000000), wk =   0.0625000
        k(   36) = (  -0.5000000   0.5000000   0.2500000), wk =   0.0625000

     Dense  grid:  7339453 G-vectors     FFT dimensions: ( 243, 243, 243)

     Smooth grid:  1120629 G-vectors     FFT dimensions: ( 135, 135, 135)

     Estimated max dynamical RAM per process >    6213.17MB

     Estimated total allocated dynamical RAM >   24852.68MB
[mpiexec@pollux] Sending Ctrl-C to processes as requested
[mpiexec@pollux] Press Ctrl-C again to force abort
APPLICATION TERMINATED WITH THE EXIT STRING: Interrupt (signal 2)
