TensorFlow:  1.1
Model:       resnet152
Mode:        training
Batch size:  128 global
             32.0 per device
Devices:     ['/gpu:0', '/gpu:1', '/gpu:2', '/gpu:3']
Data format: NCHW
Optimizer:   sgd
Variables:   replicated
Use NCCL:    True
==========
Generating model
Running warm up
Done warm up
Step	Img/sec	loss
Starting real work at step 10 at time Fri Jun 15 11:47:20 2018
1	images/sec: 61.7 +/- 0.0 (jitter = 0.0)	7.936
10	images/sec: 63.0 +/- 0.5 (jitter = 1.1)	7.594
20	images/sec: 63.0 +/- 0.2 (jitter = 1.2)	7.500
30	images/sec: 63.0 +/- 0.2 (jitter = 1.0)	7.465
40	images/sec: 62.9 +/- 0.2 (jitter = 0.8)	7.447
50	images/sec: 62.7 +/- 0.2 (jitter = 0.9)	7.436
60	images/sec: 62.8 +/- 0.1 (jitter = 0.8)	7.427
70	images/sec: 62.8 +/- 0.1 (jitter = 0.9)	7.422
80	images/sec: 62.8 +/- 0.1 (jitter = 1.0)	7.418
90	images/sec: 62.8 +/- 0.1 (jitter = 1.0)	7.414
Finishing real work at step 109 at time Fri Jun 15 11:50:42 2018
100	images/sec: 62.7 +/- 0.1 (jitter = 1.1)	7.411
----------------------------------------------------------------
total images/sec: 62.70
----------------------------------------------------------------
