TensorFlow:  1.1
Model:       inception3
Mode:        training
Batch size:  128 global
             64.0 per device
Devices:     ['/gpu:0', '/gpu:1']
Data format: NCHW
Optimizer:   sgd
Variables:   parameter_server
==========
Generating model
Running warm up
Done warm up
Step	Img/sec	loss
Starting real work at step 10 at time Fri Jun 15 10:27:16 2018
1	images/sec: 60.5 +/- 0.0 (jitter = 0.0)	7.297
10	images/sec: 60.3 +/- 0.1 (jitter = 0.2)	7.169
20	images/sec: 60.3 +/- 0.0 (jitter = 0.2)	7.052
30	images/sec: 60.2 +/- 0.0 (jitter = 0.2)	6.942
40	images/sec: 60.2 +/- 0.0 (jitter = 0.2)	6.816
50	images/sec: 60.2 +/- 0.0 (jitter = 0.2)	6.715
60	images/sec: 60.2 +/- 0.0 (jitter = 0.2)	6.622
70	images/sec: 60.2 +/- 0.0 (jitter = 0.2)	6.527
80	images/sec: 60.1 +/- 0.0 (jitter = 0.2)	6.435
90	images/sec: 60.1 +/- 0.0 (jitter = 0.2)	6.326
Finishing real work at step 109 at time Fri Jun 15 10:30:47 2018
100	images/sec: 60.1 +/- 0.0 (jitter = 0.2)	6.256
----------------------------------------------------------------
total images/sec: 60.14
----------------------------------------------------------------
