TensorFlow:  1.1
Model:       inception3
Mode:        training
Batch size:  64 global
             64.0 per device
Devices:     ['/gpu:0']
Data format: NCHW
Optimizer:   sgd
Variables:   parameter_server
==========
Generating model
Running warm up
Done warm up
Step	Img/sec	loss
Starting real work at step 10 at time Fri Jun 15 11:16:20 2018
1	images/sec: 32.2 +/- 0.0 (jitter = 0.0)	7.180
10	images/sec: 32.1 +/- 0.0 (jitter = 0.1)	6.949
20	images/sec: 32.0 +/- 0.0 (jitter = 0.1)	6.727
30	images/sec: 32.0 +/- 0.0 (jitter = 0.1)	6.472
40	images/sec: 31.9 +/- 0.0 (jitter = 0.2)	6.293
50	images/sec: 31.9 +/- 0.0 (jitter = 0.1)	6.090
60	images/sec: 31.9 +/- 0.0 (jitter = 0.1)	5.919
70	images/sec: 31.9 +/- 0.0 (jitter = 0.1)	5.738
80	images/sec: 31.8 +/- 0.0 (jitter = 0.1)	5.574
90	images/sec: 31.8 +/- 0.0 (jitter = 0.1)	5.445
Finishing real work at step 109 at time Fri Jun 15 11:19:39 2018
100	images/sec: 31.8 +/- 0.0 (jitter = 0.1)	5.270
----------------------------------------------------------------
total images/sec: 31.80
----------------------------------------------------------------
