T15,T70,date,sensorName
15,42,2023-01-05 00:00:00.229,Lband
15,42,2023-01-05 00:01:00.319,Lband
15,42,2023-01-05 00:02:00.325,Lband
15,42,2023-01-05 00:03:00.274,Lband
15,42,2023-01-05 00:04:00.305,Lband
15,42,2023-01-05 00:05:00.208,Lband
15,42,2023-01-05 00:06:00.270,Lband
15,42,2023-01-05 00:07:00.331,Lband
15,42,2023-01-05 00:08:00.468,Lband
15,42,2023-01-05 00:09:00.355,Lband
15,42,2023-01-05 00:10:00.340,Lband
15,42,2023-01-05 00:11:00.327,Lband
15,42,2023-01-05 00:12:00.276,Lband
15,42,2023-01-05 00:13:00.209,Lband
15,42,2023-01-05 00:14:00.350,Lband
15,42,2023-01-05 00:15:00.270,Lband
15,42,2023-01-05 00:16:00.336,Lband
15,42,2023-01-05 00:17:00.267,Lband
15,42,2023-01-05 00:18:00.337,Lband
15,42,2023-01-05 00:19:00.366,Lband
15,42,2023-01-05 00:20:00.286,Lband
15,42,2023-01-05 00:21:00.198,Lband
15,42,2023-01-05 00:22:00.325,Lband
15,42,2023-01-05 00:23:00.294,Lband
15,42,2023-01-05 00:24:00.205,Lband
15,42,2023-01-05 00:25:00.191,Lband
15,42,2023-01-05 00:26:00.346,Lband
15,42,2023-01-05 00:27:00.352,Lband
15,42,2023-01-05 00:28:00.315,Lband
15,42,2023-01-05 00:29:00.329,Lband
15,42,2023-01-05 00:30:00.311,Lband
15,42,2023-01-05 00:31:00.253,Lband
15,42,2023-01-05 00:32:00.326,Lband
15,42,2023-01-05 00:33:00.357,Lband
15,42,2023-01-05 00:34:00.297,Lband
15,42,2023-01-05 00:35:00.297,Lband
15,42,2023-01-05 00:36:00.347,Lband
15,42,2023-01-05 00:37:00.325,Lband
15,42,2023-01-05 00:38:00.459,Lband
15,42,2023-01-05 00:39:00.196,Lband
15,42,2023-01-05 00:40:00.342,Lband
15,42,2023-01-05 00:41:00.306,Lband
15,42,2023-01-05 00:42:00.252,Lband
15,42,2023-01-05 00:43:00.297,Lband
15,42,2023-01-05 00:44:00.353,Lband
15,42,2023-01-05 00:45:00.251,Lband
15,42,2023-01-05 00:46:00.193,Lband
15,42,2023-01-05 00:47:00.260,Lband
15,42,2023-01-05 00:48:00.305,Lband
15,42,2023-01-05 00:49:00.305,Lband
15,42,2023-01-05 00:50:00.258,Lband
15,42,2023-01-05 00:51:00.273,Lband
15,42,2023-01-05 00:52:00.306,Lband
15,42,2023-01-05 00:53:00.242,Lband
15,42,2023-01-05 00:54:00.363,Lband
15,42,2023-01-05 00:55:00.308,Lband
15,42,2023-01-05 00:56:00.337,Lband
15,42,2023-01-05 00:57:00.302,Lband
15,42,2023-01-05 00:58:00.254,Lband
15,42,2023-01-05 00:59:00.317,Lband
15,42,2023-01-05 01:00:00.359,Lband
15,42,2023-01-05 01:01:00.305,Lband
15,42,2023-01-05 01:02:00.256,Lband
15,42,2023-01-05 01:03:00.281,Lband
15,42,2023-01-05 01:04:00.351,Lband
15,42,2023-01-05 01:05:00.183,Lband
15,42,2023-01-05 01:06:00.307,Lband
15,42,2023-01-05 01:07:00.227,Lband
15,42,2023-01-05 01:08:00.362,Lband
15,42,2023-01-05 01:09:00.304,Lband
15,42,2023-01-05 01:10:00.263,Lband
15,42,2023-01-05 01:11:00.302,Lband
15,42,2023-01-05 01:12:00.349,Lband
15,42,2023-01-05 01:13:00.320,Lband
15,42,2023-01-05 01:14:00.313,Lband
15,42,2023-01-05 01:15:00.339,Lband
15,42,2023-01-05 01:16:00.241,Lband
15,42,2023-01-05 01:17:00.302,Lband
15,42,2023-01-05 01:18:00.297,Lband
15,42,2023-01-05 01:19:00.348,Lband
15,42,2023-01-05 01:20:00.282,Lband
15,42,2023-01-05 01:21:00.363,Lband
15,42,2023-01-05 01:22:00.371,Lband
15,42,2023-01-05 01:23:00.354,Lband
15,42,2023-01-05 01:24:00.270,Lband
15,42,2023-01-05 01:25:00.290,Lband
15,42,2023-01-05 01:26:00.317,Lband
15,42,2023-01-05 01:27:00.357,Lband
15,42,2023-01-05 01:28:00.340,Lband
15,42,2023-01-05 01:29:00.316,Lband
15,42,2023-01-05 01:30:00.240,Lband
15,42,2023-01-05 01:31:00.271,Lband
15,42,2023-01-05 01:32:00.266,Lband
15,42,2023-01-05 01:33:00.387,Lband
15,42,2023-01-05 01:34:00.366,Lband
15,42,2023-01-05 01:35:00.286,Lband
15,42,2023-01-05 01:36:00.289,Lband
15,42,2023-01-05 01:37:00.269,Lband
15,42,2023-01-05 01:38:00.297,Lband
15,42,2023-01-05 01:39:00.359,Lband
15,42,2023-01-05 01:40:00.342,Lband
15,42,2023-01-05 01:41:00.284,Lband
15,42,2023-01-05 01:42:00.364,Lband
15,42,2023-01-05 01:43:00.378,Lband
15,41,2023-01-05 01:44:00.349,Lband
15,42,2023-01-05 01:45:00.278,Lband
15,42,2023-01-05 01:46:00.257,Lband
15,42,2023-01-05 01:47:00.244,Lband
15,42,2023-01-05 01:48:00.292,Lband
15,42,2023-01-05 01:49:00.204,Lband
15,42,2023-01-05 01:50:00.269,Lband
15,42,2023-01-05 01:51:00.316,Lband
15,42,2023-01-05 01:52:00.322,Lband
15,42,2023-01-05 01:53:00.299,Lband
15,42,2023-01-05 01:54:00.355,Lband
15,42,2023-01-05 01:55:00.285,Lband
15,42,2023-01-05 01:56:00.310,Lband
15,41,2023-01-05 01:57:00.294,Lband
15,42,2023-01-05 01:58:00.279,Lband
15,42,2023-01-05 01:59:00.307,Lband
15,42,2023-01-05 02:00:00.341,Lband
15,42,2023-01-05 02:01:00.364,Lband
15,42,2023-01-05 02:02:00.316,Lband
15,42,2023-01-05 02:03:00.254,Lband
15,42,2023-01-05 02:04:00.330,Lband
15,42,2023-01-05 02:05:00.346,Lband
15,42,2023-01-05 02:06:00.338,Lband
15,42,2023-01-05 02:07:00.305,Lband
15,42,2023-01-05 02:08:00.251,Lband
15,42,2023-01-05 02:09:00.303,Lband
15,42,2023-01-05 02:10:00.271,Lband
15,42,2023-01-05 02:11:00.353,Lband
15,42,2023-01-05 02:12:00.256,Lband
15,42,2023-01-05 02:13:00.280,Lband
15,42,2023-01-05 02:14:00.300,Lband
15,42,2023-01-05 02:15:00.343,Lband
15,41,2023-01-05 02:16:00.310,Lband
15,41,2023-01-05 02:17:00.344,Lband
15,41,2023-01-05 02:18:00.313,Lband
15,41,2023-01-05 02:19:00.304,Lband
15,42,2023-01-05 02:20:00.304,Lband
15,41,2023-01-05 02:21:00.305,Lband
15,42,2023-01-05 02:22:00.305,Lband
15,42,2023-01-05 02:23:00.351,Lband
15,41,2023-01-05 02:24:00.363,Lband
15,42,2023-01-05 02:25:00.353,Lband
15,41,2023-01-05 02:26:00.281,Lband
15,41,2023-01-05 02:27:00.301,Lband
15,41,2023-01-05 02:28:00.243,Lband
15,41,2023-01-05 02:29:00.337,Lband
15,42,2023-01-05 02:30:00.355,Lband
15,41,2023-01-05 02:31:00.282,Lband
15,41,2023-01-05 02:32:00.299,Lband
15,41,2023-01-05 02:33:00.243,Lband
15,41,2023-01-05 02:34:00.303,Lband
15,41,2023-01-05 02:35:00.291,Lband
15,41,2023-01-05 02:36:00.375,Lband
15,42,2023-01-05 02:37:00.336,Lband
15,41,2023-01-05 02:38:00.367,Lband
15,41,2023-01-05 02:39:00.257,Lband
15,41,2023-01-05 02:40:00.317,Lband
15,41,2023-01-05 02:41:00.343,Lband
15,41,2023-01-05 02:42:00.294,Lband
15,41,2023-01-05 02:43:00.288,Lband
15,41,2023-01-05 02:44:00.342,Lband
15,41,2023-01-05 02:45:00.307,Lband
15,42,2023-01-05 02:46:00.351,Lband
15,41,2023-01-05 02:47:00.300,Lband
15,41,2023-01-05 02:48:00.307,Lband
15,42,2023-01-05 02:49:00.272,Lband
15,41,2023-01-05 02:50:00.288,Lband
15,41,2023-01-05 02:51:00.303,Lband
15,41,2023-01-05 02:52:00.285,Lband
15,41,2023-01-05 02:53:00.279,Lband
15,41,2023-01-05 02:54:00.259,Lband
15,41,2023-01-05 02:55:00.304,Lband
15,41,2023-01-05 02:56:00.308,Lband
15,41,2023-01-05 02:57:00.287,Lband
15,41,2023-01-05 02:58:00.299,Lband
15,41,2023-01-05 02:59:00.268,Lband
15,41,2023-01-05 03:00:00.302,Lband
15,41,2023-01-05 03:01:00.250,Lband
15,41,2023-01-05 03:02:00.385,Lband
15,41,2023-01-05 03:03:00.286,Lband
15,41,2023-01-05 03:04:00.367,Lband
15,41,2023-01-05 03:05:00.290,Lband
15,41,2023-01-05 03:06:00.268,Lband
15,41,2023-01-05 03:07:00.340,Lband
15,41,2023-01-05 03:08:00.288,Lband
15,41,2023-01-05 03:09:00.331,Lband
15,41,2023-01-05 03:10:00.310,Lband
15,41,2023-01-05 03:11:00.336,Lband
15,41,2023-01-05 03:12:00.294,Lband
15,41,2023-01-05 03:13:00.263,Lband
15,41,2023-01-05 03:14:00.310,Lband
15,41,2023-01-05 03:15:00.283,Lband
15,41,2023-01-05 03:16:00.342,Lband
15,41,2023-01-05 03:17:00.317,Lband
15,41,2023-01-05 03:18:00.328,Lband
15,41,2023-01-05 03:19:00.321,Lband
15,41,2023-01-05 03:20:00.315,Lband
15,41,2023-01-05 03:21:00.295,Lband
15,41,2023-01-05 03:22:00.276,Lband
15,41,2023-01-05 03:23:00.320,Lband
15,41,2023-01-05 03:24:00.346,Lband
15,41,2023-01-05 03:25:00.246,Lband
14,41,2023-01-05 03:26:00.286,Lband
15,41,2023-01-05 03:27:00.309,Lband
15,41,2023-01-05 03:28:00.267,Lband
15,41,2023-01-05 03:29:00.338,Lband
15,41,2023-01-05 03:30:00.254,Lband
15,41,2023-01-05 03:31:00.285,Lband
15,41,2023-01-05 03:32:00.347,Lband
15,41,2023-01-05 03:33:00.311,Lband
15,41,2023-01-05 03:34:00.258,Lband
15,41,2023-01-05 03:35:00.258,Lband
15,41,2023-01-05 03:36:00.273,Lband
15,41,2023-01-05 03:37:00.296,Lband
15,41,2023-01-05 03:38:00.288,Lband
15,41,2023-01-05 03:39:00.253,Lband
15,41,2023-01-05 03:40:00.287,Lband
15,41,2023-01-05 03:41:00.266,Lband
15,41,2023-01-05 03:42:00.256,Lband
15,41,2023-01-05 03:43:00.273,Lband
15,41,2023-01-05 03:44:00.302,Lband
15,41,2023-01-05 03:45:00.247,Lband
14,41,2023-01-05 03:46:00.313,Lband
15,41,2023-01-05 03:47:00.301,Lband
15,41,2023-01-05 03:48:00.289,Lband
15,41,2023-01-05 03:49:00.257,Lband
15,41,2023-01-05 03:50:00.287,Lband
15,41,2023-01-05 03:51:00.240,Lband
15,41,2023-01-05 03:52:00.319,Lband
15,41,2023-01-05 03:53:00.294,Lband
15,41,2023-01-05 03:54:00.294,Lband
15,41,2023-01-05 03:55:00.250,Lband
15,41,2023-01-05 03:56:00.254,Lband
15,41,2023-01-05 03:57:00.268,Lband
15,41,2023-01-05 03:58:00.422,Lband
15,41,2023-01-05 03:59:00.238,Lband
15,41,2023-01-05 04:00:00.355,Lband
15,41,2023-01-05 04:01:00.287,Lband
15,41,2023-01-05 04:02:00.360,Lband
15,41,2023-01-05 04:03:00.234,Lband
15,41,2023-01-05 04:04:00.306,Lband
15,41,2023-01-05 04:05:00.334,Lband
15,41,2023-01-05 04:06:00.364,Lband
15,41,2023-01-05 04:07:00.369,Lband
15,41,2023-01-05 04:08:00.353,Lband
15,41,2023-01-05 04:09:00.244,Lband
15,41,2023-01-05 04:10:00.315,Lband
15,41,2023-01-05 04:11:00.331,Lband
15,41,2023-01-05 04:12:00.322,Lband
15,41,2023-01-05 04:13:00.294,Lband
15,41,2023-01-05 04:14:00.342,Lband
15,41,2023-01-05 04:15:00.318,Lband
15,41,2023-01-05 04:16:00.358,Lband
15,41,2023-01-05 04:17:00.245,Lband
15,41,2023-01-05 04:18:00.238,Lband
15,41,2023-01-05 04:19:00.328,Lband
15,41,2023-01-05 04:20:00.285,Lband
15,41,2023-01-05 04:21:00.282,Lband
15,41,2023-01-05 04:22:00.415,Lband
15,41,2023-01-05 04:23:00.304,Lband
14,41,2023-01-05 04:24:00.357,Lband
15,41,2023-01-05 04:25:00.280,Lband
15,41,2023-01-05 04:26:00.324,Lband
15,41,2023-01-05 04:27:00.376,Lband
15,41,2023-01-05 04:28:00.358,Lband
15,41,2023-01-05 04:29:00.273,Lband
15,41,2023-01-05 04:30:00.342,Lband
15,41,2023-01-05 04:31:00.282,Lband
15,41,2023-01-05 04:32:00.324,Lband
15,41,2023-01-05 04:33:00.291,Lband
15,41,2023-01-05 04:34:00.224,Lband
15,41,2023-01-05 04:35:00.260,Lband
15,41,2023-01-05 04:36:00.292,Lband
15,41,2023-01-05 04:37:00.332,Lband
14,41,2023-01-05 04:38:00.360,Lband
15,41,2023-01-05 04:39:00.302,Lband
15,41,2023-01-05 04:40:00.327,Lband
15,41,2023-01-05 04:41:00.233,Lband
15,41,2023-01-05 04:42:00.231,Lband
15,41,2023-01-05 04:43:00.226,Lband
15,41,2023-01-05 04:44:00.336,Lband
15,41,2023-01-05 04:45:00.303,Lband
15,41,2023-01-05 04:46:00.261,Lband
15,41,2023-01-05 04:47:00.317,Lband
14,41,2023-01-05 04:48:00.285,Lband
15,41,2023-01-05 04:49:00.315,Lband
15,41,2023-01-05 04:50:00.278,Lband
15,41,2023-01-05 04:51:00.337,Lband
15,41,2023-01-05 04:52:00.288,Lband
15,41,2023-01-05 04:53:00.314,Lband
15,41,2023-01-05 04:54:00.311,Lband
15,41,2023-01-05 04:55:00.262,Lband
15,41,2023-01-05 04:56:00.268,Lband
15,41,2023-01-05 04:57:00.343,Lband
15,41,2023-01-05 04:58:00.289,Lband
15,41,2023-01-05 04:59:00.327,Lband
15,41,2023-01-05 05:00:00.233,Lband
15,41,2023-01-05 05:01:00.247,Lband
14,41,2023-01-05 05:02:00.265,Lband
15,41,2023-01-05 05:03:00.372,Lband
15,41,2023-01-05 05:04:00.265,Lband
14,41,2023-01-05 05:05:00.394,Lband
15,41,2023-01-05 05:06:00.281,Lband
15,41,2023-01-05 05:07:00.278,Lband
15,41,2023-01-05 05:08:00.275,Lband
15,41,2023-01-05 05:09:00.290,Lband
15,41,2023-01-05 05:10:00.307,Lband
15,41,2023-01-05 05:11:00.292,Lband
15,41,2023-01-05 05:12:00.325,Lband
15,41,2023-01-05 05:13:00.222,Lband
15,41,2023-01-05 05:14:00.249,Lband
15,41,2023-01-05 05:15:00.265,Lband
15,41,2023-01-05 05:16:00.259,Lband
15,41,2023-01-05 05:17:00.255,Lband
15,41,2023-01-05 05:18:00.270,Lband
15,41,2023-01-05 05:19:00.218,Lband
15,41,2023-01-05 05:20:00.288,Lband
15,41,2023-01-05 05:21:00.251,Lband
15,41,2023-01-05 05:22:00.199,Lband
15,41,2023-01-05 05:23:00.245,Lband
15,41,2023-01-05 05:24:00.265,Lband
15,41,2023-01-05 05:25:00.292,Lband
15,41,2023-01-05 05:26:00.293,Lband
15,41,2023-01-05 05:27:00.359,Lband
15,41,2023-01-05 05:28:00.227,Lband
15,41,2023-01-05 05:29:00.309,Lband
15,41,2023-01-05 05:30:00.255,Lband
15,41,2023-01-05 05:31:00.204,Lband
15,41,2023-01-05 05:32:00.227,Lband
15,41,2023-01-05 05:33:00.304,Lband
15,41,2023-01-05 05:34:00.299,Lband
15,41,2023-01-05 05:35:00.232,Lband
14,41,2023-01-05 05:36:00.307,Lband
15,41,2023-01-05 05:37:00.219,Lband
15,41,2023-01-05 05:38:00.216,Lband
15,41,2023-01-05 05:39:00.209,Lband
15,41,2023-01-05 05:40:00.265,Lband
15,41,2023-01-05 05:41:00.214,Lband
15,41,2023-01-05 05:42:00.278,Lband
15,41,2023-01-05 05:43:00.233,Lband
15,41,2023-01-05 05:44:00.279,Lband
15,41,2023-01-05 05:45:00.259,Lband
14,41,2023-01-05 05:46:00.267,Lband
14,41,2023-01-05 05:47:00.274,Lband
15,41,2023-01-05 05:48:00.298,Lband
15,41,2023-01-05 05:49:00.255,Lband
15,41,2023-01-05 05:50:00.260,Lband
15,41,2023-01-05 05:51:00.312,Lband
15,41,2023-01-05 05:52:00.274,Lband
15,41,2023-01-05 05:53:00.214,Lband
15,41,2023-01-05 05:54:00.270,Lband
15,41,2023-01-05 05:55:00.367,Lband
15,41,2023-01-05 05:56:00.255,Lband
14,41,2023-01-05 05:57:00.265,Lband
15,41,2023-01-05 05:58:00.195,Lband
15,41,2023-01-05 05:59:00.232,Lband
15,41,2023-01-05 06:00:00.273,Lband
15,41,2023-01-05 06:01:00.224,Lband
15,41,2023-01-05 06:02:00.214,Lband
15,41,2023-01-05 06:03:00.253,Lband
15,41,2023-01-05 06:04:00.190,Lband
15,41,2023-01-05 06:05:00.301,Lband
15,41,2023-01-05 06:06:00.251,Lband
15,41,2023-01-05 06:07:00.312,Lband
15,41,2023-01-05 06:08:00.276,Lband
15,41,2023-01-05 06:09:00.210,Lband
15,41,2023-01-05 06:10:00.181,Lband
15,41,2023-01-05 06:11:00.360,Lband
15,41,2023-01-05 06:12:00.225,Lband
15,41,2023-01-05 06:13:00.277,Lband
15,41,2023-01-05 06:14:00.221,Lband
14,41,2023-01-05 06:15:00.242,Lband
15,41,2023-01-05 06:16:00.308,Lband
15,41,2023-01-05 06:17:00.305,Lband
15,41,2023-01-05 06:18:00.290,Lband
15,41,2023-01-05 06:19:00.244,Lband
15,41,2023-01-05 06:20:00.256,Lband
15,41,2023-01-05 06:21:00.222,Lband
15,41,2023-01-05 06:22:00.317,Lband
15,41,2023-01-05 06:23:00.252,Lband
15,41,2023-01-05 06:24:00.300,Lband
15,41,2023-01-05 06:25:00.319,Lband
15,41,2023-01-05 06:26:00.322,Lband
15,41,2023-01-05 06:27:00.306,Lband
15,41,2023-01-05 06:28:00.323,Lband
14,41,2023-01-05 06:29:00.247,Lband
15,41,2023-01-05 06:30:00.299,Lband
15,41,2023-01-05 06:31:00.261,Lband
15,41,2023-01-05 06:32:00.265,Lband
15,41,2023-01-05 06:33:00.181,Lband
14,41,2023-01-05 06:34:00.307,Lband
15,41,2023-01-05 06:35:00.205,Lband
15,41,2023-01-05 06:36:00.298,Lband
15,41,2023-01-05 06:37:00.232,Lband
15,41,2023-01-05 06:38:00.268,Lband
15,41,2023-01-05 06:39:00.217,Lband
15,41,2023-01-05 06:40:00.176,Lband
14,41,2023-01-05 06:41:00.266,Lband
14,41,2023-01-05 06:42:00.256,Lband
15,41,2023-01-05 06:43:00.195,Lband
15,41,2023-01-05 06:44:00.187,Lband
15,41,2023-01-05 06:45:00.280,Lband
15,41,2023-01-05 06:46:00.239,Lband
15,41,2023-01-05 06:47:00.250,Lband
15,41,2023-01-05 06:48:00.225,Lband
15,41,2023-01-05 06:49:00.253,Lband
15,41,2023-01-05 06:50:00.209,Lband
15,41,2023-01-05 06:51:00.302,Lband
15,41,2023-01-05 06:52:00.199,Lband
15,41,2023-01-05 06:53:00.365,Lband
15,41,2023-01-05 06:54:00.285,Lband
15,41,2023-01-05 06:55:00.264,Lband
15,41,2023-01-05 06:56:00.295,Lband
15,41,2023-01-05 06:57:00.251,Lband
14,41,2023-01-05 06:58:00.287,Lband
14,41,2023-01-05 06:59:00.263,Lband
15,41,2023-01-05 07:00:00.218,Lband
15,41,2023-01-05 07:01:00.204,Lband
15,41,2023-01-05 07:02:00.255,Lband
14,41,2023-01-05 07:03:00.315,Lband
15,41,2023-01-05 07:04:00.303,Lband
15,41,2023-01-05 07:05:00.307,Lband
14,41,2023-01-05 07:06:00.251,Lband
14,41,2023-01-05 07:07:00.295,Lband
15,41,2023-01-05 07:08:00.204,Lband
15,41,2023-01-05 07:09:00.216,Lband
14,41,2023-01-05 07:10:00.266,Lband
14,41,2023-01-05 07:11:00.260,Lband
15,41,2023-01-05 07:12:00.179,Lband
15,41,2023-01-05 07:13:00.206,Lband
14,41,2023-01-05 07:14:00.245,Lband
14,41,2023-01-05 07:15:00.311,Lband
14,41,2023-01-05 07:16:00.251,Lband
15,41,2023-01-05 07:17:00.318,Lband
14,41,2023-01-05 07:18:00.250,Lband
14,41,2023-01-05 07:19:00.295,Lband
14,41,2023-01-05 07:20:00.261,Lband
14,41,2023-01-05 07:21:00.237,Lband
15,41,2023-01-05 07:22:00.271,Lband
14,41,2023-01-05 07:23:00.207,Lband
14,41,2023-01-05 07:24:00.317,Lband
14,41,2023-01-05 07:25:00.302,Lband
14,41,2023-01-05 07:26:00.328,Lband
14,41,2023-01-05 07:27:00.250,Lband
15,41,2023-01-05 07:28:00.259,Lband
15,41,2023-01-05 07:29:00.225,Lband
15,41,2023-01-05 07:30:00.251,Lband
15,41,2023-01-05 07:31:00.243,Lband
14,41,2023-01-05 07:32:00.215,Lband
14,41,2023-01-05 07:33:00.318,Lband
15,41,2023-01-05 07:34:00.243,Lband
15,41,2023-01-05 07:35:00.268,Lband
15,41,2023-01-05 07:36:00.193,Lband
14,41,2023-01-05 07:37:00.245,Lband
14,41,2023-01-05 07:38:00.268,Lband
14,41,2023-01-05 07:39:00.257,Lband
15,41,2023-01-05 07:40:00.251,Lband
15,41,2023-01-05 07:41:00.259,Lband
15,41,2023-01-05 07:42:00.242,Lband
14,41,2023-01-05 07:43:00.315,Lband
14,41,2023-01-05 07:44:00.313,Lband
15,41,2023-01-05 07:45:00.300,Lband
15,41,2023-01-05 07:46:00.299,Lband
15,41,2023-01-05 07:47:00.260,Lband
15,41,2023-01-05 07:48:00.285,Lband
14,41,2023-01-05 07:49:00.275,Lband
15,41,2023-01-05 07:50:00.345,Lband
15,41,2023-01-05 07:51:00.254,Lband
15,41,2023-01-05 07:52:00.287,Lband
15,41,2023-01-05 07:53:00.219,Lband
15,41,2023-01-05 07:54:00.262,Lband
15,41,2023-01-05 07:55:00.260,Lband
15,41,2023-01-05 07:56:00.255,Lband
15,41,2023-01-05 07:57:00.207,Lband
15,41,2023-01-05 07:58:00.269,Lband
15,41,2023-01-05 07:59:00.309,Lband
15,41,2023-01-05 08:00:00.306,Lband
15,41,2023-01-05 08:01:00.311,Lband
14,41,2023-01-05 08:02:00.264,Lband
15,41,2023-01-05 08:03:00.259,Lband
15,41,2023-01-05 08:04:00.308,Lband
15,41,2023-01-05 08:05:00.278,Lband
15,41,2023-01-05 08:06:00.211,Lband
14,41,2023-01-05 08:07:00.260,Lband
14,41,2023-01-05 08:08:00.214,Lband
15,41,2023-01-05 08:09:00.234,Lband
15,41,2023-01-05 08:10:00.285,Lband
15,41,2023-01-05 08:11:00.346,Lband
15,41,2023-01-05 08:12:00.248,Lband
15,41,2023-01-05 08:13:00.311,Lband
15,41,2023-01-05 08:14:00.237,Lband
14,42,2023-01-05 08:15:00.305,Lband
14,41,2023-01-05 08:16:00.267,Lband
15,41,2023-01-05 08:17:00.217,Lband
15,41,2023-01-05 08:18:00.324,Lband
15,41,2023-01-05 08:19:00.307,Lband
15,41,2023-01-05 08:20:00.356,Lband
15,42,2023-01-05 08:21:00.314,Lband
15,41,2023-01-05 08:22:00.202,Lband
14,42,2023-01-05 08:23:00.265,Lband
14,42,2023-01-05 08:24:00.250,Lband
15,42,2023-01-05 08:25:00.262,Lband
15,42,2023-01-05 08:26:00.197,Lband
15,42,2023-01-05 08:27:00.361,Lband
15,42,2023-01-05 08:28:00.249,Lband
15,42,2023-01-05 08:29:00.203,Lband
15,42,2023-01-05 08:30:00.229,Lband
15,42,2023-01-05 08:31:00.271,Lband
15,42,2023-01-05 08:32:00.302,Lband
15,42,2023-01-05 08:33:00.284,Lband
15,42,2023-01-05 08:34:00.261,Lband
15,42,2023-01-05 08:35:00.197,Lband
15,42,2023-01-05 08:36:00.252,Lband
15,42,2023-01-05 08:37:00.211,Lband
15,42,2023-01-05 08:38:00.264,Lband
15,42,2023-01-05 08:39:00.252,Lband
15,42,2023-01-05 08:40:00.199,Lband
15,42,2023-01-05 08:41:00.266,Lband
15,42,2023-01-05 08:42:00.234,Lband
15,42,2023-01-05 08:43:00.226,Lband
15,42,2023-01-05 08:44:00.266,Lband
15,42,2023-01-05 08:45:00.261,Lband
15,42,2023-01-05 08:46:00.219,Lband
15,42,2023-01-05 08:47:00.265,Lband
15,42,2023-01-05 08:48:00.261,Lband
15,42,2023-01-05 08:49:00.407,Lband
15,42,2023-01-05 08:50:00.289,Lband
15,42,2023-01-05 08:51:00.195,Lband
15,42,2023-01-05 08:52:00.325,Lband
15,42,2023-01-05 08:53:00.193,Lband
15,42,2023-01-05 08:54:00.287,Lband
15,42,2023-01-05 08:55:00.278,Lband
15,42,2023-01-05 08:56:00.202,Lband
15,42,2023-01-05 08:57:00.191,Lband
15,42,2023-01-05 08:58:00.288,Lband
15,42,2023-01-05 08:59:00.277,Lband
15,42,2023-01-05 09:00:00.305,Lband
15,42,2023-01-05 09:01:00.286,Lband
15,42,2023-01-05 09:02:00.324,Lband
15,42,2023-01-05 09:03:00.279,Lband
15,42,2023-01-05 09:04:00.307,Lband
15,42,2023-01-05 09:05:00.198,Lband
15,42,2023-01-05 09:06:00.310,Lband
15,42,2023-01-05 09:07:00.276,Lband
15,42,2023-01-05 09:08:00.200,Lband
15,42,2023-01-05 09:09:00.243,Lband
15,42,2023-01-05 09:10:00.323,Lband
15,42,2023-01-05 09:11:00.185,Lband
15,42,2023-01-05 09:12:00.276,Lband
15,42,2023-01-05 09:13:00.195,Lband
15,42,2023-01-05 09:14:00.215,Lband
15,42,2023-01-05 09:15:00.307,Lband
15,42,2023-01-05 09:16:00.297,Lband
15,42,2023-01-05 09:17:00.320,Lband
15,42,2023-01-05 09:18:00.238,Lband
15,42,2023-01-05 09:19:00.295,Lband
15,42,2023-01-05 09:20:00.277,Lband
15,42,2023-01-05 09:21:00.271,Lband
15,42,2023-01-05 09:22:00.297,Lband
15,42,2023-01-05 09:23:00.258,Lband
15,42,2023-01-05 09:24:00.206,Lband
15,42,2023-01-05 09:25:00.264,Lband
15,42,2023-01-05 09:26:00.249,Lband
15,42,2023-01-05 09:27:00.259,Lband
15,42,2023-01-05 09:28:00.266,Lband
15,42,2023-01-05 09:29:00.241,Lband
15,42,2023-01-05 09:30:00.261,Lband
15,42,2023-01-05 09:31:00.195,Lband
15,42,2023-01-05 09:32:00.232,Lband
15,42,2023-01-05 09:33:00.233,Lband
15,42,2023-01-05 09:34:00.225,Lband
15,42,2023-01-05 09:35:00.201,Lband
15,42,2023-01-05 09:36:00.274,Lband
15,42,2023-01-05 09:37:00.241,Lband
15,42,2023-01-05 09:38:00.262,Lband
15,42,2023-01-05 09:39:00.268,Lband
15,42,2023-01-05 09:40:00.291,Lband
15,42,2023-01-05 09:41:00.282,Lband
15,42,2023-01-05 09:42:00.306,Lband
15,43,2023-01-05 09:43:00.246,Lband
15,42,2023-01-05 09:44:00.308,Lband
15,42,2023-01-05 09:45:00.237,Lband
15,42,2023-01-05 09:46:00.317,Lband
15,43,2023-01-05 09:47:00.210,Lband
15,43,2023-01-05 09:48:00.263,Lband
15,42,2023-01-05 09:49:00.290,Lband
15,43,2023-01-05 09:50:00.355,Lband
15,43,2023-01-05 09:51:00.405,Lband
15,43,2023-01-05 09:52:00.269,Lband
15,43,2023-01-05 09:53:00.310,Lband
15,43,2023-01-05 09:54:00.207,Lband
15,43,2023-01-05 09:55:00.289,Lband
15,43,2023-01-05 09:56:00.191,Lband
15,43,2023-01-05 09:57:00.307,Lband
15,43,2023-01-05 09:58:00.249,Lband
15,43,2023-01-05 09:59:00.287,Lband
15,43,2023-01-05 10:00:00.296,Lband
15,43,2023-01-05 10:01:00.286,Lband
15,43,2023-01-05 10:02:00.247,Lband
15,43,2023-01-05 10:03:00.355,Lband
15,43,2023-01-05 10:04:00.287,Lband
15,43,2023-01-05 10:05:00.282,Lband
15,43,2023-01-05 10:06:00.259,Lband
15,43,2023-01-05 10:07:00.331,Lband
15,43,2023-01-05 10:08:00.231,Lband
15,43,2023-01-05 10:09:00.276,Lband
15,43,2023-01-05 10:10:00.249,Lband
15,43,2023-01-05 10:11:00.182,Lband
15,43,2023-01-05 10:12:00.259,Lband
15,43,2023-01-05 10:13:00.214,Lband
15,43,2023-01-05 10:14:00.244,Lband
15,43,2023-01-05 10:15:00.173,Lband
16,43,2023-01-05 10:16:00.296,Lband
15,43,2023-01-05 10:17:00.249,Lband
15,43,2023-01-05 10:18:00.236,Lband
16,43,2023-01-05 10:19:00.301,Lband
15,43,2023-01-05 10:20:00.299,Lband
15,43,2023-01-05 10:21:00.203,Lband
15,43,2023-01-05 10:22:00.320,Lband
15,43,2023-01-05 10:23:00.221,Lband
15,43,2023-01-05 10:24:00.244,Lband
16,43,2023-01-05 10:25:00.191,Lband
16,43,2023-01-05 10:26:00.286,Lband
16,43,2023-01-05 10:27:00.268,Lband
16,43,2023-01-05 10:28:00.288,Lband
16,43,2023-01-05 10:29:00.278,Lband
15,43,2023-01-05 10:30:00.221,Lband
15,43,2023-01-05 10:31:00.241,Lband
16,43,2023-01-05 10:32:00.316,Lband
16,43,2023-01-05 10:33:00.321,Lband
15,43,2023-01-05 10:34:00.227,Lband
16,43,2023-01-05 10:35:00.247,Lband
16,43,2023-01-05 10:36:00.271,Lband
16,43,2023-01-05 10:37:00.321,Lband
16,43,2023-01-05 10:38:00.301,Lband
16,43,2023-01-05 10:39:00.262,Lband
16,43,2023-01-05 10:40:00.288,Lband
15,43,2023-01-05 10:41:00.239,Lband
16,43,2023-01-05 10:42:00.238,Lband
16,43,2023-01-05 10:43:00.293,Lband
16,43,2023-01-05 10:44:00.320,Lband
16,43,2023-01-05 10:45:00.283,Lband
16,43,2023-01-05 10:46:00.262,Lband
16,43,2023-01-05 10:47:00.296,Lband
16,43,2023-01-05 10:48:00.233,Lband
16,43,2023-01-05 10:49:00.268,Lband
16,43,2023-01-05 10:50:00.184,Lband
16,43,2023-01-05 10:51:00.188,Lband
16,43,2023-01-05 10:52:00.270,Lband
16,43,2023-01-05 10:53:00.233,Lband
16,43,2023-01-05 10:54:00.256,Lband
16,43,2023-01-05 10:55:00.305,Lband
16,43,2023-01-05 10:56:00.193,Lband
16,43,2023-01-05 10:57:00.204,Lband
16,43,2023-01-05 10:58:00.239,Lband
16,43,2023-01-05 10:59:00.297,Lband
16,43,2023-01-05 11:00:00.215,Lband
16,43,2023-01-05 11:01:00.244,Lband
16,43,2023-01-05 11:02:00.300,Lband
16,43,2023-01-05 11:03:00.245,Lband
16,43,2023-01-05 11:04:00.177,Lband
16,43,2023-01-05 11:05:00.270,Lband
16,43,2023-01-05 11:06:00.225,Lband
16,43,2023-01-05 11:07:00.251,Lband
16,43,2023-01-05 11:08:00.272,Lband
16,43,2023-01-05 11:09:00.260,Lband
16,43,2023-01-05 11:10:00.248,Lband
16,43,2023-01-05 11:11:00.260,Lband
16,43,2023-01-05 11:12:00.260,Lband
16,43,2023-01-05 11:13:00.247,Lband
16,43,2023-01-05 11:14:00.251,Lband
16,43,2023-01-05 11:15:00.203,Lband
16,43,2023-01-05 11:16:00.250,Lband
16,43,2023-01-05 11:17:00.303,Lband
16,43,2023-01-05 11:18:00.311,Lband
16,43,2023-01-05 11:19:00.252,Lband
16,43,2023-01-05 11:20:00.189,Lband
16,43,2023-01-05 11:21:00.180,Lband
16,43,2023-01-05 11:22:00.262,Lband
16,43,2023-01-05 11:23:00.226,Lband
16,43,2023-01-05 11:24:00.264,Lband
15,43,2023-01-05 11:25:00.298,Lband
15,43,2023-01-05 11:26:00.199,Lband
15,43,2023-01-05 11:27:00.236,Lband
16,43,2023-01-05 11:28:00.252,Lband
15,43,2023-01-05 11:29:00.325,Lband
15,43,2023-01-05 11:30:00.207,Lband
15,43,2023-01-05 11:31:00.267,Lband
15,43,2023-01-05 11:32:00.225,Lband
16,43,2023-01-05 11:33:00.257,Lband
16,43,2023-01-05 11:34:00.325,Lband
16,43,2023-01-05 11:35:00.250,Lband
16,43,2023-01-05 11:36:00.311,Lband
16,43,2023-01-05 11:37:00.204,Lband
16,43,2023-01-05 11:38:00.304,Lband
16,43,2023-01-05 11:39:00.261,Lband
16,43,2023-01-05 11:40:00.196,Lband
16,43,2023-01-05 11:41:00.297,Lband
16,43,2023-01-05 11:42:00.247,Lband
16,43,2023-01-05 11:43:00.294,Lband
16,43,2023-01-05 11:44:00.152,Lband
16,43,2023-01-05 11:45:00.262,Lband
16,43,2023-01-05 11:46:00.209,Lband
16,43,2023-01-05 11:47:00.285,Lband
16,43,2023-01-05 11:48:00.268,Lband
16,43,2023-01-05 11:49:00.220,Lband
16,43,2023-01-05 11:50:00.254,Lband
16,43,2023-01-05 11:51:00.292,Lband
16,43,2023-01-05 11:52:00.301,Lband
16,43,2023-01-05 11:53:00.206,Lband
16,43,2023-01-05 11:54:00.278,Lband
16,43,2023-01-05 11:55:00.207,Lband
16,43,2023-01-05 11:56:00.228,Lband
16,43,2023-01-05 11:57:00.198,Lband
16,43,2023-01-05 11:58:00.213,Lband
16,43,2023-01-05 11:59:00.275,Lband
16,43,2023-01-05 12:00:00.251,Lband
16,43,2023-01-05 12:01:00.240,Lband
16,43,2023-01-05 12:02:00.250,Lband
16,43,2023-01-05 12:03:00.294,Lband
16,44,2023-01-05 12:04:00.263,Lband
16,43,2023-01-05 12:05:00.146,Lband
16,43,2023-01-05 12:06:00.327,Lband
16,43,2023-01-05 12:07:00.154,Lband
16,44,2023-01-05 12:08:00.307,Lband
16,44,2023-01-05 12:09:00.193,Lband
16,44,2023-01-05 12:10:00.240,Lband
16,44,2023-01-05 12:11:00.247,Lband
16,43,2023-01-05 12:12:00.192,Lband
16,44,2023-01-05 12:13:00.263,Lband
16,44,2023-01-05 12:14:00.218,Lband
16,44,2023-01-05 12:15:00.304,Lband
16,44,2023-01-05 12:16:00.297,Lband
16,44,2023-01-05 12:17:00.210,Lband
16,44,2023-01-05 12:18:00.226,Lband
16,44,2023-01-05 12:19:00.243,Lband
16,44,2023-01-05 12:20:00.292,Lband
16,44,2023-01-05 12:21:00.257,Lband
16,44,2023-01-05 12:22:00.311,Lband
16,44,2023-01-05 12:23:00.352,Lband
16,44,2023-01-05 12:24:00.303,Lband
16,44,2023-01-05 12:25:00.247,Lband
16,44,2023-01-05 12:26:00.268,Lband
16,44,2023-01-05 12:27:00.265,Lband
16,44,2023-01-05 12:28:00.185,Lband
16,44,2023-01-05 12:29:00.259,Lband
16,44,2023-01-05 12:30:00.302,Lband
16,44,2023-01-05 12:31:00.253,Lband
16,44,2023-01-05 12:32:00.230,Lband
16,44,2023-01-05 12:33:00.299,Lband
16,44,2023-01-05 12:34:00.311,Lband
16,44,2023-01-05 12:35:00.304,Lband
16,44,2023-01-05 12:36:00.308,Lband
16,44,2023-01-05 12:37:00.252,Lband
16,44,2023-01-05 12:38:00.193,Lband
16,44,2023-01-05 12:39:00.247,Lband
16,44,2023-01-05 12:40:00.189,Lband
16,44,2023-01-05 12:41:00.311,Lband
16,44,2023-01-05 12:42:00.288,Lband
16,44,2023-01-05 12:43:00.242,Lband
16,44,2023-01-05 12:44:00.299,Lband
16,44,2023-01-05 12:45:00.303,Lband
16,44,2023-01-05 12:46:00.267,Lband
16,44,2023-01-05 12:47:00.226,Lband
16,44,2023-01-05 12:48:00.311,Lband
16,44,2023-01-05 12:49:00.297,Lband
16,44,2023-01-05 12:50:00.303,Lband
16,44,2023-01-05 12:51:00.185,Lband
16,44,2023-01-05 12:52:00.243,Lband
16,44,2023-01-05 12:53:00.287,Lband
16,44,2023-01-05 12:54:00.246,Lband
16,44,2023-01-05 12:55:00.226,Lband
16,44,2023-01-05 12:56:00.201,Lband
16,44,2023-01-05 12:57:00.248,Lband
16,44,2023-01-05 12:58:00.260,Lband
16,44,2023-01-05 12:59:00.286,Lband
17,44,2023-01-05 13:00:00.306,Lband
16,44,2023-01-05 13:01:00.196,Lband
16,44,2023-01-05 13:02:00.229,Lband
16,44,2023-01-05 13:03:00.301,Lband
17,44,2023-01-05 13:04:00.200,Lband
17,44,2023-01-05 13:05:00.315,Lband
17,44,2023-01-05 13:06:00.313,Lband
17,44,2023-01-05 13:07:00.250,Lband
17,44,2023-01-05 13:08:00.241,Lband
17,44,2023-01-05 13:09:00.267,Lband
17,44,2023-01-05 13:10:00.303,Lband
17,44,2023-01-05 13:11:00.317,Lband
17,44,2023-01-05 13:12:00.272,Lband
17,44,2023-01-05 13:13:00.254,Lband
17,44,2023-01-05 13:14:00.320,Lband
17,44,2023-01-05 13:15:00.253,Lband
17,44,2023-01-05 13:16:00.307,Lband
17,44,2023-01-05 13:17:00.291,Lband
17,44,2023-01-05 13:18:00.322,Lband
17,44,2023-01-05 13:19:00.279,Lband
17,44,2023-01-05 13:20:00.260,Lband
17,44,2023-01-05 13:21:00.232,Lband
17,44,2023-01-05 13:22:00.211,Lband
17,44,2023-01-05 13:23:00.304,Lband
17,44,2023-01-05 13:24:00.257,Lband
17,44,2023-01-05 13:25:00.351,Lband
17,44,2023-01-05 13:26:00.316,Lband
17,44,2023-01-05 13:27:00.203,Lband
17,44,2023-01-05 13:28:00.210,Lband
17,44,2023-01-05 13:29:00.196,Lband
17,44,2023-01-05 13:30:00.270,Lband
17,44,2023-01-05 13:31:00.245,Lband
17,44,2023-01-05 13:32:00.287,Lband
17,44,2023-01-05 13:33:00.205,Lband
17,44,2023-01-05 13:34:00.317,Lband
17,44,2023-01-05 13:35:00.272,Lband
17,44,2023-01-05 13:36:00.320,Lband
17,44,2023-01-05 13:37:00.253,Lband
17,44,2023-01-05 13:38:00.202,Lband
17,44,2023-01-05 13:39:00.242,Lband
17,44,2023-01-05 13:40:00.199,Lband
17,44,2023-01-05 13:41:00.241,Lband
17,44,2023-01-05 13:42:00.245,Lband
17,44,2023-01-05 13:43:00.261,Lband
17,44,2023-01-05 13:44:00.256,Lband
17,44,2023-01-05 13:45:00.317,Lband
17,44,2023-01-05 13:46:00.269,Lband
17,44,2023-01-05 13:47:00.261,Lband
17,44,2023-01-05 13:48:00.243,Lband
17,44,2023-01-05 13:49:00.288,Lband
17,44,2023-01-05 13:50:00.256,Lband
17,44,2023-01-05 13:51:00.220,Lband
17,44,2023-01-05 13:52:00.201,Lband
17,44,2023-01-05 13:53:00.318,Lband
17,44,2023-01-05 13:54:00.258,Lband
17,44,2023-01-05 13:55:00.236,Lband
17,44,2023-01-05 13:56:00.215,Lband
17,44,2023-01-05 13:57:00.269,Lband
17,44,2023-01-05 13:58:00.249,Lband
17,44,2023-01-05 13:59:00.312,Lband
17,44,2023-01-05 14:00:00.318,Lband
17,44,2023-01-05 14:01:00.294,Lband
17,44,2023-01-05 14:02:00.251,Lband
17,44,2023-01-05 14:03:00.285,Lband
17,44,2023-01-05 14:04:00.283,Lband
17,44,2023-01-05 14:05:00.227,Lband
17,44,2023-01-05 14:06:00.310,Lband
17,44,2023-01-05 14:07:00.282,Lband
17,44,2023-01-05 14:08:00.280,Lband
17,44,2023-01-05 14:09:00.189,Lband
17,44,2023-01-05 14:10:00.243,Lband
17,44,2023-01-05 14:11:00.259,Lband
17,44,2023-01-05 14:12:00.259,Lband
17,44,2023-01-05 14:13:00.268,Lband
17,44,2023-01-05 14:14:00.218,Lband
17,44,2023-01-05 14:15:00.263,Lband
17,44,2023-01-05 14:16:00.261,Lband
17,44,2023-01-05 14:17:00.303,Lband
17,44,2023-01-05 14:18:00.313,Lband
17,44,2023-01-05 14:19:00.205,Lband
17,44,2023-01-05 14:20:00.265,Lband
17,44,2023-01-05 14:21:00.246,Lband
17,44,2023-01-05 14:22:00.401,Lband
17,44,2023-01-05 14:23:00.240,Lband
17,44,2023-01-05 14:24:00.305,Lband
17,44,2023-01-05 14:25:00.262,Lband
17,44,2023-01-05 14:26:00.234,Lband
17,44,2023-01-05 14:27:00.233,Lband
17,44,2023-01-05 14:28:00.286,Lband
17,44,2023-01-05 14:29:00.254,Lband
17,44,2023-01-05 14:30:00.320,Lband
17,44,2023-01-05 14:31:00.250,Lband
17,44,2023-01-05 14:32:00.294,Lband
17,44,2023-01-05 14:33:00.251,Lband
17,44,2023-01-05 14:34:00.192,Lband
17,44,2023-01-05 14:35:00.252,Lband
17,44,2023-01-05 14:36:00.277,Lband
17,44,2023-01-05 14:37:00.270,Lband
17,44,2023-01-05 14:38:00.279,Lband
17,44,2023-01-05 14:39:00.247,Lband
17,44,2023-01-05 14:40:00.299,Lband
17,44,2023-01-05 14:41:00.242,Lband
17,44,2023-01-05 14:42:00.318,Lband
17,44,2023-01-05 14:43:00.254,Lband
17,44,2023-01-05 14:44:00.267,Lband
17,44,2023-01-05 14:45:00.241,Lband
17,44,2023-01-05 14:46:00.236,Lband
17,44,2023-01-05 14:47:00.259,Lband
17,44,2023-01-05 14:48:00.257,Lband
17,44,2023-01-05 14:49:00.283,Lband
17,44,2023-01-05 14:50:00.262,Lband
17,44,2023-01-05 14:51:00.285,Lband
17,44,2023-01-05 14:52:00.185,Lband
17,44,2023-01-05 14:53:00.214,Lband
17,44,2023-01-05 14:54:00.280,Lband
17,44,2023-01-05 14:55:00.193,Lband
17,44,2023-01-05 14:56:00.233,Lband
17,44,2023-01-05 14:57:00.260,Lband
17,44,2023-01-05 14:58:00.306,Lband
17,44,2023-01-05 14:59:00.268,Lband
17,44,2023-01-05 15:00:00.312,Lband
17,44,2023-01-05 15:01:00.201,Lband
17,44,2023-01-05 15:02:00.302,Lband
17,44,2023-01-05 15:03:00.292,Lband
17,44,2023-01-05 15:04:00.264,Lband
17,44,2023-01-05 15:05:00.282,Lband
17,45,2023-01-05 15:06:00.214,Lband
17,44,2023-01-05 15:07:00.306,Lband
17,44,2023-01-05 15:08:00.277,Lband
17,45,2023-01-05 15:09:00.237,Lband
17,45,2023-01-05 15:10:00.301,Lband
17,45,2023-01-05 15:11:00.283,Lband
17,45,2023-01-05 15:12:00.268,Lband
17,45,2023-01-05 15:13:00.208,Lband
17,45,2023-01-05 15:14:00.180,Lband
17,45,2023-01-05 15:15:00.254,Lband
17,45,2023-01-05 15:16:00.294,Lband
17,45,2023-01-05 15:17:00.311,Lband
17,45,2023-01-05 15:18:00.205,Lband
17,45,2023-01-05 15:19:00.205,Lband
17,45,2023-01-05 15:20:00.291,Lband
17,45,2023-01-05 15:21:00.244,Lband
17,45,2023-01-05 15:22:00.193,Lband
17,45,2023-01-05 15:23:00.259,Lband
17,45,2023-01-05 15:24:00.261,Lband
17,45,2023-01-05 15:25:00.182,Lband
17,45,2023-01-05 15:26:00.263,Lband
17,45,2023-01-05 15:27:00.234,Lband
17,45,2023-01-05 15:28:00.180,Lband
17,45,2023-01-05 15:29:00.198,Lband
17,45,2023-01-05 15:30:00.268,Lband
17,45,2023-01-05 15:31:00.262,Lband
17,45,2023-01-05 15:32:00.325,Lband
17,45,2023-01-05 15:33:00.179,Lband
17,45,2023-01-05 15:34:00.244,Lband
17,45,2023-01-05 15:35:00.245,Lband
17,45,2023-01-05 15:36:00.268,Lband
17,45,2023-01-05 15:37:00.221,Lband
17,45,2023-01-05 15:38:00.258,Lband
17,45,2023-01-05 15:39:00.303,Lband
17,45,2023-01-05 15:40:00.232,Lband
18,45,2023-01-05 15:41:00.240,Lband
17,45,2023-01-05 15:42:00.303,Lband
18,45,2023-01-05 15:43:00.248,Lband
17,45,2023-01-05 15:44:00.265,Lband
18,45,2023-01-05 15:45:00.220,Lband
18,45,2023-01-05 15:46:00.264,Lband
17,45,2023-01-05 15:47:00.244,Lband
18,45,2023-01-05 15:48:00.186,Lband
18,45,2023-01-05 15:49:00.284,Lband
18,45,2023-01-05 15:50:00.248,Lband
18,45,2023-01-05 15:51:00.393,Lband
18,45,2023-01-05 15:52:00.214,Lband
18,45,2023-01-05 15:53:00.274,Lband
17,45,2023-01-05 15:54:00.255,Lband
18,45,2023-01-05 15:55:00.275,Lband
18,45,2023-01-05 15:56:00.301,Lband
18,45,2023-01-05 15:57:00.198,Lband
18,45,2023-01-05 15:58:00.304,Lband
18,45,2023-01-05 15:59:00.299,Lband
18,45,2023-01-05 16:00:00.328,Lband
18,45,2023-01-05 16:01:00.252,Lband
18,45,2023-01-05 16:02:00.216,Lband
18,45,2023-01-05 16:03:00.317,Lband
18,45,2023-01-05 16:04:00.252,Lband
18,45,2023-01-05 16:05:00.186,Lband
18,45,2023-01-05 16:06:00.315,Lband
18,45,2023-01-05 16:07:00.181,Lband
18,45,2023-01-05 16:08:00.261,Lband
18,45,2023-01-05 16:09:00.293,Lband
18,45,2023-01-05 16:10:00.254,Lband
18,45,2023-01-05 16:11:00.301,Lband
18,45,2023-01-05 16:12:00.201,Lband
18,45,2023-01-05 16:13:00.265,Lband
18,45,2023-01-05 16:14:00.249,Lband
18,45,2023-01-05 16:15:00.300,Lband
18,45,2023-01-05 16:16:00.218,Lband
18,45,2023-01-05 16:17:00.233,Lband
18,45,2023-01-05 16:18:00.314,Lband
18,45,2023-01-05 16:19:00.276,Lband
18,45,2023-01-05 16:20:00.249,Lband
18,45,2023-01-05 16:21:00.252,Lband
18,45,2023-01-05 16:22:00.319,Lband
18,45,2023-01-05 16:23:00.226,Lband
18,45,2023-01-05 16:24:00.264,Lband
18,45,2023-01-05 16:25:00.228,Lband
18,45,2023-01-05 16:26:00.260,Lband
18,45,2023-01-05 16:27:00.269,Lband
18,45,2023-01-05 16:28:00.249,Lband
18,45,2023-01-05 16:29:00.281,Lband
26,46,2023-01-05 16:30:01.034,Lband
29,48,2023-01-05 16:31:00.561,Lband
32,50,2023-01-05 16:32:00.275,Lband
33,52,2023-01-05 16:33:00.557,Lband
80,123,2023-01-05 17:31:00.975,Lband
80,122,2023-01-05 17:32:00.304,Lband
80,122,2023-01-05 17:33:00.602,Lband
79,121,2023-01-05 17:34:00.247,Lband
79,120,2023-01-05 17:35:00.646,Lband
79,120,2023-01-05 17:36:00.247,Lband
79,119,2023-01-05 17:37:00.669,Lband
79,119,2023-01-05 17:38:00.189,Lband
79,118,2023-01-05 17:39:00.600,Lband
79,118,2023-01-05 17:40:00.243,Lband
78,117,2023-01-05 17:41:00.587,Lband
78,116,2023-01-05 17:42:00.394,Lband
78,116,2023-01-05 17:43:00.722,Lband
78,115,2023-01-05 17:44:00.310,Lband
78,115,2023-01-05 17:45:00.607,Lband
78,114,2023-01-05 17:46:00.304,Lband
78,114,2023-01-05 17:47:00.601,Lband
78,113,2023-01-05 17:48:00.180,Lband
77,112,2023-01-05 17:49:00.658,Lband
77,112,2023-01-05 17:50:00.304,Lband
76,111,2023-01-05 17:51:00.550,Lband
76,111,2023-01-05 17:52:00.311,Lband
76,110,2023-01-05 17:53:00.580,Lband
76,109,2023-01-05 17:54:00.245,Lband
76,109,2023-01-05 17:55:00.597,Lband
75,108,2023-01-05 17:56:00.314,Lband
75,108,2023-01-05 17:57:00.566,Lband
75,107,2023-01-05 17:58:00.231,Lband
75,106,2023-01-05 17:59:00.623,Lband
75,106,2023-01-05 18:00:00.271,Lband
74,105,2023-01-05 18:01:00.649,Lband
74,104,2023-01-05 18:02:00.228,Lband
74,104,2023-01-05 18:03:00.691,Lband
74,103,2023-01-05 18:04:00.272,Lband
73,103,2023-01-05 18:05:00.696,Lband
73,102,2023-01-05 18:06:00.250,Lband
73,101,2023-01-05 18:07:00.624,Lband
73,101,2023-01-05 18:08:00.173,Lband
72,100,2023-01-05 18:09:00.591,Lband
72,99,2023-01-05 18:10:00.263,Lband
72,98,2023-01-05 18:11:00.633,Lband
72,98,2023-01-05 18:12:00.237,Lband
71,97,2023-01-05 18:13:00.584,Lband
71,97,2023-01-05 18:14:00.228,Lband
71,96,2023-01-05 18:15:00.577,Lband
71,95,2023-01-05 18:16:00.348,Lband
70,95,2023-01-05 18:17:00.693,Lband
70,94,2023-01-05 18:18:00.299,Lband
70,94,2023-01-05 18:19:00.568,Lband
70,93,2023-01-05 18:20:00.302,Lband
69,93,2023-01-05 18:21:00.634,Lband
69,92,2023-01-05 18:22:00.242,Lband
69,92,2023-01-05 18:23:00.615,Lband
68,91,2023-01-05 18:24:00.250,Lband
68,91,2023-01-05 18:25:00.596,Lband
68,90,2023-01-05 18:26:00.238,Lband
67,89,2023-01-05 18:27:00.702,Lband
67,89,2023-01-05 18:28:00.351,Lband
67,88,2023-01-05 18:29:00.607,Lband
67,88,2023-01-05 18:30:00.259,Lband
66,88,2023-01-05 18:31:00.573,Lband
66,87,2023-01-05 18:32:00.260,Lband
66,87,2023-01-05 18:33:00.580,Lband
65,86,2023-01-05 18:34:00.256,Lband
65,86,2023-01-05 18:35:00.639,Lband
65,85,2023-01-05 18:36:00.206,Lband
64,85,2023-01-05 18:37:00.675,Lband
64,84,2023-01-05 18:38:00.243,Lband
64,84,2023-01-05 18:39:00.622,Lband
64,84,2023-01-05 18:40:00.210,Lband
63,83,2023-01-05 18:41:00.615,Lband
63,83,2023-01-05 18:42:00.212,Lband
63,82,2023-01-05 18:43:00.625,Lband
63,82,2023-01-05 18:44:00.202,Lband
62,82,2023-01-05 18:45:00.563,Lband
62,81,2023-01-05 18:46:00.201,Lband
62,81,2023-01-05 18:47:00.687,Lband
61,80,2023-01-05 18:48:00.318,Lband
61,80,2023-01-05 18:49:00.594,Lband
61,80,2023-01-05 18:50:00.251,Lband
60,79,2023-01-05 18:51:00.637,Lband
60,79,2023-01-05 18:52:00.221,Lband
60,79,2023-01-05 18:53:00.727,Lband
60,79,2023-01-05 18:54:00.297,Lband
59,78,2023-01-05 18:55:00.651,Lband
59,78,2023-01-05 18:56:00.189,Lband
59,78,2023-01-05 18:57:00.694,Lband
58,77,2023-01-05 18:58:00.247,Lband
58,77,2023-01-05 18:59:00.619,Lband
58,76,2023-01-05 19:00:00.199,Lband
58,76,2023-01-05 19:01:00.563,Lband
57,76,2023-01-05 19:02:00.296,Lband
57,76,2023-01-05 19:03:00.782,Lband
57,75,2023-01-05 19:04:00.242,Lband
56,75,2023-01-05 19:05:00.587,Lband
56,75,2023-01-05 19:06:00.317,Lband
56,75,2023-01-05 19:07:00.747,Lband
56,75,2023-01-05 19:08:00.241,Lband
55,74,2023-01-05 19:09:00.639,Lband
55,74,2023-01-05 19:10:00.287,Lband
55,74,2023-01-05 19:11:00.596,Lband
54,74,2023-01-05 19:12:00.314,Lband
54,73,2023-01-05 19:13:00.650,Lband
54,73,2023-01-05 19:14:00.195,Lband
54,73,2023-01-05 19:15:00.604,Lband
53,73,2023-01-05 19:16:00.241,Lband
53,72,2023-01-05 19:17:00.625,Lband
53,72,2023-01-05 19:18:00.308,Lband
53,72,2023-01-05 19:19:00.745,Lband
52,71,2023-01-05 19:20:00.243,Lband
52,71,2023-01-05 19:21:00.804,Lband
52,71,2023-01-05 19:22:00.324,Lband
51,71,2023-01-05 19:23:00.590,Lband
51,70,2023-01-05 19:24:00.249,Lband
51,70,2023-01-05 19:25:00.664,Lband
50,70,2023-01-05 19:26:00.242,Lband
50,69,2023-01-05 19:27:00.685,Lband
49,69,2023-01-05 19:28:00.260,Lband
49,69,2023-01-05 19:29:00.582,Lband
49,68,2023-01-05 19:30:00.299,Lband
49,68,2023-01-05 19:31:00.588,Lband
48,68,2023-01-05 19:32:00.274,Lband
48,67,2023-01-05 19:33:00.577,Lband
48,67,2023-01-05 19:34:00.206,Lband
47,67,2023-01-05 19:35:00.592,Lband
47,66,2023-01-05 19:36:00.247,Lband
47,66,2023-01-05 19:37:00.587,Lband
46,65,2023-01-05 19:38:00.308,Lband
46,65,2023-01-05 19:39:00.597,Lband
45,64,2023-01-05 19:40:00.242,Lband
45,64,2023-01-05 19:41:00.668,Lband
45,63,2023-01-05 19:42:00.254,Lband
44,63,2023-01-05 19:43:00.580,Lband
44,62,2023-01-05 19:44:00.223,Lband
43,61,2023-01-05 19:45:00.658,Lband
42,60,2023-01-05 19:46:00.253,Lband
42,59,2023-01-05 19:47:00.658,Lband
41,58,2023-01-05 19:48:00.222,Lband
41,57,2023-01-05 19:49:00.764,Lband
40,56,2023-01-05 19:50:00.261,Lband
39,55,2023-01-05 19:51:00.586,Lband
39,54,2023-01-05 19:52:00.293,Lband
38,53,2023-01-05 19:53:00.631,Lband
37,51,2023-01-05 19:54:00.199,Lband
36,50,2023-01-05 19:55:00.626,Lband
35,48,2023-01-05 19:56:00.299,Lband
34,47,2023-01-05 19:57:00.700,Lband
33,45,2023-01-05 19:58:00.301,Lband
32,44,2023-01-05 19:59:00.593,Lband
31,43,2023-01-05 20:00:00.237,Lband
30,42,2023-01-05 20:01:00.539,Lband
29,41,2023-01-05 20:02:00.378,Lband
28,40,2023-01-05 20:03:00.703,Lband
26,40,2023-01-05 20:04:00.291,Lband
25,39,2023-01-05 20:05:00.672,Lband
24,38,2023-01-05 20:06:00.277,Lband
23,38,2023-01-05 20:07:00.604,Lband
22,37,2023-01-05 20:08:00.148,Lband
21,37,2023-01-05 20:09:00.547,Lband
20,37,2023-01-05 20:10:00.236,Lband
19,36,2023-01-05 20:11:00.775,Lband
19,36,2023-01-05 20:12:00.305,Lband
18,36,2023-01-05 20:13:00.595,Lband
20,37,2023-01-05 20:14:00.354,Lband
20,38,2023-01-05 20:15:00.687,Lband
20,39,2023-01-05 20:16:00.256,Lband
19,39,2023-01-05 20:17:00.656,Lband
19,40,2023-01-05 20:18:00.287,Lband
18,40,2023-01-05 20:19:00.653,Lband
17,40,2023-01-05 20:20:01.059,Lband
17,41,2023-01-05 20:21:00.246,Lband
17,41,2023-01-05 20:22:00.207,Lband
17,41,2023-01-05 20:23:00.250,Lband
17,41,2023-01-05 20:24:00.365,Lband
17,42,2023-01-05 20:25:00.466,Lband
16,42,2023-01-05 20:26:00.199,Lband
16,42,2023-01-05 20:27:00.261,Lband
16,42,2023-01-05 20:28:00.291,Lband
16,42,2023-01-05 20:29:00.284,Lband
16,43,2023-01-05 20:30:00.266,Lband
16,43,2023-01-05 20:31:00.249,Lband
16,43,2023-01-05 20:32:00.190,Lband
15,43,2023-01-05 20:33:00.256,Lband
15,43,2023-01-05 20:34:00.226,Lband
15,43,2023-01-05 20:35:00.227,Lband
15,43,2023-01-05 20:36:00.280,Lband
15,43,2023-01-05 20:37:00.226,Lband
15,43,2023-01-05 20:38:00.267,Lband
15,43,2023-01-05 20:39:00.219,Lband
15,44,2023-01-05 20:40:00.256,Lband
15,43,2023-01-05 20:41:00.252,Lband
15,44,2023-01-05 20:42:00.202,Lband
15,44,2023-01-05 20:43:00.263,Lband
14,44,2023-01-05 20:44:00.256,Lband
15,44,2023-01-05 20:45:00.360,Lband
14,44,2023-01-05 20:46:00.339,Lband
14,44,2023-01-05 20:47:00.335,Lband
14,43,2023-01-05 20:48:00.267,Lband
14,43,2023-01-05 20:49:00.258,Lband
14,43,2023-01-05 20:50:00.231,Lband
14,43,2023-01-05 20:51:00.193,Lband
14,42,2023-01-05 20:52:00.263,Lband
14,42,2023-01-05 20:53:00.204,Lband
14,42,2023-01-05 20:54:00.281,Lband
14,42,2023-01-05 20:55:00.388,Lband
14,42,2023-01-05 20:56:00.272,Lband
14,42,2023-01-05 20:57:00.239,Lband
14,42,2023-01-05 20:58:00.288,Lband
14,42,2023-01-05 20:59:00.251,Lband
14,42,2023-01-05 21:00:00.242,Lband
14,42,2023-01-05 21:01:00.346,Lband
14,42,2023-01-05 21:02:00.337,Lband
14,42,2023-01-05 21:03:00.328,Lband
14,42,2023-01-05 21:04:00.253,Lband
14,42,2023-01-05 21:05:00.328,Lband
14,42,2023-01-05 21:06:00.236,Lband
14,41,2023-01-05 21:07:00.196,Lband
14,41,2023-01-05 21:08:00.367,Lband
14,41,2023-01-05 21:09:00.262,Lband
14,41,2023-01-05 21:10:00.237,Lband
14,41,2023-01-05 21:11:00.256,Lband
14,41,2023-01-05 21:12:00.209,Lband
14,41,2023-01-05 21:13:00.202,Lband
14,42,2023-01-05 21:14:00.217,Lband
14,41,2023-01-05 21:15:00.321,Lband
14,41,2023-01-05 21:16:00.341,Lband
14,41,2023-01-05 21:17:00.317,Lband
14,41,2023-01-05 21:18:00.383,Lband
14,41,2023-01-05 21:19:00.252,Lband
14,41,2023-01-05 21:20:00.255,Lband
14,41,2023-01-05 21:21:00.273,Lband
14,41,2023-01-05 21:22:00.315,Lband
14,41,2023-01-05 21:23:00.267,Lband
14,41,2023-01-05 21:24:00.361,Lband
14,41,2023-01-05 21:25:00.340,Lband
14,41,2023-01-05 21:26:00.267,Lband
14,42,2023-01-05 21:27:00.236,Lband
14,42,2023-01-05 21:28:00.214,Lband
14,42,2023-01-05 21:29:00.246,Lband
14,42,2023-01-05 21:30:00.149,Lband
14,42,2023-01-05 21:31:00.261,Lband
14,43,2023-01-05 21:32:00.245,Lband
14,43,2023-01-05 21:33:00.236,Lband
14,43,2023-01-05 21:34:00.237,Lband
14,43,2023-01-05 21:35:00.308,Lband
14,43,2023-01-05 21:36:00.231,Lband
14,43,2023-01-05 21:37:00.188,Lband
14,43,2023-01-05 21:38:00.216,Lband
14,43,2023-01-05 21:39:00.327,Lband
14,43,2023-01-05 21:40:00.327,Lband
14,43,2023-01-05 21:41:00.302,Lband
14,43,2023-01-05 21:42:00.210,Lband
14,43,2023-01-05 21:43:00.242,Lband
14,43,2023-01-05 21:44:00.327,Lband
14,43,2023-01-05 21:45:00.351,Lband
14,43,2023-01-05 21:46:00.253,Lband
14,43,2023-01-05 21:47:00.302,Lband
14,43,2023-01-05 21:48:00.233,Lband
15,43,2023-01-05 21:49:00.200,Lband
14,43,2023-01-05 21:50:00.284,Lband
14,43,2023-01-05 21:51:00.242,Lband
14,43,2023-01-05 21:52:00.340,Lband
14,43,2023-01-05 21:53:00.333,Lband
14,43,2023-01-05 21:54:00.248,Lband
14,44,2023-01-05 21:55:00.292,Lband
15,43,2023-01-05 21:56:00.249,Lband
15,43,2023-01-05 21:57:00.200,Lband
14,43,2023-01-05 21:58:00.341,Lband
14,43,2023-01-05 21:59:00.248,Lband
15,43,2023-01-05 22:00:00.222,Lband
15,43,2023-01-05 22:01:00.356,Lband
14,43,2023-01-05 22:02:00.240,Lband
14,43,2023-01-05 22:03:00.345,Lband
14,43,2023-01-05 22:04:00.288,Lband
14,43,2023-01-05 22:05:00.358,Lband
14,43,2023-01-05 22:06:00.229,Lband
14,43,2023-01-05 22:07:00.240,Lband
14,43,2023-01-05 22:08:00.360,Lband
15,43,2023-01-05 22:09:00.305,Lband
14,43,2023-01-05 22:10:00.192,Lband
14,43,2023-01-05 22:11:00.290,Lband
14,43,2023-01-05 22:12:00.351,Lband
14,43,2023-01-05 22:13:00.307,Lband
14,43,2023-01-05 22:14:00.296,Lband
14,43,2023-01-05 22:15:00.302,Lband
14,43,2023-01-05 22:16:00.242,Lband
14,43,2023-01-05 22:17:00.220,Lband
14,43,2023-01-05 22:18:00.306,Lband
14,43,2023-01-05 22:19:00.348,Lband
14,43,2023-01-05 22:20:00.283,Lband
15,43,2023-01-05 22:21:00.196,Lband
14,43,2023-01-05 22:22:00.349,Lband
14,43,2023-01-05 22:23:00.191,Lband
14,43,2023-01-05 22:24:00.285,Lband
15,43,2023-01-05 22:25:00.296,Lband
14,43,2023-01-05 22:26:00.306,Lband
15,43,2023-01-05 22:27:00.272,Lband
15,43,2023-01-05 22:28:00.183,Lband
15,43,2023-01-05 22:29:00.205,Lband
15,43,2023-01-05 22:30:00.295,Lband
15,43,2023-01-05 22:31:00.311,Lband
15,43,2023-01-05 22:32:00.311,Lband
14,43,2023-01-05 22:33:00.196,Lband
14,43,2023-01-05 22:34:00.336,Lband
14,43,2023-01-05 22:35:00.211,Lband
15,43,2023-01-05 22:36:00.296,Lband
15,43,2023-01-05 22:37:00.288,Lband
15,43,2023-01-05 22:38:00.350,Lband
14,43,2023-01-05 22:39:00.268,Lband
14,43,2023-01-05 22:40:00.408,Lband
14,43,2023-01-05 22:41:00.297,Lband
14,43,2023-01-05 22:42:00.183,Lband
15,43,2023-01-05 22:43:00.292,Lband
14,43,2023-01-05 22:44:00.261,Lband
14,43,2023-01-05 22:45:00.262,Lband
14,43,2023-01-05 22:46:00.325,Lband
14,43,2023-01-05 22:47:00.358,Lband
14,43,2023-01-05 22:48:00.320,Lband
15,43,2023-01-05 22:49:00.355,Lband
15,43,2023-01-05 22:50:00.279,Lband
14,43,2023-01-05 22:51:00.316,Lband
15,43,2023-01-05 22:52:00.390,Lband
14,43,2023-01-05 22:53:00.315,Lband
15,43,2023-01-05 22:54:00.185,Lband
15,43,2023-01-05 22:55:00.329,Lband
14,43,2023-01-05 22:56:00.304,Lband
14,43,2023-01-05 22:57:00.261,Lband
14,44,2023-01-05 22:58:00.355,Lband
14,43,2023-01-05 22:59:00.257,Lband
14,43,2023-01-05 23:00:00.215,Lband
14,43,2023-01-05 23:01:00.278,Lband
15,43,2023-01-05 23:02:00.201,Lband
15,43,2023-01-05 23:03:00.307,Lband
15,43,2023-01-05 23:04:00.333,Lband
15,44,2023-01-05 23:05:00.316,Lband
14,43,2023-01-05 23:06:00.251,Lband
14,44,2023-01-05 23:07:00.302,Lband
14,43,2023-01-05 23:08:00.305,Lband
14,44,2023-01-05 23:09:00.289,Lband
14,44,2023-01-05 23:10:00.298,Lband
14,44,2023-01-05 23:11:00.203,Lband
14,43,2023-01-05 23:12:00.315,Lband
14,43,2023-01-05 23:13:00.295,Lband
15,43,2023-01-05 23:14:00.251,Lband
15,43,2023-01-05 23:15:00.363,Lband
14,43,2023-01-05 23:16:00.315,Lband
14,43,2023-01-05 23:17:00.298,Lband
14,43,2023-01-05 23:18:00.192,Lband
14,43,2023-01-05 23:19:00.358,Lband
15,43,2023-01-05 23:20:00.302,Lband
15,43,2023-01-05 23:21:00.267,Lband
15,43,2023-01-05 23:22:00.184,Lband
15,43,2023-01-05 23:23:00.243,Lband
15,43,2023-01-05 23:24:00.256,Lband
14,43,2023-01-05 23:25:00.176,Lband
14,43,2023-01-05 23:26:00.321,Lband
15,43,2023-01-05 23:27:00.287,Lband
15,43,2023-01-05 23:28:00.288,Lband
15,43,2023-01-05 23:29:00.312,Lband
15,43,2023-01-05 23:30:00.326,Lband
15,43,2023-01-05 23:31:00.299,Lband
15,43,2023-01-05 23:32:00.354,Lband
14,43,2023-01-05 23:33:00.331,Lband
14,43,2023-01-05 23:34:00.293,Lband
15,43,2023-01-05 23:35:00.351,Lband
15,43,2023-01-05 23:36:00.285,Lband
15,43,2023-01-05 23:37:00.371,Lband
15,43,2023-01-05 23:38:00.324,Lband
14,43,2023-01-05 23:39:00.308,Lband
14,43,2023-01-05 23:40:00.305,Lband
14,43,2023-01-05 23:41:00.273,Lband
15,43,2023-01-05 23:42:00.256,Lband
15,43,2023-01-05 23:43:00.303,Lband
15,43,2023-01-05 23:44:00.223,Lband
15,43,2023-01-05 23:45:00.327,Lband
15,43,2023-01-05 23:46:00.258,Lband
14,43,2023-01-05 23:47:00.298,Lband
14,43,2023-01-05 23:48:00.273,Lband
14,43,2023-01-05 23:49:00.301,Lband
15,43,2023-01-05 23:50:00.238,Lband
15,43,2023-01-05 23:51:00.194,Lband
15,43,2023-01-05 23:52:00.352,Lband
14,43,2023-01-05 23:53:00.205,Lband
14,43,2023-01-05 23:54:00.247,Lband
15,43,2023-01-05 23:55:00.366,Lband
15,43,2023-01-05 23:56:00.227,Lband
15,43,2023-01-05 23:57:00.306,Lband
15,43,2023-01-05 23:58:00.274,Lband
14,43,2023-01-05 23:59:00.310,Lband
