Humid,Temp,date,sensorName
52,21,2022-12-18 00:00:00.062,Visalar
52,21,2022-12-18 00:01:00.062,Visalar
52,21,2022-12-18 00:02:00.062,Visalar
52,21,2022-12-18 00:03:00.062,Visalar
52,21,2022-12-18 00:04:00.049,Visalar
51,21,2022-12-18 00:05:00.062,Visalar
51,21,2022-12-18 00:06:00.062,Visalar
51,21,2022-12-18 00:07:00.062,Visalar
51,21,2022-12-18 00:08:00.062,Visalar
51,21,2022-12-18 00:09:00.062,Visalar
51,21,2022-12-18 00:10:00.062,Visalar
51,21,2022-12-18 00:11:00.062,Visalar
51,21,2022-12-18 00:12:00.062,Visalar
51,21,2022-12-18 00:13:00.062,Visalar
50,21,2022-12-18 00:14:00.062,Visalar
50,21,2022-12-18 00:15:00.062,Visalar
50,21,2022-12-18 00:16:00.046,Visalar
50,21,2022-12-18 00:17:00.062,Visalar
50,21,2022-12-18 00:18:00.062,Visalar
50,21,2022-12-18 00:19:00.055,Visalar
50,21,2022-12-18 00:20:00.062,Visalar
50,21,2022-12-18 00:21:00.062,Visalar
67,20,2022-12-18 00:22:00.042,Visalar
67,20,2022-12-18 00:23:00.004,Visalar
67,20,2022-12-18 00:24:00.012,Visalar
67,20,2022-12-18 00:25:00.012,Visalar
67,20,2022-12-18 00:26:00.015,Visalar
67,20,2022-12-18 00:27:00.062,Visalar
67,20,2022-12-18 00:28:00.047,Visalar
67,20,2022-12-18 00:29:00.062,Visalar
67,20,2022-12-18 00:30:00.004,Visalar
68,20,2022-12-18 00:31:00.059,Visalar
68,20,2022-12-18 00:32:00.012,Visalar
68,20,2022-12-18 00:33:00.006,Visalar
68,20,2022-12-18 00:34:00.028,Visalar
68,20,2022-12-18 00:35:00.011,Visalar
68,20,2022-12-18 00:36:00.062,Visalar
68,20,2022-12-18 00:37:00.062,Visalar
68,20,2022-12-18 00:38:00.062,Visalar
68,20,2022-12-18 00:39:00.032,Visalar
68,20,2022-12-18 00:40:00.062,Visalar
68,20,2022-12-18 00:41:00.062,Visalar
68,20,2022-12-18 00:43:00.012,Visalar
68,20,2022-12-18 00:44:00.012,Visalar
69,20,2022-12-18 00:45:00.060,Visalar
71,21,2022-12-18 00:46:00.062,Visalar
71,21,2022-12-18 00:47:00.061,Visalar
71,21,2022-12-18 00:48:00.062,Visalar
71,21,2022-12-18 00:49:00.061,Visalar
71,21,2022-12-18 00:50:00.021,Visalar
71,21,2022-12-18 00:51:00.062,Visalar
71,21,2022-12-18 00:52:00.062,Visalar
71,21,2022-12-18 00:53:00.047,Visalar
71,21,2022-12-18 00:54:00.036,Visalar
71,21,2022-12-18 00:55:00.038,Visalar
71,21,2022-12-18 00:56:00.062,Visalar
71,21,2022-12-18 00:57:00.062,Visalar
70,21,2022-12-18 00:58:00.062,Visalar
70,21,2022-12-18 00:59:00.012,Visalar
70,21,2022-12-18 01:00:00.062,Visalar
70,21,2022-12-18 01:01:00.062,Visalar
70,21,2022-12-18 01:02:00.062,Visalar
70,21,2022-12-18 01:03:00.062,Visalar
69,21,2022-12-18 01:04:00.062,Visalar
69,21,2022-12-18 01:05:00.062,Visalar
69,21,2022-12-18 01:06:00.062,Visalar
69,21,2022-12-18 01:07:00.050,Visalar
69,21,2022-12-18 01:08:00.061,Visalar
68,21,2022-12-18 01:09:00.062,Visalar
55,20,2022-12-18 01:10:00.004,Visalar
55,20,2022-12-18 01:11:00.062,Visalar
55,20,2022-12-18 01:12:00.062,Visalar
55,20,2022-12-18 01:13:00.062,Visalar
55,20,2022-12-18 01:14:00.062,Visalar
55,20,2022-12-18 01:15:00.004,Visalar
55,20,2022-12-18 01:16:00.062,Visalar
55,20,2022-12-18 01:17:00.004,Visalar
55,20,2022-12-18 01:18:00.062,Visalar
55,20,2022-12-18 01:19:00.062,Visalar
56,20,2022-12-18 01:20:00.062,Visalar
56,20,2022-12-18 01:21:00.062,Visalar
56,20,2022-12-18 01:22:00.062,Visalar
56,20,2022-12-18 01:23:00.062,Visalar
56,20,2022-12-18 01:24:00.062,Visalar
56,20,2022-12-18 01:25:00.062,Visalar
56,20,2022-12-18 01:26:00.062,Visalar
56,20,2022-12-18 01:27:00.052,Visalar
56,20,2022-12-18 01:28:00.004,Visalar
56,20,2022-12-18 01:29:00.062,Visalar
57,20,2022-12-18 01:30:00.049,Visalar
57,20,2022-12-18 01:31:00.062,Visalar
57,20,2022-12-18 01:32:00.062,Visalar
72,20,2022-12-18 01:34:00.062,Visalar
72,20,2022-12-18 01:35:00.062,Visalar
72,20,2022-12-18 01:36:00.062,Visalar
72,21,2022-12-18 01:37:00.062,Visalar
72,21,2022-12-18 01:38:00.062,Visalar
72,20,2022-12-18 01:39:00.062,Visalar
72,21,2022-12-18 01:40:00.062,Visalar
72,21,2022-12-18 01:41:00.062,Visalar
72,21,2022-12-18 01:42:00.062,Visalar
72,21,2022-12-18 01:43:00.062,Visalar
72,21,2022-12-18 01:44:00.062,Visalar
72,21,2022-12-18 01:45:00.062,Visalar
72,21,2022-12-18 01:46:00.004,Visalar
72,21,2022-12-18 01:47:00.054,Visalar
72,21,2022-12-18 01:48:00.062,Visalar
72,21,2022-12-18 01:49:00.062,Visalar
72,21,2022-12-18 01:50:00.061,Visalar
72,21,2022-12-18 01:51:00.062,Visalar
72,21,2022-12-18 01:52:00.062,Visalar
72,21,2022-12-18 01:53:00.062,Visalar
72,21,2022-12-18 01:54:00.062,Visalar
72,21,2022-12-18 01:55:00.062,Visalar
72,21,2022-12-18 01:56:00.062,Visalar
72,21,2022-12-18 01:57:00.054,Visalar
60,21,2022-12-18 01:58:00.062,Visalar
60,21,2022-12-18 01:59:00.045,Visalar
60,21,2022-12-18 02:00:00.012,Visalar
59,21,2022-12-18 02:01:00.041,Visalar
59,21,2022-12-18 02:02:00.014,Visalar
59,21,2022-12-18 02:03:00.062,Visalar
59,21,2022-12-18 02:04:00.062,Visalar
59,21,2022-12-18 02:05:00.062,Visalar
58,21,2022-12-18 02:06:00.062,Visalar
58,21,2022-12-18 02:07:00.023,Visalar
58,21,2022-12-18 02:08:00.062,Visalar
58,21,2022-12-18 02:09:00.062,Visalar
58,21,2022-12-18 02:10:00.061,Visalar
57,21,2022-12-18 02:11:00.009,Visalar
57,21,2022-12-18 02:12:00.062,Visalar
57,21,2022-12-18 02:13:00.010,Visalar
57,21,2022-12-18 02:14:00.062,Visalar
57,21,2022-12-18 02:15:00.062,Visalar
56,21,2022-12-18 02:16:00.019,Visalar
56,21,2022-12-18 02:17:00.062,Visalar
56,21,2022-12-18 02:19:00.062,Visalar
56,21,2022-12-18 02:20:00.062,Visalar
55,21,2022-12-18 02:21:00.032,Visalar
66,20,2022-12-18 02:22:00.024,Visalar
66,20,2022-12-18 02:23:00.062,Visalar
66,20,2022-12-18 02:24:00.056,Visalar
66,20,2022-12-18 02:25:00.062,Visalar
67,20,2022-12-18 02:26:00.062,Visalar
67,20,2022-12-18 02:27:00.062,Visalar
67,20,2022-12-18 02:28:00.062,Visalar
67,20,2022-12-18 02:29:00.062,Visalar
67,20,2022-12-18 02:30:00.026,Visalar
67,20,2022-12-18 02:31:00.061,Visalar
67,20,2022-12-18 02:32:00.062,Visalar
67,20,2022-12-18 02:33:00.062,Visalar
68,20,2022-12-18 02:34:00.062,Visalar
68,20,2022-12-18 02:35:00.062,Visalar
68,20,2022-12-18 02:36:00.062,Visalar
68,20,2022-12-18 02:37:00.062,Visalar
68,20,2022-12-18 02:38:00.062,Visalar
68,20,2022-12-18 02:39:00.027,Visalar
68,20,2022-12-18 02:40:00.062,Visalar
68,20,2022-12-18 02:41:00.062,Visalar
68,20,2022-12-18 02:42:00.062,Visalar
68,20,2022-12-18 02:43:00.040,Visalar
69,20,2022-12-18 02:44:00.029,Visalar
69,20,2022-12-18 02:45:00.062,Visalar
76,21,2022-12-18 02:46:00.062,Visalar
76,21,2022-12-18 02:47:00.062,Visalar
76,21,2022-12-18 02:48:00.062,Visalar
76,21,2022-12-18 02:49:00.062,Visalar
76,21,2022-12-18 02:50:00.055,Visalar
76,21,2022-12-18 02:51:00.011,Visalar
76,21,2022-12-18 02:52:00.061,Visalar
76,21,2022-12-18 02:53:00.062,Visalar
76,21,2022-12-18 02:54:00.062,Visalar
76,21,2022-12-18 02:55:00.062,Visalar
76,21,2022-12-18 02:56:00.062,Visalar
76,21,2022-12-18 02:57:00.062,Visalar
76,21,2022-12-18 02:58:00.061,Visalar
76,21,2022-12-18 02:59:00.062,Visalar
76,21,2022-12-18 03:00:00.005,Visalar
76,21,2022-12-18 03:01:00.062,Visalar
76,21,2022-12-18 03:02:00.062,Visalar
76,21,2022-12-18 03:03:00.062,Visalar
76,21,2022-12-18 03:04:00.062,Visalar
76,21,2022-12-18 03:05:00.062,Visalar
76,21,2022-12-18 03:06:00.062,Visalar
76,21,2022-12-18 03:07:00.012,Visalar
76,21,2022-12-18 03:08:00.012,Visalar
58,20,2022-12-18 03:10:00.012,Visalar
58,20,2022-12-18 03:11:00.012,Visalar
58,20,2022-12-18 03:12:00.024,Visalar
58,20,2022-12-18 03:13:00.012,Visalar
59,20,2022-12-18 03:14:00.011,Visalar
59,20,2022-12-18 03:15:00.012,Visalar
59,20,2022-12-18 03:16:00.011,Visalar
59,20,2022-12-18 03:17:00.062,Visalar
59,20,2022-12-18 03:18:00.011,Visalar
59,20,2022-12-18 03:19:00.012,Visalar
59,20,2022-12-18 03:20:00.012,Visalar
59,20,2022-12-18 03:21:00.012,Visalar
59,20,2022-12-18 03:22:00.012,Visalar
59,20,2022-12-18 03:23:00.062,Visalar
59,20,2022-12-18 03:24:00.012,Visalar
59,20,2022-12-18 03:25:00.062,Visalar
60,20,2022-12-18 03:26:00.061,Visalar
60,20,2022-12-18 03:27:00.062,Visalar
60,20,2022-12-18 03:28:00.062,Visalar
60,20,2022-12-18 03:29:00.056,Visalar
60,20,2022-12-18 03:30:00.012,Visalar
60,20,2022-12-18 03:31:00.012,Visalar
60,20,2022-12-18 03:32:00.012,Visalar
60,20,2022-12-18 03:33:00.062,Visalar
75,20,2022-12-18 03:34:00.062,Visalar
75,20,2022-12-18 03:35:00.062,Visalar
75,20,2022-12-18 03:36:00.015,Visalar
75,20,2022-12-18 03:37:00.012,Visalar
75,20,2022-12-18 03:38:00.012,Visalar
75,20,2022-12-18 03:39:00.024,Visalar
75,20,2022-12-18 03:40:00.062,Visalar
75,20,2022-12-18 03:41:00.062,Visalar
75,20,2022-12-18 03:42:00.062,Visalar
75,20,2022-12-18 03:43:00.062,Visalar
75,20,2022-12-18 03:44:00.004,Visalar
75,20,2022-12-18 03:45:00.004,Visalar
75,20,2022-12-18 03:46:00.004,Visalar
75,20,2022-12-18 03:47:00.062,Visalar
75,20,2022-12-18 03:48:00.062,Visalar
75,20,2022-12-18 03:49:00.016,Visalar
75,21,2022-12-18 03:50:00.062,Visalar
75,20,2022-12-18 03:51:00.030,Visalar
75,21,2022-12-18 03:52:00.061,Visalar
75,20,2022-12-18 03:53:00.012,Visalar
75,20,2022-12-18 03:54:00.048,Visalar
75,21,2022-12-18 03:55:00.062,Visalar
76,21,2022-12-18 03:56:00.038,Visalar
76,21,2022-12-18 03:57:00.062,Visalar
76,21,2022-12-18 03:58:00.062,Visalar
76,21,2022-12-18 03:59:00.035,Visalar
76,21,2022-12-18 04:00:00.062,Visalar
76,21,2022-12-18 04:01:00.062,Visalar
76,21,2022-12-18 04:02:00.012,Visalar
75,21,2022-12-18 04:03:00.012,Visalar
75,21,2022-12-18 04:04:00.062,Visalar
75,21,2022-12-18 04:05:00.012,Visalar
75,21,2022-12-18 04:06:00.062,Visalar
75,21,2022-12-18 04:07:00.062,Visalar
75,21,2022-12-18 04:08:00.062,Visalar
75,21,2022-12-18 04:09:00.062,Visalar
74,21,2022-12-18 04:10:00.027,Visalar
74,21,2022-12-18 04:11:00.040,Visalar
74,21,2022-12-18 04:12:00.054,Visalar
74,21,2022-12-18 04:13:00.062,Visalar
74,21,2022-12-18 04:14:00.062,Visalar
73,21,2022-12-18 04:15:00.056,Visalar
73,21,2022-12-18 04:16:00.062,Visalar
73,21,2022-12-18 04:17:00.062,Visalar
73,21,2022-12-18 04:18:00.062,Visalar
73,21,2022-12-18 04:19:00.062,Visalar
60,20,2022-12-18 04:21:00.062,Visalar
60,20,2022-12-18 04:22:00.062,Visalar
60,20,2022-12-18 04:23:00.062,Visalar
60,20,2022-12-18 04:24:00.062,Visalar
60,20,2022-12-18 04:25:00.062,Visalar
60,20,2022-12-18 04:26:00.062,Visalar
60,20,2022-12-18 04:27:00.062,Visalar
61,20,2022-12-18 04:28:00.012,Visalar
61,20,2022-12-18 04:29:00.062,Visalar
61,20,2022-12-18 04:30:00.061,Visalar
61,20,2022-12-18 04:31:00.062,Visalar
61,20,2022-12-18 04:32:00.061,Visalar
61,20,2022-12-18 04:33:00.029,Visalar
61,20,2022-12-18 04:34:00.062,Visalar
61,20,2022-12-18 04:35:00.056,Visalar
61,20,2022-12-18 04:36:00.040,Visalar
62,20,2022-12-18 04:37:00.062,Visalar
62,20,2022-12-18 04:38:00.062,Visalar
62,20,2022-12-18 04:39:00.062,Visalar
62,20,2022-12-18 04:40:00.062,Visalar
62,20,2022-12-18 04:41:00.041,Visalar
62,20,2022-12-18 04:42:00.062,Visalar
62,20,2022-12-18 04:43:00.062,Visalar
62,20,2022-12-18 04:44:00.061,Visalar
74,21,2022-12-18 04:45:00.062,Visalar
74,21,2022-12-18 04:46:00.062,Visalar
74,21,2022-12-18 04:47:00.062,Visalar
73,21,2022-12-18 04:48:00.062,Visalar
73,21,2022-12-18 04:49:00.062,Visalar
73,21,2022-12-18 04:50:00.062,Visalar
73,21,2022-12-18 04:51:00.062,Visalar
73,21,2022-12-18 04:52:00.062,Visalar
73,21,2022-12-18 04:53:00.012,Visalar
73,21,2022-12-18 04:54:00.061,Visalar
72,21,2022-12-18 04:55:00.062,Visalar
72,21,2022-12-18 04:56:00.062,Visalar
72,21,2022-12-18 04:57:00.062,Visalar
72,21,2022-12-18 04:58:00.062,Visalar
72,21,2022-12-18 04:59:00.062,Visalar
72,21,2022-12-18 05:00:00.026,Visalar
72,21,2022-12-18 05:01:00.062,Visalar
71,21,2022-12-18 05:02:00.062,Visalar
71,21,2022-12-18 05:03:00.062,Visalar
71,21,2022-12-18 05:04:00.062,Visalar
71,21,2022-12-18 05:05:00.062,Visalar
70,21,2022-12-18 05:06:00.062,Visalar
70,21,2022-12-18 05:07:00.062,Visalar
70,21,2022-12-18 05:08:00.062,Visalar
62,20,2022-12-18 05:10:00.012,Visalar
63,20,2022-12-18 05:11:00.047,Visalar
63,20,2022-12-18 05:12:00.062,Visalar
63,20,2022-12-18 05:13:00.062,Visalar
63,20,2022-12-18 05:14:00.024,Visalar
63,20,2022-12-18 05:15:00.062,Visalar
63,20,2022-12-18 05:16:00.020,Visalar
63,20,2022-12-18 05:17:00.062,Visalar
63,20,2022-12-18 05:18:00.051,Visalar
63,20,2022-12-18 05:19:00.004,Visalar
64,20,2022-12-18 05:20:00.004,Visalar
64,20,2022-12-18 05:21:00.004,Visalar
64,20,2022-12-18 05:22:00.004,Visalar
64,20,2022-12-18 05:23:00.004,Visalar
64,20,2022-12-18 05:24:00.012,Visalar
64,20,2022-12-18 05:25:00.012,Visalar
64,20,2022-12-18 05:26:00.062,Visalar
64,20,2022-12-18 05:27:00.062,Visalar
64,20,2022-12-18 05:28:00.061,Visalar
65,20,2022-12-18 05:29:00.062,Visalar
65,20,2022-12-18 05:30:00.032,Visalar
65,20,2022-12-18 05:31:00.062,Visalar
65,20,2022-12-18 05:32:00.012,Visalar
65,20,2022-12-18 05:33:00.062,Visalar
71,21,2022-12-18 05:34:00.062,Visalar
71,21,2022-12-18 05:35:00.062,Visalar
71,21,2022-12-18 05:36:00.062,Visalar
70,21,2022-12-18 05:37:00.062,Visalar
70,21,2022-12-18 05:38:00.062,Visalar
70,21,2022-12-18 05:39:00.004,Visalar
69,21,2022-12-18 05:40:00.004,Visalar
69,21,2022-12-18 05:41:00.062,Visalar
69,21,2022-12-18 05:42:00.062,Visalar
68,21,2022-12-18 05:43:00.062,Visalar
68,21,2022-12-18 05:44:00.062,Visalar
68,21,2022-12-18 05:45:00.062,Visalar
67,21,2022-12-18 05:46:00.062,Visalar
67,21,2022-12-18 05:47:00.062,Visalar
67,21,2022-12-18 05:48:00.012,Visalar
67,21,2022-12-18 05:49:00.062,Visalar
66,21,2022-12-18 05:50:00.062,Visalar
66,21,2022-12-18 05:51:00.061,Visalar
66,21,2022-12-18 05:52:00.062,Visalar
66,21,2022-12-18 05:53:00.062,Visalar
65,21,2022-12-18 05:54:00.062,Visalar
65,21,2022-12-18 05:55:00.004,Visalar
65,21,2022-12-18 05:56:00.012,Visalar
65,21,2022-12-18 05:57:00.062,Visalar
63,20,2022-12-18 05:59:00.062,Visalar
63,20,2022-12-18 06:00:00.062,Visalar
63,20,2022-12-18 06:01:00.062,Visalar
63,20,2022-12-18 06:02:00.062,Visalar
63,20,2022-12-18 06:03:00.062,Visalar
64,20,2022-12-18 06:04:00.062,Visalar
64,20,2022-12-18 06:05:00.062,Visalar
64,20,2022-12-18 06:06:00.026,Visalar
64,20,2022-12-18 06:07:00.062,Visalar
64,20,2022-12-18 06:08:00.062,Visalar
64,20,2022-12-18 06:09:00.024,Visalar
64,20,2022-12-18 06:10:00.062,Visalar
64,20,2022-12-18 06:11:00.062,Visalar
64,20,2022-12-18 06:12:00.062,Visalar
64,20,2022-12-18 06:13:00.062,Visalar
65,20,2022-12-18 06:14:00.062,Visalar
65,20,2022-12-18 06:15:00.062,Visalar
65,20,2022-12-18 06:16:00.056,Visalar
65,20,2022-12-18 06:17:00.062,Visalar
65,20,2022-12-18 06:18:00.062,Visalar
65,20,2022-12-18 06:19:00.062,Visalar
65,20,2022-12-18 06:20:00.062,Visalar
65,20,2022-12-18 06:21:00.062,Visalar
66,20,2022-12-18 06:22:00.062,Visalar
67,21,2022-12-18 06:23:00.062,Visalar
67,21,2022-12-18 06:24:00.004,Visalar
66,21,2022-12-18 06:25:00.062,Visalar
66,21,2022-12-18 06:26:00.046,Visalar
66,21,2022-12-18 06:27:00.062,Visalar
66,21,2022-12-18 06:28:00.062,Visalar
66,21,2022-12-18 06:29:00.062,Visalar
66,21,2022-12-18 06:30:00.062,Visalar
65,21,2022-12-18 06:31:00.062,Visalar
65,21,2022-12-18 06:32:00.062,Visalar
65,21,2022-12-18 06:33:00.018,Visalar
65,21,2022-12-18 06:34:00.062,Visalar
65,21,2022-12-18 06:35:00.062,Visalar
64,21,2022-12-18 06:36:00.004,Visalar
64,21,2022-12-18 06:37:00.062,Visalar
64,21,2022-12-18 06:38:00.062,Visalar
64,21,2022-12-18 06:39:00.012,Visalar
64,21,2022-12-18 06:40:00.062,Visalar
63,21,2022-12-18 06:41:00.062,Visalar
63,21,2022-12-18 06:42:00.062,Visalar
63,21,2022-12-18 06:43:00.062,Visalar
63,21,2022-12-18 06:44:00.062,Visalar
62,21,2022-12-18 06:45:00.062,Visalar
62,21,2022-12-18 06:46:00.062,Visalar
68,20,2022-12-18 06:48:00.062,Visalar
68,20,2022-12-18 06:49:00.062,Visalar
68,20,2022-12-18 06:50:00.062,Visalar
69,20,2022-12-18 06:51:00.062,Visalar
69,20,2022-12-18 06:52:00.061,Visalar
69,20,2022-12-18 06:53:00.008,Visalar
69,20,2022-12-18 06:54:00.061,Visalar
69,20,2022-12-18 06:55:00.062,Visalar
69,20,2022-12-18 06:56:00.062,Visalar
69,20,2022-12-18 06:57:00.062,Visalar
69,20,2022-12-18 06:58:00.062,Visalar
69,20,2022-12-18 06:59:00.062,Visalar
69,20,2022-12-18 07:00:00.062,Visalar
69,20,2022-12-18 07:01:00.062,Visalar
70,20,2022-12-18 07:02:00.062,Visalar
70,20,2022-12-18 07:03:00.027,Visalar
70,20,2022-12-18 07:04:00.011,Visalar
70,20,2022-12-18 07:05:00.004,Visalar
70,20,2022-12-18 07:06:00.036,Visalar
70,20,2022-12-18 07:07:00.062,Visalar
70,20,2022-12-18 07:08:00.062,Visalar
70,20,2022-12-18 07:09:00.062,Visalar
70,20,2022-12-18 07:10:00.062,Visalar
70,20,2022-12-18 07:11:00.063,Visalar
59,21,2022-12-18 07:12:00.004,Visalar
59,21,2022-12-18 07:13:00.062,Visalar
59,21,2022-12-18 07:14:00.062,Visalar
59,20,2022-12-18 07:15:00.062,Visalar
58,20,2022-12-18 07:16:00.053,Visalar
58,21,2022-12-18 07:17:00.062,Visalar
58,21,2022-12-18 07:18:00.062,Visalar
58,21,2022-12-18 07:19:00.062,Visalar
58,20,2022-12-18 07:20:00.038,Visalar
57,20,2022-12-18 07:21:00.028,Visalar
57,20,2022-12-18 07:22:00.062,Visalar
57,20,2022-12-18 07:23:00.004,Visalar
57,20,2022-12-18 07:24:00.004,Visalar
57,20,2022-12-18 07:25:00.062,Visalar
57,20,2022-12-18 07:26:00.054,Visalar
56,20,2022-12-18 07:27:00.023,Visalar
56,20,2022-12-18 07:28:00.048,Visalar
56,20,2022-12-18 07:29:00.024,Visalar
56,20,2022-12-18 07:30:00.004,Visalar
56,20,2022-12-18 07:31:00.062,Visalar
56,20,2022-12-18 07:33:00.062,Visalar
56,20,2022-12-18 07:34:00.062,Visalar
56,20,2022-12-18 07:35:00.060,Visalar
79,21,2022-12-18 07:36:00.062,Visalar
78,21,2022-12-18 07:37:00.053,Visalar
78,21,2022-12-18 07:38:00.062,Visalar
78,21,2022-12-18 07:39:00.062,Visalar
78,21,2022-12-18 07:40:00.062,Visalar
78,21,2022-12-18 07:41:00.062,Visalar
78,21,2022-12-18 07:42:00.062,Visalar
78,21,2022-12-18 07:43:00.062,Visalar
78,21,2022-12-18 07:44:00.062,Visalar
78,21,2022-12-18 07:45:00.012,Visalar
78,21,2022-12-18 07:46:00.062,Visalar
78,21,2022-12-18 07:47:00.062,Visalar
78,21,2022-12-18 07:48:00.062,Visalar
78,21,2022-12-18 07:49:00.062,Visalar
78,21,2022-12-18 07:50:00.062,Visalar
78,21,2022-12-18 07:51:00.062,Visalar
78,21,2022-12-18 07:52:00.062,Visalar
78,21,2022-12-18 07:53:00.031,Visalar
78,21,2022-12-18 07:54:00.024,Visalar
78,21,2022-12-18 07:55:00.062,Visalar
77,21,2022-12-18 07:56:00.062,Visalar
77,21,2022-12-18 07:57:00.004,Visalar
77,21,2022-12-18 07:58:00.004,Visalar
77,21,2022-12-18 07:59:00.048,Visalar
62,20,2022-12-18 08:00:00.012,Visalar
62,20,2022-12-18 08:01:00.052,Visalar
62,20,2022-12-18 08:02:00.062,Visalar
62,20,2022-12-18 08:03:00.057,Visalar
62,20,2022-12-18 08:04:00.062,Visalar
62,20,2022-12-18 08:05:00.013,Visalar
63,20,2022-12-18 08:06:00.004,Visalar
63,20,2022-12-18 08:07:00.062,Visalar
63,20,2022-12-18 08:08:00.062,Visalar
63,20,2022-12-18 08:09:00.056,Visalar
63,20,2022-12-18 08:10:00.062,Visalar
63,20,2022-12-18 08:11:00.062,Visalar
63,20,2022-12-18 08:12:00.062,Visalar
63,20,2022-12-18 08:13:00.062,Visalar
63,20,2022-12-18 08:14:00.062,Visalar
63,20,2022-12-18 08:15:00.062,Visalar
64,20,2022-12-18 08:16:00.062,Visalar
64,20,2022-12-18 08:17:00.062,Visalar
64,20,2022-12-18 08:18:00.062,Visalar
64,20,2022-12-18 08:19:00.062,Visalar
64,20,2022-12-18 08:21:00.062,Visalar
64,20,2022-12-18 08:22:00.062,Visalar
64,20,2022-12-18 08:23:00.060,Visalar
78,20,2022-12-18 08:24:00.004,Visalar
78,20,2022-12-18 08:25:00.062,Visalar
78,20,2022-12-18 08:26:00.062,Visalar
79,21,2022-12-18 08:27:00.004,Visalar
79,21,2022-12-18 08:28:00.004,Visalar
79,20,2022-12-18 08:29:00.062,Visalar
79,20,2022-12-18 08:30:00.062,Visalar
79,20,2022-12-18 08:31:00.062,Visalar
79,20,2022-12-18 08:32:00.062,Visalar
79,21,2022-12-18 08:33:00.062,Visalar
79,21,2022-12-18 08:34:00.062,Visalar
79,21,2022-12-18 08:35:00.062,Visalar
79,20,2022-12-18 08:36:00.062,Visalar
79,21,2022-12-18 08:37:00.062,Visalar
79,21,2022-12-18 08:38:00.028,Visalar
79,21,2022-12-18 08:39:00.062,Visalar
79,21,2022-12-18 08:40:00.024,Visalar
79,21,2022-12-18 08:41:00.062,Visalar
79,21,2022-12-18 08:42:00.062,Visalar
79,21,2022-12-18 08:43:00.062,Visalar
79,21,2022-12-18 08:44:00.062,Visalar
79,21,2022-12-18 08:45:00.062,Visalar
79,21,2022-12-18 08:46:00.062,Visalar
80,21,2022-12-18 08:47:06.874,Visalar
56,20,2022-12-18 08:48:00.369,Visalar
56,20,2022-12-18 08:49:00.004,Visalar
56,20,2022-12-18 08:50:00.041,Visalar
56,20,2022-12-18 08:51:00.062,Visalar
56,20,2022-12-18 08:52:00.062,Visalar
56,20,2022-12-18 08:53:00.062,Visalar
56,20,2022-12-18 08:54:00.004,Visalar
56,20,2022-12-18 08:55:00.062,Visalar
56,20,2022-12-18 08:56:00.062,Visalar
56,20,2022-12-18 08:57:00.062,Visalar
56,20,2022-12-18 08:58:00.062,Visalar
56,20,2022-12-18 08:59:00.062,Visalar
56,20,2022-12-18 09:00:00.062,Visalar
56,20,2022-12-18 09:01:00.061,Visalar
56,20,2022-12-18 09:02:00.062,Visalar
56,20,2022-12-18 09:03:00.004,Visalar
56,20,2022-12-18 09:04:00.062,Visalar
56,20,2022-12-18 09:05:00.062,Visalar
56,20,2022-12-18 09:06:00.062,Visalar
56,20,2022-12-18 09:07:00.062,Visalar
56,20,2022-12-18 09:08:00.062,Visalar
56,20,2022-12-18 09:09:00.062,Visalar
56,20,2022-12-18 09:10:00.062,Visalar
56,20,2022-12-18 09:11:00.002,Visalar
74,20,2022-12-18 09:12:00.024,Visalar
75,20,2022-12-18 09:13:00.062,Visalar
75,20,2022-12-18 09:14:00.062,Visalar
75,20,2022-12-18 09:15:00.062,Visalar
75,20,2022-12-18 09:16:00.062,Visalar
75,20,2022-12-18 09:17:00.062,Visalar
75,20,2022-12-18 09:18:00.062,Visalar
75,20,2022-12-18 09:19:00.062,Visalar
75,20,2022-12-18 09:20:00.062,Visalar
75,20,2022-12-18 09:21:00.062,Visalar
75,20,2022-12-18 09:22:00.062,Visalar
75,20,2022-12-18 09:23:00.062,Visalar
75,20,2022-12-18 09:24:00.062,Visalar
75,20,2022-12-18 09:25:00.062,Visalar
75,20,2022-12-18 09:26:00.062,Visalar
75,20,2022-12-18 09:27:00.012,Visalar
76,20,2022-12-18 09:28:00.062,Visalar
76,20,2022-12-18 09:29:00.056,Visalar
76,20,2022-12-18 09:30:00.062,Visalar
76,20,2022-12-18 09:31:00.062,Visalar
76,20,2022-12-18 09:32:00.061,Visalar
76,20,2022-12-18 09:33:00.062,Visalar
76,20,2022-12-18 09:34:00.062,Visalar
76,20,2022-12-18 09:35:00.062,Visalar
57,20,2022-12-18 09:36:00.062,Visalar
57,21,2022-12-18 09:37:00.062,Visalar
57,21,2022-12-18 09:38:00.062,Visalar
57,21,2022-12-18 09:39:00.062,Visalar
56,20,2022-12-18 09:40:00.048,Visalar
56,20,2022-12-18 09:41:00.013,Visalar
56,20,2022-12-18 09:42:00.061,Visalar
56,20,2022-12-18 09:43:00.062,Visalar
56,20,2022-12-18 09:44:00.062,Visalar
56,20,2022-12-18 09:45:00.062,Visalar
56,20,2022-12-18 09:46:00.062,Visalar
56,20,2022-12-18 09:47:00.062,Visalar
56,20,2022-12-18 09:48:00.062,Visalar
56,20,2022-12-18 09:49:00.062,Visalar
56,20,2022-12-18 09:50:00.062,Visalar
56,20,2022-12-18 09:51:00.062,Visalar
56,20,2022-12-18 09:52:00.061,Visalar
56,20,2022-12-18 09:53:00.061,Visalar
56,20,2022-12-18 09:54:00.062,Visalar
56,20,2022-12-18 09:55:00.004,Visalar
56,20,2022-12-18 09:56:00.004,Visalar
56,20,2022-12-18 09:57:00.025,Visalar
56,20,2022-12-18 09:58:00.062,Visalar
56,20,2022-12-18 09:59:00.062,Visalar
72,20,2022-12-18 10:01:00.062,Visalar
72,20,2022-12-18 10:02:00.062,Visalar
72,20,2022-12-18 10:03:00.062,Visalar
72,20,2022-12-18 10:04:00.062,Visalar
72,20,2022-12-18 10:05:00.062,Visalar
72,20,2022-12-18 10:06:00.062,Visalar
73,20,2022-12-18 10:07:00.061,Visalar
73,20,2022-12-18 10:08:00.062,Visalar
73,20,2022-12-18 10:09:00.062,Visalar
73,20,2022-12-18 10:10:00.062,Visalar
73,20,2022-12-18 10:11:00.062,Visalar
73,20,2022-12-18 10:12:00.062,Visalar
73,20,2022-12-18 10:13:00.062,Visalar
73,20,2022-12-18 10:14:00.062,Visalar
74,20,2022-12-18 10:15:00.062,Visalar
74,20,2022-12-18 10:16:00.062,Visalar
74,20,2022-12-18 10:17:00.032,Visalar
74,20,2022-12-18 10:18:00.062,Visalar
74,20,2022-12-18 10:19:00.062,Visalar
74,20,2022-12-18 10:20:00.062,Visalar
74,20,2022-12-18 10:21:00.062,Visalar
74,20,2022-12-18 10:22:00.062,Visalar
74,20,2022-12-18 10:23:00.062,Visalar
74,20,2022-12-18 10:24:00.062,Visalar
62,21,2022-12-18 10:25:00.062,Visalar
62,21,2022-12-18 10:26:00.062,Visalar
62,21,2022-12-18 10:27:00.062,Visalar
62,21,2022-12-18 10:28:00.032,Visalar
62,21,2022-12-18 10:29:00.003,Visalar
61,21,2022-12-18 10:30:00.012,Visalar
61,21,2022-12-18 10:31:00.062,Visalar
61,21,2022-12-18 10:32:00.062,Visalar
61,21,2022-12-18 10:33:00.062,Visalar
60,21,2022-12-18 10:34:00.062,Visalar
60,21,2022-12-18 10:35:00.062,Visalar
60,21,2022-12-18 10:36:00.062,Visalar
60,21,2022-12-18 10:37:00.062,Visalar
59,21,2022-12-18 10:38:00.009,Visalar
59,21,2022-12-18 10:39:00.062,Visalar
59,21,2022-12-18 10:40:00.062,Visalar
59,21,2022-12-18 10:41:00.062,Visalar
58,21,2022-12-18 10:42:00.062,Visalar
58,21,2022-12-18 10:43:00.062,Visalar
58,21,2022-12-18 10:44:00.062,Visalar
58,21,2022-12-18 10:45:00.062,Visalar
57,21,2022-12-18 10:46:00.062,Visalar
57,21,2022-12-18 10:47:00.008,Visalar
57,21,2022-12-18 10:48:00.062,Visalar
67,20,2022-12-18 10:50:00.062,Visalar
67,20,2022-12-18 10:51:00.062,Visalar
67,20,2022-12-18 10:52:00.045,Visalar
67,20,2022-12-18 10:53:00.062,Visalar
67,20,2022-12-18 10:54:00.012,Visalar
68,20,2022-12-18 10:55:00.062,Visalar
68,20,2022-12-18 10:56:00.012,Visalar
68,20,2022-12-18 10:57:00.062,Visalar
68,20,2022-12-18 10:58:00.062,Visalar
68,20,2022-12-18 10:59:00.062,Visalar
68,20,2022-12-18 11:00:00.062,Visalar
68,20,2022-12-18 11:01:00.062,Visalar
68,20,2022-12-18 11:02:00.012,Visalar
68,20,2022-12-18 11:03:00.062,Visalar
69,20,2022-12-18 11:04:00.012,Visalar
69,20,2022-12-18 11:05:00.062,Visalar
69,20,2022-12-18 11:06:00.061,Visalar
69,20,2022-12-18 11:07:00.062,Visalar
69,20,2022-12-18 11:08:00.062,Visalar
69,20,2022-12-18 11:09:00.062,Visalar
69,20,2022-12-18 11:10:00.062,Visalar
69,20,2022-12-18 11:11:00.062,Visalar
69,20,2022-12-18 11:12:00.061,Visalar
70,20,2022-12-18 11:13:00.062,Visalar
78,21,2022-12-18 11:14:00.062,Visalar
79,21,2022-12-18 11:15:00.062,Visalar
79,21,2022-12-18 11:16:00.062,Visalar
79,21,2022-12-18 11:17:00.004,Visalar
79,21,2022-12-18 11:18:00.062,Visalar
79,21,2022-12-18 11:19:00.062,Visalar
79,21,2022-12-18 11:20:00.062,Visalar
79,21,2022-12-18 11:21:00.062,Visalar
79,21,2022-12-18 11:22:00.056,Visalar
79,21,2022-12-18 11:23:00.061,Visalar
79,21,2022-12-18 11:24:00.062,Visalar
79,21,2022-12-18 11:25:00.062,Visalar
79,21,2022-12-18 11:26:00.004,Visalar
79,21,2022-12-18 11:27:00.004,Visalar
79,21,2022-12-18 11:28:00.062,Visalar
79,21,2022-12-18 11:29:00.062,Visalar
79,21,2022-12-18 11:30:00.062,Visalar
79,21,2022-12-18 11:31:00.061,Visalar
79,21,2022-12-18 11:32:00.019,Visalar
79,21,2022-12-18 11:33:00.062,Visalar
79,21,2022-12-18 11:34:00.062,Visalar
79,21,2022-12-18 11:35:00.062,Visalar
79,21,2022-12-18 11:36:00.062,Visalar
66,21,2022-12-18 11:37:00.017,Visalar
65,21,2022-12-18 11:38:00.062,Visalar
65,21,2022-12-18 11:39:00.062,Visalar
65,21,2022-12-18 11:40:00.062,Visalar
65,21,2022-12-18 11:41:00.021,Visalar
64,21,2022-12-18 11:42:00.062,Visalar
64,21,2022-12-18 11:43:00.062,Visalar
64,21,2022-12-18 11:44:00.012,Visalar
63,21,2022-12-18 11:45:00.004,Visalar
63,21,2022-12-18 11:46:00.062,Visalar
63,21,2022-12-18 11:47:00.062,Visalar
63,21,2022-12-18 11:48:00.012,Visalar
63,21,2022-12-18 11:49:00.021,Visalar
62,21,2022-12-18 11:50:00.062,Visalar
62,21,2022-12-18 11:51:00.062,Visalar
62,21,2022-12-18 11:52:00.062,Visalar
62,21,2022-12-18 11:53:00.062,Visalar
62,21,2022-12-18 11:54:00.062,Visalar
61,21,2022-12-18 11:55:00.051,Visalar
61,21,2022-12-18 11:56:00.062,Visalar
61,21,2022-12-18 11:57:00.062,Visalar
61,21,2022-12-18 11:58:00.062,Visalar
60,21,2022-12-18 11:59:00.061,Visalar
60,21,2022-12-18 12:00:00.061,Visalar
61,20,2022-12-18 12:01:00.062,Visalar
61,20,2022-12-18 12:02:00.011,Visalar
62,20,2022-12-18 12:03:00.024,Visalar
62,20,2022-12-18 12:04:00.062,Visalar
62,20,2022-12-18 12:05:00.062,Visalar
62,20,2022-12-18 12:06:00.062,Visalar
62,20,2022-12-18 12:07:00.062,Visalar
62,20,2022-12-18 12:08:00.062,Visalar
62,20,2022-12-18 12:09:00.062,Visalar
63,20,2022-12-18 12:10:00.062,Visalar
63,20,2022-12-18 12:11:00.062,Visalar
63,20,2022-12-18 12:12:00.062,Visalar
63,20,2022-12-18 12:13:00.062,Visalar
63,20,2022-12-18 12:14:00.004,Visalar
63,20,2022-12-18 12:15:00.061,Visalar
63,20,2022-12-18 12:16:00.062,Visalar
64,20,2022-12-18 12:17:00.062,Visalar
64,20,2022-12-18 12:18:00.062,Visalar
64,20,2022-12-18 12:19:00.010,Visalar
64,20,2022-12-18 12:20:00.062,Visalar
64,20,2022-12-18 12:21:00.062,Visalar
64,20,2022-12-18 12:22:00.062,Visalar
64,20,2022-12-18 12:23:00.061,Visalar
64,20,2022-12-18 12:24:00.062,Visalar
75,21,2022-12-18 12:26:00.061,Visalar
75,21,2022-12-18 12:27:00.061,Visalar
75,21,2022-12-18 12:28:00.051,Visalar
75,21,2022-12-18 12:29:00.062,Visalar
76,21,2022-12-18 12:30:00.004,Visalar
76,21,2022-12-18 12:31:00.062,Visalar
76,21,2022-12-18 12:32:00.062,Visalar
76,21,2022-12-18 12:33:00.005,Visalar
76,21,2022-12-18 12:34:00.062,Visalar
76,21,2022-12-18 12:35:00.062,Visalar
76,21,2022-12-18 12:36:00.062,Visalar
76,21,2022-12-18 12:37:00.062,Visalar
76,21,2022-12-18 12:38:00.039,Visalar
76,21,2022-12-18 12:39:00.062,Visalar
76,21,2022-12-18 12:40:00.062,Visalar
76,21,2022-12-18 12:41:00.062,Visalar
76,21,2022-12-18 12:42:00.062,Visalar
76,21,2022-12-18 12:43:00.062,Visalar
76,21,2022-12-18 12:44:00.062,Visalar
77,21,2022-12-18 12:45:00.062,Visalar
77,21,2022-12-18 12:46:00.062,Visalar
77,21,2022-12-18 12:47:00.062,Visalar
77,21,2022-12-18 12:48:00.062,Visalar
77,21,2022-12-18 12:49:00.005,Visalar
58,21,2022-12-18 12:50:00.062,Visalar
58,21,2022-12-18 12:51:00.062,Visalar
58,21,2022-12-18 12:52:00.062,Visalar
58,21,2022-12-18 12:53:00.062,Visalar
58,21,2022-12-18 12:54:00.040,Visalar
58,21,2022-12-18 12:55:00.018,Visalar
58,21,2022-12-18 12:56:00.062,Visalar
57,21,2022-12-18 12:57:00.062,Visalar
57,21,2022-12-18 12:58:00.062,Visalar
57,21,2022-12-18 12:59:00.062,Visalar
57,21,2022-12-18 13:00:00.012,Visalar
57,21,2022-12-18 13:01:00.053,Visalar
57,21,2022-12-18 13:02:00.062,Visalar
57,21,2022-12-18 13:03:00.004,Visalar
57,21,2022-12-18 13:04:00.062,Visalar
56,21,2022-12-18 13:05:00.062,Visalar
56,21,2022-12-18 13:06:00.012,Visalar
56,21,2022-12-18 13:07:00.045,Visalar
56,21,2022-12-18 13:08:00.062,Visalar
56,21,2022-12-18 13:09:00.062,Visalar
56,21,2022-12-18 13:10:00.062,Visalar
56,21,2022-12-18 13:11:00.034,Visalar
56,21,2022-12-18 13:12:00.062,Visalar
56,21,2022-12-18 13:13:00.004,Visalar
59,20,2022-12-18 13:14:00.062,Visalar
59,20,2022-12-18 13:15:00.062,Visalar
59,20,2022-12-18 13:16:00.055,Visalar
59,20,2022-12-18 13:17:00.062,Visalar
60,20,2022-12-18 13:18:00.062,Visalar
60,20,2022-12-18 13:19:00.012,Visalar
60,20,2022-12-18 13:20:00.005,Visalar
60,20,2022-12-18 13:21:00.004,Visalar
60,20,2022-12-18 13:22:00.004,Visalar
60,20,2022-12-18 13:23:00.062,Visalar
60,20,2022-12-18 13:24:00.062,Visalar
60,20,2022-12-18 13:25:00.062,Visalar
60,20,2022-12-18 13:26:00.056,Visalar
61,20,2022-12-18 13:27:00.061,Visalar
61,20,2022-12-18 13:28:00.062,Visalar
61,20,2022-12-18 13:29:00.062,Visalar
61,20,2022-12-18 13:30:00.062,Visalar
61,20,2022-12-18 13:31:00.012,Visalar
61,20,2022-12-18 13:32:00.062,Visalar
61,20,2022-12-18 13:33:00.062,Visalar
61,20,2022-12-18 13:34:00.005,Visalar
61,20,2022-12-18 13:35:00.062,Visalar
62,20,2022-12-18 13:36:00.061,Visalar
68,20,2022-12-18 13:37:00.062,Visalar
68,20,2022-12-18 13:38:00.008,Visalar
68,20,2022-12-18 13:39:00.012,Visalar
68,20,2022-12-18 13:40:00.012,Visalar
68,20,2022-12-18 13:41:00.030,Visalar
68,20,2022-12-18 13:42:00.062,Visalar
68,20,2022-12-18 13:43:00.010,Visalar
68,20,2022-12-18 13:44:00.055,Visalar
68,20,2022-12-18 13:45:00.062,Visalar
69,20,2022-12-18 13:46:00.061,Visalar
69,20,2022-12-18 13:47:00.061,Visalar
69,20,2022-12-18 13:48:00.062,Visalar
69,20,2022-12-18 13:49:00.061,Visalar
69,20,2022-12-18 13:50:00.061,Visalar
69,20,2022-12-18 13:51:00.062,Visalar
69,20,2022-12-18 13:52:00.061,Visalar
69,20,2022-12-18 13:53:00.062,Visalar
69,20,2022-12-18 13:54:00.004,Visalar
69,20,2022-12-18 13:55:00.020,Visalar
70,20,2022-12-18 13:56:00.004,Visalar
70,20,2022-12-18 13:58:00.062,Visalar
70,20,2022-12-18 13:59:00.012,Visalar
70,20,2022-12-18 14:00:00.010,Visalar
79,21,2022-12-18 14:01:00.004,Visalar
79,21,2022-12-18 14:02:00.062,Visalar
79,21,2022-12-18 14:03:00.062,Visalar
79,21,2022-12-18 14:04:00.062,Visalar
79,21,2022-12-18 14:05:00.062,Visalar
79,21,2022-12-18 14:06:00.062,Visalar
79,21,2022-12-18 14:07:00.062,Visalar
79,21,2022-12-18 14:08:00.004,Visalar
79,21,2022-12-18 14:09:00.062,Visalar
79,21,2022-12-18 14:10:00.049,Visalar
79,21,2022-12-18 14:11:00.062,Visalar
79,21,2022-12-18 14:12:00.062,Visalar
79,21,2022-12-18 14:13:00.062,Visalar
79,21,2022-12-18 14:14:00.062,Visalar
79,21,2022-12-18 14:15:00.024,Visalar
79,21,2022-12-18 14:16:00.048,Visalar
79,21,2022-12-18 14:17:00.062,Visalar
79,21,2022-12-18 14:18:00.016,Visalar
79,21,2022-12-18 14:19:00.056,Visalar
80,21,2022-12-18 14:20:06.873,Visalar
80,21,2022-12-18 14:21:06.727,Visalar
80,21,2022-12-18 14:22:06.739,Visalar
80,21,2022-12-18 14:23:06.724,Visalar
80,21,2022-12-18 14:24:05.751,Visalar
58,21,2022-12-18 14:25:07.174,Visalar
58,21,2022-12-18 14:26:00.055,Visalar
58,21,2022-12-18 14:27:00.062,Visalar
57,21,2022-12-18 14:28:00.012,Visalar
57,21,2022-12-18 14:29:00.062,Visalar
57,21,2022-12-18 14:30:00.062,Visalar
57,21,2022-12-18 14:31:00.015,Visalar
57,20,2022-12-18 14:32:00.062,Visalar
57,21,2022-12-18 14:33:00.062,Visalar
57,20,2022-12-18 14:34:00.062,Visalar
57,20,2022-12-18 14:35:00.062,Visalar
57,20,2022-12-18 14:36:00.004,Visalar
56,20,2022-12-18 14:37:00.062,Visalar
56,20,2022-12-18 14:38:00.057,Visalar
56,20,2022-12-18 14:39:00.062,Visalar
56,20,2022-12-18 14:40:00.018,Visalar
56,20,2022-12-18 14:41:00.039,Visalar
56,20,2022-12-18 14:42:00.062,Visalar
56,20,2022-12-18 14:43:00.062,Visalar
56,20,2022-12-18 14:44:00.062,Visalar
56,20,2022-12-18 14:46:00.062,Visalar
56,20,2022-12-18 14:47:00.062,Visalar
56,20,2022-12-18 14:48:00.010,Visalar
69,20,2022-12-18 14:49:00.061,Visalar
69,20,2022-12-18 14:50:00.003,Visalar
70,20,2022-12-18 14:51:00.062,Visalar
70,20,2022-12-18 14:52:00.012,Visalar
70,20,2022-12-18 14:53:00.022,Visalar
70,20,2022-12-18 14:54:00.062,Visalar
70,20,2022-12-18 14:55:00.012,Visalar
70,20,2022-12-18 14:56:00.062,Visalar
70,20,2022-12-18 14:57:00.012,Visalar
70,20,2022-12-18 14:58:00.062,Visalar
70,20,2022-12-18 14:59:00.062,Visalar
70,20,2022-12-18 15:00:00.062,Visalar
71,20,2022-12-18 15:01:00.062,Visalar
71,20,2022-12-18 15:02:00.062,Visalar
71,20,2022-12-18 15:03:00.023,Visalar
71,20,2022-12-18 15:04:00.062,Visalar
71,20,2022-12-18 15:05:00.061,Visalar
71,20,2022-12-18 15:06:00.004,Visalar
71,20,2022-12-18 15:07:00.004,Visalar
71,20,2022-12-18 15:08:00.004,Visalar
71,20,2022-12-18 15:09:00.062,Visalar
72,20,2022-12-18 15:10:00.062,Visalar
72,20,2022-12-18 15:11:00.062,Visalar
72,20,2022-12-18 15:12:00.061,Visalar
78,21,2022-12-18 15:13:00.062,Visalar
78,21,2022-12-18 15:14:00.059,Visalar
78,21,2022-12-18 15:15:00.062,Visalar
78,21,2022-12-18 15:16:00.062,Visalar
78,21,2022-12-18 15:17:00.025,Visalar
78,21,2022-12-18 15:18:00.062,Visalar
78,21,2022-12-18 15:19:00.062,Visalar
79,21,2022-12-18 15:20:00.061,Visalar
79,21,2022-12-18 15:21:00.062,Visalar
79,21,2022-12-18 15:22:00.062,Visalar
79,21,2022-12-18 15:23:00.012,Visalar
79,21,2022-12-18 15:24:00.015,Visalar
79,21,2022-12-18 15:25:00.062,Visalar
79,21,2022-12-18 15:26:00.062,Visalar
79,21,2022-12-18 15:27:00.062,Visalar
79,21,2022-12-18 15:28:00.062,Visalar
78,21,2022-12-18 15:29:00.062,Visalar
78,21,2022-12-18 15:30:00.062,Visalar
78,21,2022-12-18 15:31:00.062,Visalar
78,21,2022-12-18 15:32:00.062,Visalar
78,21,2022-12-18 15:33:00.056,Visalar
78,21,2022-12-18 15:34:00.062,Visalar
78,21,2022-12-18 15:35:00.062,Visalar
55,21,2022-12-18 15:37:00.062,Visalar
55,21,2022-12-18 15:38:00.062,Visalar
55,21,2022-12-18 15:39:00.062,Visalar
55,21,2022-12-18 15:40:00.015,Visalar
54,21,2022-12-18 15:41:00.062,Visalar
54,21,2022-12-18 15:42:00.062,Visalar
54,21,2022-12-18 15:43:00.061,Visalar
54,21,2022-12-18 15:44:00.062,Visalar
54,21,2022-12-18 15:45:00.062,Visalar
54,21,2022-12-18 15:46:00.062,Visalar
54,20,2022-12-18 15:47:00.062,Visalar
54,21,2022-12-18 15:48:00.062,Visalar
54,20,2022-12-18 15:49:00.062,Visalar
54,20,2022-12-18 15:50:00.062,Visalar
54,20,2022-12-18 15:51:00.062,Visalar
54,20,2022-12-18 15:52:00.062,Visalar
54,20,2022-12-18 15:53:00.062,Visalar
54,20,2022-12-18 15:54:00.061,Visalar
54,20,2022-12-18 15:55:00.012,Visalar
54,20,2022-12-18 15:56:00.062,Visalar
54,20,2022-12-18 15:57:00.062,Visalar
54,20,2022-12-18 15:58:00.062,Visalar
54,20,2022-12-18 15:59:00.062,Visalar
54,20,2022-12-18 16:00:00.061,Visalar
68,20,2022-12-18 16:01:00.062,Visalar
68,20,2022-12-18 16:02:00.062,Visalar
68,20,2022-12-18 16:03:00.062,Visalar
68,20,2022-12-18 16:04:00.062,Visalar
68,20,2022-12-18 16:05:00.062,Visalar
68,20,2022-12-18 16:06:00.062,Visalar
68,20,2022-12-18 16:07:00.062,Visalar
68,20,2022-12-18 16:08:00.061,Visalar
69,20,2022-12-18 16:09:00.062,Visalar
69,20,2022-12-18 16:10:00.062,Visalar
69,20,2022-12-18 16:11:00.062,Visalar
69,20,2022-12-18 16:12:00.004,Visalar
69,20,2022-12-18 16:13:00.012,Visalar
69,20,2022-12-18 16:14:00.030,Visalar
69,20,2022-12-18 16:15:00.062,Visalar
69,20,2022-12-18 16:16:00.009,Visalar
69,20,2022-12-18 16:17:00.061,Visalar
69,20,2022-12-18 16:18:00.062,Visalar
70,20,2022-12-18 16:19:00.062,Visalar
70,20,2022-12-18 16:20:00.062,Visalar
70,20,2022-12-18 16:21:00.062,Visalar
70,20,2022-12-18 16:22:00.062,Visalar
70,20,2022-12-18 16:23:00.062,Visalar
70,20,2022-12-18 16:24:00.054,Visalar
77,21,2022-12-18 16:25:00.022,Visalar
77,21,2022-12-18 16:26:00.062,Visalar
77,21,2022-12-18 16:27:00.061,Visalar
77,21,2022-12-18 16:28:00.062,Visalar
77,21,2022-12-18 16:29:00.062,Visalar
77,21,2022-12-18 16:30:00.062,Visalar
77,21,2022-12-18 16:31:00.062,Visalar
77,21,2022-12-18 16:32:00.061,Visalar
78,21,2022-12-18 16:33:00.062,Visalar
78,21,2022-12-18 16:34:00.004,Visalar
78,21,2022-12-18 16:35:00.004,Visalar
78,21,2022-12-18 16:36:00.004,Visalar
78,21,2022-12-18 16:37:00.004,Visalar
78,21,2022-12-18 16:38:00.012,Visalar
78,21,2022-12-18 16:39:00.062,Visalar
78,21,2022-12-18 16:40:00.061,Visalar
78,21,2022-12-18 16:41:00.062,Visalar
78,21,2022-12-18 16:42:00.062,Visalar
78,21,2022-12-18 16:43:00.012,Visalar
78,21,2022-12-18 16:44:00.061,Visalar
78,21,2022-12-18 16:45:00.062,Visalar
78,21,2022-12-18 16:46:00.047,Visalar
78,21,2022-12-18 16:47:00.004,Visalar
78,21,2022-12-18 16:48:00.010,Visalar
55,20,2022-12-18 16:49:00.062,Visalar
55,20,2022-12-18 16:50:00.062,Visalar
55,20,2022-12-18 16:51:00.061,Visalar
55,20,2022-12-18 16:52:00.062,Visalar
55,20,2022-12-18 16:53:00.062,Visalar
55,20,2022-12-18 16:54:00.062,Visalar
54,20,2022-12-18 16:55:00.062,Visalar
54,20,2022-12-18 16:56:00.062,Visalar
54,20,2022-12-18 16:57:00.062,Visalar
54,20,2022-12-18 16:58:00.062,Visalar
54,20,2022-12-18 16:59:00.002,Visalar
54,20,2022-12-18 17:00:00.011,Visalar
54,20,2022-12-18 17:01:00.062,Visalar
54,20,2022-12-18 17:02:00.062,Visalar
54,20,2022-12-18 17:03:00.062,Visalar
54,20,2022-12-18 17:04:00.020,Visalar
54,20,2022-12-18 17:05:00.062,Visalar
54,20,2022-12-18 17:06:00.062,Visalar
54,20,2022-12-18 17:07:00.062,Visalar
54,20,2022-12-18 17:08:00.024,Visalar
54,20,2022-12-18 17:10:00.062,Visalar
54,20,2022-12-18 17:11:00.062,Visalar
54,20,2022-12-18 17:12:00.060,Visalar
69,20,2022-12-18 17:13:00.062,Visalar
69,20,2022-12-18 17:14:00.062,Visalar
69,20,2022-12-18 17:15:00.062,Visalar
69,20,2022-12-18 17:16:00.014,Visalar
69,20,2022-12-18 17:17:00.061,Visalar
70,20,2022-12-18 17:18:00.062,Visalar
70,20,2022-12-18 17:19:00.012,Visalar
70,20,2022-12-18 17:20:00.062,Visalar
70,20,2022-12-18 17:21:00.062,Visalar
70,20,2022-12-18 17:22:00.062,Visalar
70,20,2022-12-18 17:23:00.062,Visalar
70,20,2022-12-18 17:24:00.062,Visalar
70,20,2022-12-18 17:25:00.062,Visalar
70,20,2022-12-18 17:26:00.062,Visalar
70,20,2022-12-18 17:27:00.004,Visalar
71,20,2022-12-18 17:28:00.062,Visalar
71,20,2022-12-18 17:29:00.062,Visalar
71,20,2022-12-18 17:30:00.062,Visalar
71,20,2022-12-18 17:31:00.062,Visalar
71,20,2022-12-18 17:32:00.062,Visalar
71,20,2022-12-18 17:33:00.062,Visalar
71,20,2022-12-18 17:34:00.010,Visalar
71,20,2022-12-18 17:35:00.035,Visalar
71,20,2022-12-18 17:36:00.061,Visalar
79,21,2022-12-18 17:37:00.062,Visalar
79,21,2022-12-18 17:38:00.061,Visalar
79,21,2022-12-18 17:39:00.018,Visalar
79,21,2022-12-18 17:40:00.040,Visalar
79,21,2022-12-18 17:41:00.008,Visalar
79,21,2022-12-18 17:42:00.021,Visalar
79,21,2022-12-18 17:43:00.062,Visalar
79,21,2022-12-18 17:44:00.004,Visalar
79,21,2022-12-18 17:45:00.003,Visalar
79,21,2022-12-18 17:46:00.062,Visalar
79,21,2022-12-18 17:47:00.012,Visalar
79,21,2022-12-18 17:48:00.061,Visalar
79,21,2022-12-18 17:49:00.062,Visalar
79,21,2022-12-18 17:50:00.061,Visalar
79,21,2022-12-18 17:51:00.062,Visalar
79,21,2022-12-18 17:52:00.062,Visalar
79,21,2022-12-18 17:53:00.012,Visalar
79,21,2022-12-18 17:54:00.061,Visalar
79,21,2022-12-18 17:55:00.012,Visalar
79,21,2022-12-18 17:56:00.062,Visalar
79,21,2022-12-18 17:57:00.061,Visalar
79,21,2022-12-18 17:58:00.004,Visalar
78,21,2022-12-18 17:59:00.062,Visalar
78,21,2022-12-18 18:00:00.060,Visalar
57,20,2022-12-18 18:01:00.062,Visalar
57,20,2022-12-18 18:02:00.061,Visalar
57,20,2022-12-18 18:03:00.050,Visalar
58,20,2022-12-18 18:04:00.062,Visalar
58,20,2022-12-18 18:05:00.061,Visalar
58,20,2022-12-18 18:06:00.062,Visalar
58,20,2022-12-18 18:07:00.062,Visalar
58,20,2022-12-18 18:08:00.062,Visalar
58,20,2022-12-18 18:09:00.062,Visalar
58,20,2022-12-18 18:10:00.039,Visalar
58,20,2022-12-18 18:11:00.052,Visalar
58,20,2022-12-18 18:12:00.032,Visalar
59,20,2022-12-18 18:13:00.016,Visalar
59,20,2022-12-18 18:14:00.061,Visalar
59,20,2022-12-18 18:15:00.062,Visalar
59,20,2022-12-18 18:16:00.062,Visalar
59,20,2022-12-18 18:17:00.062,Visalar
59,20,2022-12-18 18:18:00.024,Visalar
59,20,2022-12-18 18:19:00.062,Visalar
59,20,2022-12-18 18:20:00.062,Visalar
59,20,2022-12-18 18:21:00.062,Visalar
60,20,2022-12-18 18:22:00.062,Visalar
60,20,2022-12-18 18:23:00.062,Visalar
60,20,2022-12-18 18:24:00.011,Visalar
74,21,2022-12-18 18:25:00.062,Visalar
75,21,2022-12-18 18:26:00.056,Visalar
75,21,2022-12-18 18:27:00.062,Visalar
75,21,2022-12-18 18:28:00.062,Visalar
75,21,2022-12-18 18:29:00.062,Visalar
75,21,2022-12-18 18:30:00.016,Visalar
75,21,2022-12-18 18:31:00.062,Visalar
75,21,2022-12-18 18:32:00.004,Visalar
75,21,2022-12-18 18:33:00.061,Visalar
75,21,2022-12-18 18:34:00.062,Visalar
75,21,2022-12-18 18:35:00.062,Visalar
75,21,2022-12-18 18:36:00.061,Visalar
75,21,2022-12-18 18:37:00.061,Visalar
75,21,2022-12-18 18:38:00.062,Visalar
75,21,2022-12-18 18:39:00.062,Visalar
75,21,2022-12-18 18:40:00.062,Visalar
75,21,2022-12-18 18:41:00.062,Visalar
75,21,2022-12-18 18:42:00.062,Visalar
76,21,2022-12-18 18:43:00.043,Visalar
76,21,2022-12-18 18:44:00.007,Visalar
76,21,2022-12-18 18:46:00.062,Visalar
76,21,2022-12-18 18:47:00.034,Visalar
76,21,2022-12-18 18:48:00.010,Visalar
66,21,2022-12-18 18:49:00.061,Visalar
65,21,2022-12-18 18:50:00.062,Visalar
65,21,2022-12-18 18:51:00.061,Visalar
65,21,2022-12-18 18:52:00.024,Visalar
65,21,2022-12-18 18:53:00.062,Visalar
64,21,2022-12-18 18:54:00.004,Visalar
64,21,2022-12-18 18:55:00.062,Visalar
64,21,2022-12-18 18:56:00.061,Visalar
64,21,2022-12-18 18:57:00.024,Visalar
63,21,2022-12-18 18:58:00.042,Visalar
63,21,2022-12-18 18:59:00.012,Visalar
63,21,2022-12-18 19:00:00.062,Visalar
63,21,2022-12-18 19:01:00.061,Visalar
63,21,2022-12-18 19:02:00.062,Visalar
63,21,2022-12-18 19:03:00.062,Visalar
62,21,2022-12-18 19:04:00.062,Visalar
62,21,2022-12-18 19:05:00.005,Visalar
62,21,2022-12-18 19:06:00.061,Visalar
62,21,2022-12-18 19:07:00.061,Visalar
62,21,2022-12-18 19:08:00.061,Visalar
62,21,2022-12-18 19:09:00.061,Visalar
62,21,2022-12-18 19:10:00.061,Visalar
62,21,2022-12-18 19:11:00.061,Visalar
61,21,2022-12-18 19:12:00.029,Visalar
67,20,2022-12-18 19:13:00.062,Visalar
67,20,2022-12-18 19:14:00.024,Visalar
67,20,2022-12-18 19:15:00.062,Visalar
67,20,2022-12-18 19:16:00.012,Visalar
68,20,2022-12-18 19:17:00.062,Visalar
68,20,2022-12-18 19:18:00.062,Visalar
68,20,2022-12-18 19:19:00.004,Visalar
68,20,2022-12-18 19:20:00.062,Visalar
68,20,2022-12-18 19:21:00.062,Visalar
68,20,2022-12-18 19:22:00.062,Visalar
68,20,2022-12-18 19:23:00.012,Visalar
68,20,2022-12-18 19:24:00.027,Visalar
68,20,2022-12-18 19:25:00.062,Visalar
69,20,2022-12-18 19:26:00.062,Visalar
69,20,2022-12-18 19:27:00.062,Visalar
69,20,2022-12-18 19:28:00.062,Visalar
69,20,2022-12-18 19:29:00.062,Visalar
69,20,2022-12-18 19:30:00.062,Visalar
69,20,2022-12-18 19:31:00.062,Visalar
69,20,2022-12-18 19:32:00.062,Visalar
69,20,2022-12-18 19:33:00.062,Visalar
69,20,2022-12-18 19:34:00.061,Visalar
69,20,2022-12-18 19:35:00.062,Visalar
70,20,2022-12-18 19:36:00.061,Visalar
78,21,2022-12-18 19:37:00.012,Visalar
78,21,2022-12-18 19:38:00.004,Visalar
78,21,2022-12-18 19:39:00.062,Visalar
78,21,2022-12-18 19:40:00.062,Visalar
78,21,2022-12-18 19:41:00.062,Visalar
78,21,2022-12-18 19:42:00.062,Visalar
78,21,2022-12-18 19:43:00.062,Visalar
78,21,2022-12-18 19:44:00.062,Visalar
78,21,2022-12-18 19:45:00.062,Visalar
78,21,2022-12-18 19:46:00.062,Visalar
78,21,2022-12-18 19:47:00.062,Visalar
79,21,2022-12-18 19:48:00.061,Visalar
78,21,2022-12-18 19:49:00.008,Visalar
78,21,2022-12-18 19:50:00.062,Visalar
78,21,2022-12-18 19:51:00.062,Visalar
78,21,2022-12-18 19:52:00.062,Visalar
78,21,2022-12-18 19:53:00.062,Visalar
78,21,2022-12-18 19:54:00.002,Visalar
78,21,2022-12-18 19:55:00.062,Visalar
78,21,2022-12-18 19:56:00.061,Visalar
78,21,2022-12-18 19:57:00.025,Visalar
78,21,2022-12-18 19:58:00.062,Visalar
78,21,2022-12-18 19:59:00.061,Visalar
78,21,2022-12-18 20:00:00.061,Visalar
54,20,2022-12-18 20:01:00.023,Visalar
55,20,2022-12-18 20:02:00.062,Visalar
55,20,2022-12-18 20:03:00.012,Visalar
55,21,2022-12-18 20:04:00.056,Visalar
55,20,2022-12-18 20:05:00.062,Visalar
55,20,2022-12-18 20:06:00.062,Visalar
55,20,2022-12-18 20:07:00.062,Visalar
55,20,2022-12-18 20:08:00.062,Visalar
56,20,2022-12-18 20:09:00.052,Visalar
56,20,2022-12-18 20:10:00.028,Visalar
56,20,2022-12-18 20:11:00.008,Visalar
56,20,2022-12-18 20:12:00.051,Visalar
56,20,2022-12-18 20:13:00.019,Visalar
56,20,2022-12-18 20:14:00.062,Visalar
57,20,2022-12-18 20:15:00.056,Visalar
57,20,2022-12-18 20:16:00.062,Visalar
57,20,2022-12-18 20:17:00.062,Visalar
57,20,2022-12-18 20:18:00.024,Visalar
57,20,2022-12-18 20:19:00.012,Visalar
57,20,2022-12-18 20:20:00.052,Visalar
58,20,2022-12-18 20:21:00.036,Visalar
58,20,2022-12-18 20:22:00.020,Visalar
58,20,2022-12-18 20:23:00.062,Visalar
58,20,2022-12-18 20:24:00.061,Visalar
73,20,2022-12-18 20:25:00.012,Visalar
73,21,2022-12-18 20:26:00.062,Visalar
74,21,2022-12-18 20:27:00.004,Visalar
74,21,2022-12-18 20:28:00.062,Visalar
74,21,2022-12-18 20:29:00.062,Visalar
74,21,2022-12-18 20:30:00.052,Visalar
74,21,2022-12-18 20:31:00.028,Visalar
74,21,2022-12-18 20:32:00.008,Visalar
74,21,2022-12-18 20:33:00.062,Visalar
74,21,2022-12-18 20:34:00.029,Visalar
74,21,2022-12-18 20:35:00.062,Visalar
74,21,2022-12-18 20:36:00.062,Visalar
74,21,2022-12-18 20:37:00.048,Visalar
74,21,2022-12-18 20:38:00.043,Visalar
74,21,2022-12-18 20:39:00.012,Visalar
74,21,2022-12-18 20:40:00.012,Visalar
74,21,2022-12-18 20:41:00.012,Visalar
74,21,2022-12-18 20:42:00.004,Visalar
74,21,2022-12-18 20:43:00.062,Visalar
74,21,2022-12-18 20:44:00.050,Visalar
74,21,2022-12-18 20:45:00.062,Visalar
75,21,2022-12-18 20:46:00.062,Visalar
75,21,2022-12-18 20:47:00.062,Visalar
75,21,2022-12-18 20:48:00.061,Visalar
66,21,2022-12-18 20:49:00.062,Visalar
65,21,2022-12-18 20:50:00.062,Visalar
65,21,2022-12-18 20:51:00.062,Visalar
65,21,2022-12-18 20:52:00.055,Visalar
64,21,2022-12-18 20:53:00.062,Visalar
64,21,2022-12-18 20:54:00.062,Visalar
64,21,2022-12-18 20:55:00.062,Visalar
63,21,2022-12-18 20:56:00.020,Visalar
63,21,2022-12-18 20:57:00.062,Visalar
63,21,2022-12-18 20:58:00.062,Visalar
62,21,2022-12-18 20:59:00.012,Visalar
62,21,2022-12-18 21:00:00.062,Visalar
62,21,2022-12-18 21:01:00.062,Visalar
62,21,2022-12-18 21:02:00.062,Visalar
61,21,2022-12-18 21:03:00.009,Visalar
61,21,2022-12-18 21:04:00.012,Visalar
61,21,2022-12-18 21:05:00.062,Visalar
61,21,2022-12-18 21:06:00.004,Visalar
60,21,2022-12-18 21:07:00.062,Visalar
60,21,2022-12-18 21:08:00.062,Visalar
60,21,2022-12-18 21:09:00.051,Visalar
60,21,2022-12-18 21:10:00.062,Visalar
60,21,2022-12-18 21:11:00.062,Visalar
59,21,2022-12-18 21:12:00.010,Visalar
65,20,2022-12-18 21:13:00.003,Visalar
65,20,2022-12-18 21:14:00.062,Visalar
65,20,2022-12-18 21:15:00.004,Visalar
66,20,2022-12-18 21:16:00.062,Visalar
66,20,2022-12-18 21:17:00.062,Visalar
66,20,2022-12-18 21:18:00.062,Visalar
66,20,2022-12-18 21:19:00.061,Visalar
66,20,2022-12-18 21:20:00.062,Visalar
66,20,2022-12-18 21:21:00.062,Visalar
66,20,2022-12-18 21:22:00.062,Visalar
67,20,2022-12-18 21:23:00.062,Visalar
67,20,2022-12-18 21:24:00.004,Visalar
67,20,2022-12-18 21:25:00.062,Visalar
67,20,2022-12-18 21:26:00.062,Visalar
67,20,2022-12-18 21:27:00.062,Visalar
67,20,2022-12-18 21:28:00.062,Visalar
67,20,2022-12-18 21:29:00.058,Visalar
67,20,2022-12-18 21:30:00.062,Visalar
68,20,2022-12-18 21:31:00.062,Visalar
68,20,2022-12-18 21:32:00.061,Visalar
68,20,2022-12-18 21:33:00.062,Visalar
68,20,2022-12-18 21:34:00.062,Visalar
68,20,2022-12-18 21:35:00.062,Visalar
68,20,2022-12-18 21:36:00.062,Visalar
77,21,2022-12-18 21:37:00.062,Visalar
77,21,2022-12-18 21:38:00.062,Visalar
77,21,2022-12-18 21:39:00.004,Visalar
77,21,2022-12-18 21:40:00.004,Visalar
77,21,2022-12-18 21:41:00.062,Visalar
77,21,2022-12-18 21:42:00.062,Visalar
77,21,2022-12-18 21:43:00.061,Visalar
77,21,2022-12-18 21:44:00.062,Visalar
77,21,2022-12-18 21:45:00.062,Visalar
77,21,2022-12-18 21:46:00.062,Visalar
77,21,2022-12-18 21:47:00.062,Visalar
77,21,2022-12-18 21:48:00.062,Visalar
77,21,2022-12-18 21:49:00.062,Visalar
77,21,2022-12-18 21:50:00.062,Visalar
77,21,2022-12-18 21:51:00.062,Visalar
77,21,2022-12-18 21:52:00.062,Visalar
77,21,2022-12-18 21:53:00.062,Visalar
77,21,2022-12-18 21:54:00.062,Visalar
76,21,2022-12-18 21:55:00.062,Visalar
76,21,2022-12-18 21:56:00.062,Visalar
76,21,2022-12-18 21:57:00.062,Visalar
76,21,2022-12-18 21:58:00.062,Visalar
76,21,2022-12-18 21:59:00.029,Visalar
57,21,2022-12-18 22:00:00.023,Visalar
57,21,2022-12-18 22:01:00.012,Visalar
57,21,2022-12-18 22:02:00.062,Visalar
57,21,2022-12-18 22:03:00.062,Visalar
57,21,2022-12-18 22:04:00.004,Visalar
57,21,2022-12-18 22:05:00.004,Visalar
56,21,2022-12-18 22:06:00.004,Visalar
56,21,2022-12-18 22:07:00.004,Visalar
56,21,2022-12-18 22:08:00.062,Visalar
56,21,2022-12-18 22:09:00.062,Visalar
56,21,2022-12-18 22:10:00.061,Visalar
56,21,2022-12-18 22:11:00.062,Visalar
56,21,2022-12-18 22:12:00.062,Visalar
56,21,2022-12-18 22:13:00.004,Visalar
56,21,2022-12-18 22:14:00.062,Visalar
55,21,2022-12-18 22:15:00.045,Visalar
55,21,2022-12-18 22:16:00.035,Visalar
55,21,2022-12-18 22:17:00.062,Visalar
55,21,2022-12-18 22:18:00.062,Visalar
55,21,2022-12-18 22:19:00.002,Visalar
55,21,2022-12-18 22:20:00.062,Visalar
55,21,2022-12-18 22:21:00.055,Visalar
55,21,2022-12-18 22:22:00.013,Visalar
62,20,2022-12-18 22:23:00.012,Visalar
62,20,2022-12-18 22:24:00.012,Visalar
62,20,2022-12-18 22:25:00.012,Visalar
62,20,2022-12-18 22:26:00.012,Visalar
62,20,2022-12-18 22:27:00.005,Visalar
62,20,2022-12-18 22:28:00.062,Visalar
63,20,2022-12-18 22:29:00.027,Visalar
63,20,2022-12-18 22:30:00.045,Visalar
63,20,2022-12-18 22:31:00.062,Visalar
63,20,2022-12-18 22:32:00.061,Visalar
63,20,2022-12-18 22:33:00.034,Visalar
63,20,2022-12-18 22:34:00.062,Visalar
64,20,2022-12-18 22:35:00.033,Visalar
64,20,2022-12-18 22:36:00.004,Visalar
64,20,2022-12-18 22:37:00.062,Visalar
64,20,2022-12-18 22:38:00.012,Visalar
64,20,2022-12-18 22:39:00.038,Visalar
64,20,2022-12-18 22:40:00.061,Visalar
65,20,2022-12-18 22:41:00.030,Visalar
65,20,2022-12-18 22:42:00.051,Visalar
65,20,2022-12-18 22:43:00.062,Visalar
65,20,2022-12-18 22:44:00.062,Visalar
65,20,2022-12-18 22:45:00.063,Visalar
75,20,2022-12-18 22:46:00.062,Visalar
75,20,2022-12-18 22:47:00.062,Visalar
75,20,2022-12-18 22:48:00.004,Visalar
75,20,2022-12-18 22:49:00.062,Visalar
75,20,2022-12-18 22:50:00.062,Visalar
75,20,2022-12-18 22:51:00.062,Visalar
75,20,2022-12-18 22:52:00.062,Visalar
76,20,2022-12-18 22:53:00.062,Visalar
76,20,2022-12-18 22:54:00.062,Visalar
76,20,2022-12-18 22:55:00.061,Visalar
76,20,2022-12-18 22:56:00.062,Visalar
76,20,2022-12-18 22:57:00.061,Visalar
76,20,2022-12-18 22:58:00.004,Visalar
76,20,2022-12-18 22:59:00.004,Visalar
76,20,2022-12-18 23:00:00.062,Visalar
76,20,2022-12-18 23:01:00.062,Visalar
76,20,2022-12-18 23:02:00.062,Visalar
76,20,2022-12-18 23:03:00.062,Visalar
76,20,2022-12-18 23:04:00.062,Visalar
76,20,2022-12-18 23:05:00.062,Visalar
76,20,2022-12-18 23:06:00.062,Visalar
76,20,2022-12-18 23:07:00.062,Visalar
76,20,2022-12-18 23:08:00.063,Visalar
79,21,2022-12-18 23:09:00.062,Visalar
79,21,2022-12-18 23:10:00.062,Visalar
79,21,2022-12-18 23:11:00.062,Visalar
79,21,2022-12-18 23:12:00.041,Visalar
79,21,2022-12-18 23:13:00.024,Visalar
79,21,2022-12-18 23:14:00.062,Visalar
79,21,2022-12-18 23:15:00.061,Visalar
78,21,2022-12-18 23:16:00.004,Visalar
78,21,2022-12-18 23:17:00.062,Visalar
78,21,2022-12-18 23:18:00.062,Visalar
78,21,2022-12-18 23:19:00.061,Visalar
77,21,2022-12-18 23:20:00.044,Visalar
77,21,2022-12-18 23:21:00.062,Visalar
77,21,2022-12-18 23:22:00.012,Visalar
77,21,2022-12-18 23:23:00.055,Visalar
77,21,2022-12-18 23:24:00.061,Visalar
76,21,2022-12-18 23:25:00.061,Visalar
76,21,2022-12-18 23:26:00.062,Visalar
76,21,2022-12-18 23:27:00.004,Visalar
76,21,2022-12-18 23:28:00.062,Visalar
76,21,2022-12-18 23:29:00.059,Visalar
75,21,2022-12-18 23:30:00.024,Visalar
75,21,2022-12-18 23:31:00.061,Visalar
57,20,2022-12-18 23:32:00.061,Visalar
58,20,2022-12-18 23:33:00.036,Visalar
58,20,2022-12-18 23:34:00.062,Visalar
58,20,2022-12-18 23:35:00.037,Visalar
58,20,2022-12-18 23:36:00.040,Visalar
58,20,2022-12-18 23:37:00.062,Visalar
58,20,2022-12-18 23:38:00.012,Visalar
58,20,2022-12-18 23:39:00.062,Visalar
58,20,2022-12-18 23:40:00.061,Visalar
58,20,2022-12-18 23:41:00.004,Visalar
58,20,2022-12-18 23:42:00.062,Visalar
59,20,2022-12-18 23:43:00.050,Visalar
59,20,2022-12-18 23:44:00.062,Visalar
59,20,2022-12-18 23:45:00.062,Visalar
59,20,2022-12-18 23:46:00.062,Visalar
59,20,2022-12-18 23:47:00.062,Visalar
59,20,2022-12-18 23:48:00.062,Visalar
59,20,2022-12-18 23:49:00.061,Visalar
60,20,2022-12-18 23:50:00.004,Visalar
60,20,2022-12-18 23:51:00.002,Visalar
60,20,2022-12-18 23:52:00.062,Visalar
60,20,2022-12-18 23:53:00.004,Visalar
60,20,2022-12-18 23:54:00.062,Visalar
60,20,2022-12-18 23:55:00.060,Visalar
78,21,2022-12-18 23:56:00.062,Visalar
78,21,2022-12-18 23:57:00.056,Visalar
78,21,2022-12-18 23:58:00.062,Visalar
78,21,2022-12-18 23:59:00.062,Visalar
