\relax 
\providecommand\hyper@newdestlabel[2]{}
\@writefile{toc}{\contentsline {chapter}{\numberline {6}Geometry Dependency of CET and Infrared In-situ Monitoring}{88}{chapter.6}}
\@writefile{lof}{\addvspace {10\p@ }}
\@writefile{lot}{\addvspace {10\p@ }}
\newlabel{ch:chapter_6}{{6}{88}{Geometry Dependency of CET and Infrared In-situ Monitoring}{chapter.6}{}}
\newlabel{ch:chapter_6@cref}{{[chapter][6][]6}{88}}
\@writefile{toc}{\contentsline {section}{\numberline {6.1}Effect of Build Geometry on CET}{88}{section.6.1}}
\@writefile{lof}{\contentsline {figure}{\numberline {6.1}{\ignorespaces Qualitative spot melting strategy.\relax }}{89}{figure.caption.82}}
\newlabel{fig:6_spot}{{6.1}{89}{Qualitative spot melting strategy.\relax }{figure.caption.82}{}}
\newlabel{fig:6_spot@cref}{{[figure][1][6]6.1}{89}}
\@writefile{toc}{\contentsline {subsection}{\numberline {6.1.1}Scan Strategy and Parameters}{89}{subsection.6.1.1}}
\newlabel{energy_eqn_6}{{6.1}{89}{Scan Strategy and Parameters}{equation.6.1.1}{}}
\newlabel{energy_eqn_6@cref}{{[equation][1][6]6.1}{89}}
\@writefile{lot}{\contentsline {table}{\numberline {6.1}{\ignorespaces Spot melt parameter list to study the effect of geometry on CET\relax }}{90}{table.6.1}}
\newlabel{tab_ch6}{{6.1}{90}{Spot melt parameter list to study the effect of geometry on CET\relax }{table.6.1}{}}
\newlabel{tab_ch6@cref}{{[table][1][6]6.1}{90}}
\@writefile{lof}{\contentsline {figure}{\numberline {6.2}{\ignorespaces (a) Schematic of the build showing part geometry and corresponding energy density (MJ/sq.m) (b) Top view of the fabricated component\relax }}{90}{figure.caption.83}}
\newlabel{fig:6_buildschematic}{{6.2}{90}{(a) Schematic of the build showing part geometry and corresponding energy density (MJ/sq.m) (b) Top view of the fabricated component\relax }{figure.caption.83}{}}
\newlabel{fig:6_buildschematic@cref}{{[figure][2][6]6.2}{90}}
\@writefile{toc}{\contentsline {subsection}{\numberline {6.1.2}Comparison of Texture}{91}{subsection.6.1.2}}
\@writefile{lof}{\contentsline {figure}{\numberline {6.3}{\ignorespaces Top surface of the parts showing the melt pools and corresponding grain morphology along the build direction.\relax }}{92}{figure.caption.84}}
\newlabel{fig:6_EBSD_1}{{6.3}{92}{Top surface of the parts showing the melt pools and corresponding grain morphology along the build direction.\relax }{figure.caption.84}{}}
\newlabel{fig:6_EBSD_1@cref}{{[figure][3][6]6.3}{92}}
\@writefile{lof}{\contentsline {figure}{\numberline {6.4}{\ignorespaces EBSD and corresponding texture plot of (a) part 5 and (b) part 6 along the plane perpendicular (XY plane) to the build direction.\relax }}{93}{figure.caption.85}}
\newlabel{fig:6_XY}{{6.4}{93}{EBSD and corresponding texture plot of (a) part 5 and (b) part 6 along the plane perpendicular (XY plane) to the build direction.\relax }{figure.caption.85}{}}
\newlabel{fig:6_XY@cref}{{[figure][4][6]6.4}{93}}
\@writefile{lof}{\contentsline {figure}{\numberline {6.5}{\ignorespaces A Demonstration component with hybrid microstructure \relax }}{94}{figure.caption.86}}
\newlabel{fig:6_demo}{{6.5}{94}{A Demonstration component with hybrid microstructure \relax }{figure.caption.86}{}}
\newlabel{fig:6_demo@cref}{{[figure][5][6]6.5}{94}}
\@writefile{toc}{\contentsline {subsection}{\numberline {6.1.3}Analysis of Island Melt Strategy to Overcome Geometry Effect}{94}{subsection.6.1.3}}
\@writefile{lof}{\contentsline {figure}{\numberline {6.6}{\ignorespaces Schematic and sequence of tile melt strategy.\relax }}{95}{figure.caption.87}}
\newlabel{fig:6_tile}{{6.6}{95}{Schematic and sequence of tile melt strategy.\relax }{figure.caption.87}{}}
\newlabel{fig:6_tile@cref}{{[figure][6][6]6.6}{95}}
\@writefile{lof}{\contentsline {figure}{\numberline {6.7}{\ignorespaces Top view of fabricated samples.\relax }}{96}{figure.caption.88}}
\newlabel{fig:6_tilefab}{{6.7}{96}{Top view of fabricated samples.\relax }{figure.caption.88}{}}
\newlabel{fig:6_tilefab@cref}{{[figure][7][6]6.7}{96}}
\@writefile{lof}{\contentsline {figure}{\numberline {6.8}{\ignorespaces EBSD of samples\relax }}{97}{figure.caption.89}}
\newlabel{fig:6_tileebsd}{{6.8}{97}{EBSD of samples\relax }{figure.caption.89}{}}
\newlabel{fig:6_tileebsd@cref}{{[figure][8][6]6.8}{97}}
\@writefile{lot}{\contentsline {table}{\numberline {6.2}{\ignorespaces Spot melt parameter list to study the effect of geometry on CET\relax }}{98}{table.6.2}}
\newlabel{tab:tile_ch6}{{6.2}{98}{Spot melt parameter list to study the effect of geometry on CET\relax }{table.6.2}{}}
\newlabel{tab:tile_ch6@cref}{{[table][2][6]6.2}{98}}
\@writefile{toc}{\contentsline {section}{\numberline {6.2}Infrared Imaging}{99}{section.6.2}}
\@writefile{toc}{\contentsline {subsection}{\numberline {6.2.1}Algorithm for Calibration of IR data}{100}{subsection.6.2.1}}
\newlabel{eqn:sinteredpowder_5}{{6.2}{100}{Algorithm for Calibration of IR data}{equation.6.2.2}{}}
\newlabel{eqn:sinteredpowder_5@cref}{{[equation][2][6]6.2}{100}}
\newlabel{eqn:printedcalib_5}{{6.3}{100}{Algorithm for Calibration of IR data}{equation.6.2.3}{}}
\newlabel{eqn:printedcalib_5@cref}{{[equation][3][6]6.3}{100}}
\@writefile{toc}{\contentsline {subsection}{\numberline {6.2.2}Experimental Observation}{101}{subsection.6.2.2}}
\@writefile{lof}{\contentsline {figure}{\numberline {6.9}{\ignorespaces Flowchart describing the algorithm to identify the state of a pixel and calculate spatiotemporal G \& R data (recreated based on Raplee et al. \cite {raplee2017thermographic}.)\relax }}{102}{figure.caption.90}}
\newlabel{fig:6_thermoflowchart}{{6.9}{102}{Flowchart describing the algorithm to identify the state of a pixel and calculate spatiotemporal G \& R data (recreated based on Raplee et al. \cite {raplee2017thermographic}.)\relax }{figure.caption.90}{}}
\newlabel{fig:6_thermoflowchart@cref}{{[figure][9][6]6.9}{102}}
\@writefile{lof}{\contentsline {figure}{\numberline {6.10}{\ignorespaces Regional slope of (a) unmelted and (b) melted pixel. \cite {raplee2017thermographic}.\relax }}{103}{figure.caption.91}}
\newlabel{fig:6_IRslope}{{6.10}{103}{Regional slope of (a) unmelted and (b) melted pixel. \cite {raplee2017thermographic}.\relax }{figure.caption.91}{}}
\newlabel{fig:6_IRslope@cref}{{[figure][10][6]6.10}{103}}
\@writefile{lof}{\contentsline {figure}{\numberline {6.11}{\ignorespaces G and R calculated from IR data for (a) sample 1 (b) sample 2.\relax }}{103}{figure.caption.92}}
\newlabel{fig:6_GR}{{6.11}{103}{G and R calculated from IR data for (a) sample 1 (b) sample 2.\relax }{figure.caption.92}{}}
\newlabel{fig:6_GR@cref}{{[figure][11][6]6.11}{103}}
\@writefile{lof}{\contentsline {figure}{\numberline {6.12}{\ignorespaces Surface topology of (a) sample 1 and (b) sample 2.\relax }}{104}{figure.caption.93}}
\newlabel{fig:6_keyence}{{6.12}{104}{Surface topology of (a) sample 1 and (b) sample 2.\relax }{figure.caption.93}{}}
\newlabel{fig:6_keyence@cref}{{[figure][12][6]6.12}{104}}
\@writefile{lof}{\contentsline {figure}{\numberline {6.13}{\ignorespaces G and R overlay on reference solidification map \cite {nastac2001advances} of IN718 for (a) sample 1 and (b) sample 2.\relax }}{105}{figure.caption.94}}
\newlabel{fig:6_thermoGR}{{6.13}{105}{G and R overlay on reference solidification map \cite {nastac2001advances} of IN718 for (a) sample 1 and (b) sample 2.\relax }{figure.caption.94}{}}
\newlabel{fig:6_thermoGR@cref}{{[figure][13][6]6.13}{105}}
\@writefile{toc}{\contentsline {section}{\numberline {6.3}Summary}{105}{section.6.3}}
\@writefile{lof}{\contentsline {figure}{\numberline {6.14}{\ignorespaces EBSD and aspect ratio map of (a) top region and (b) bottom region of sample 2.\relax }}{106}{figure.caption.95}}
\newlabel{fig:6_edge}{{6.14}{106}{EBSD and aspect ratio map of (a) top region and (b) bottom region of sample 2.\relax }{figure.caption.95}{}}
\newlabel{fig:6_edge@cref}{{[figure][14][6]6.14}{106}}
\@setckpt{chapter-6}{
\setcounter{page}{108}
\setcounter{equation}{3}
\setcounter{enumi}{3}
\setcounter{enumii}{0}
\setcounter{enumiii}{0}
\setcounter{enumiv}{0}
\setcounter{footnote}{0}
\setcounter{mpfootnote}{0}
\setcounter{part}{0}
\setcounter{chapter}{6}
\setcounter{section}{3}
\setcounter{subsection}{0}
\setcounter{subsubsection}{0}
\setcounter{paragraph}{0}
\setcounter{subparagraph}{0}
\setcounter{figure}{14}
\setcounter{table}{2}
\setcounter{parentequation}{0}
\setcounter{Item}{3}
\setcounter{Hfootnote}{0}
\setcounter{bookmark@seq@number}{66}
\setcounter{theorem}{0}
\setcounter{corollary}{0}
\setcounter{lemma}{0}
\setcounter{lstnumber}{1}
\setcounter{float@type}{8}
\setcounter{tabx@nest}{0}
\setcounter{listtotal}{0}
\setcounter{listcount}{0}
\setcounter{liststart}{0}
\setcounter{liststop}{0}
\setcounter{citecount}{0}
\setcounter{citetotal}{0}
\setcounter{multicitecount}{0}
\setcounter{multicitetotal}{0}
\setcounter{instcount}{256}
\setcounter{maxnames}{3}
\setcounter{minnames}{1}
\setcounter{maxitems}{3}
\setcounter{minitems}{1}
\setcounter{citecounter}{0}
\setcounter{savedcitecounter}{0}
\setcounter{uniquelist}{0}
\setcounter{uniquename}{0}
\setcounter{refsection}{0}
\setcounter{refsegment}{0}
\setcounter{maxextratitle}{0}
\setcounter{maxextratitleyear}{0}
\setcounter{maxextrayear}{0}
\setcounter{maxextraalpha}{0}
\setcounter{abbrvpenalty}{5000}
\setcounter{highnamepenalty}{5000}
\setcounter{lownamepenalty}{2500}
\setcounter{maxparens}{3}
\setcounter{parenlevel}{0}
\setcounter{mincomprange}{10}
\setcounter{maxcomprange}{100000}
\setcounter{mincompwidth}{1}
\setcounter{afterword}{0}
\setcounter{savedafterword}{0}
\setcounter{annotator}{0}
\setcounter{savedannotator}{0}
\setcounter{author}{0}
\setcounter{savedauthor}{0}
\setcounter{bookauthor}{0}
\setcounter{savedbookauthor}{0}
\setcounter{commentator}{0}
\setcounter{savedcommentator}{0}
\setcounter{editor}{0}
\setcounter{savededitor}{0}
\setcounter{editora}{0}
\setcounter{savededitora}{0}
\setcounter{editorb}{0}
\setcounter{savededitorb}{0}
\setcounter{editorc}{0}
\setcounter{savededitorc}{0}
\setcounter{foreword}{0}
\setcounter{savedforeword}{0}
\setcounter{holder}{0}
\setcounter{savedholder}{0}
\setcounter{introduction}{0}
\setcounter{savedintroduction}{0}
\setcounter{namea}{0}
\setcounter{savednamea}{0}
\setcounter{nameb}{0}
\setcounter{savednameb}{0}
\setcounter{namec}{0}
\setcounter{savednamec}{0}
\setcounter{translator}{0}
\setcounter{savedtranslator}{0}
\setcounter{shortauthor}{0}
\setcounter{savedshortauthor}{0}
\setcounter{shorteditor}{0}
\setcounter{savedshorteditor}{0}
\setcounter{labelname}{0}
\setcounter{savedlabelname}{0}
\setcounter{institution}{0}
\setcounter{savedinstitution}{0}
\setcounter{lista}{0}
\setcounter{savedlista}{0}
\setcounter{listb}{0}
\setcounter{savedlistb}{0}
\setcounter{listc}{0}
\setcounter{savedlistc}{0}
\setcounter{listd}{0}
\setcounter{savedlistd}{0}
\setcounter{liste}{0}
\setcounter{savedliste}{0}
\setcounter{listf}{0}
\setcounter{savedlistf}{0}
\setcounter{location}{0}
\setcounter{savedlocation}{0}
\setcounter{organization}{0}
\setcounter{savedorganization}{0}
\setcounter{origlocation}{0}
\setcounter{savedoriglocation}{0}
\setcounter{origpublisher}{0}
\setcounter{savedorigpublisher}{0}
\setcounter{publisher}{0}
\setcounter{savedpublisher}{0}
\setcounter{language}{0}
\setcounter{savedlanguage}{0}
\setcounter{pageref}{0}
\setcounter{savedpageref}{0}
\setcounter{textcitecount}{0}
\setcounter{textcitetotal}{0}
\setcounter{textcitemaxnames}{0}
\setcounter{biburlnumpenalty}{0}
\setcounter{biburlucpenalty}{0}
\setcounter{biburllcpenalty}{0}
\setcounter{smartand}{1}
\setcounter{bbx:relatedcount}{0}
\setcounter{bbx:relatedtotal}{0}
\setcounter{ContinuedFloat}{0}
\setcounter{lips@count}{0}
\setcounter{r@tfl@t}{0}
\setcounter{MYtempeqncnt}{0}
\setcounter{KVtest}{0}
\setcounter{subfigure}{0}
\setcounter{subfigure@save}{0}
\setcounter{lofdepth}{1}
\setcounter{subtable}{0}
\setcounter{subtable@save}{0}
\setcounter{lotdepth}{1}
\setcounter{@stackindex}{0}
\setcounter{ROWcellindex@}{0}
\setcounter{section@level}{1}
\setcounter{lstlisting}{0}
}
