[1] Config.pm:354> INFO - This is Biber 2.7
[2] Config.pm:357> INFO - Logfile is 'main.blg'
[171] biber-MSWIN64:303> INFO - === 
[288] Biber.pm:359> INFO - Reading 'main.bcf'
[751] Biber.pm:835> INFO - Found 140 citekeys in bib section 0
[814] Biber.pm:3670> INFO - Processing section 0
[900] Biber.pm:3840> INFO - Looking for bibtex format file 'references.bib' for section 0
[950] bibtex.pm:1435> INFO - Decoding LaTeX character macros into UTF-8
[1049] bibtex.pm:1292> INFO - Found BibTeX data source 'references.bib'
[1066] Utils.pm:164> WARN - Duplicate entry key: 'david1990microstructure' in file 'references.bib', skipping ...
[1074] Utils.pm:164> WARN - Duplicate entry key: 'dinwiddie2016calibrating' in file 'references.bib', skipping ...
[1080] Utils.pm:164> WARN - Duplicate entry key: 'rai2007heat' in file 'references.bib', skipping ...
[1122] Utils.pm:164> WARN - Duplicate entry key: 'messler2008principles' in file 'references.bib', skipping ...
[1123] Utils.pm:164> WARN - Duplicate entry key: 'zah2010modelling' in file 'references.bib', skipping ...
[1124] Utils.pm:164> WARN - Duplicate entry key: 'korzekwa2009truchas' in file 'references.bib', skipping ...
[1125] Utils.pm:164> WARN - Duplicate entry key: 'helmer2016grain' in file 'references.bib', skipping ...
[1126] Utils.pm:164> WARN - Duplicate entry key: 'david1989correlation' in file 'references.bib', skipping ...
[1127] Utils.pm:164> WARN - Duplicate entry key: 'he2005heat' in file 'references.bib', skipping ...
[1131] Utils.pm:164> WARN - Duplicate entry key: 'pollock2006nickel' in file 'references.bib', skipping ...
[1133] Utils.pm:164> WARN - Duplicate entry key: 'nastac2001advances' in file 'references.bib', skipping ...
[1141] Utils.pm:164> WARN - Duplicate entry key: 'korzekwa2009truchas' in file 'references.bib', skipping ...
[2514] UCollate.pm:68> INFO - Overriding locale 'en-US' defaults 'variable = shifted' with 'variable = non-ignorable'
[2515] UCollate.pm:68> INFO - Overriding locale 'en-US' defaults 'normalization = NFD' with 'normalization = prenormalized'
[2515] Biber.pm:3499> INFO - Sorting list 'none/global/' of type 'entry' with scheme 'none' and locale 'en-US'
[2515] Biber.pm:3505> INFO - No sort tailoring available for locale 'en-US'
[2889] bbl.pm:608> INFO - Writing 'main.bbl' with encoding 'ascii'
[2908] Utils.pm:164> WARN - The entry 'ramsperger2016microstructure' has characters which cannot be encoded in 'ascii'. Recoding problematic characters into macros.
[2917] Utils.pm:164> WARN - The entry 'jardini2014cranial' has characters which cannot be encoded in 'ascii'. Recoding problematic characters into macros.
[2928] Utils.pm:164> WARN - The entry 'xie2005ttt' has characters which cannot be encoded in 'ascii'. Recoding problematic characters into macros.
[2939] Utils.pm:164> WARN - The entry 'gaumann2001single' has characters which cannot be encoded in 'ascii'. Recoding problematic characters into macros.
[2942] Utils.pm:164> WARN - The entry 'gaumann1997nucleation' has characters which cannot be encoded in 'ascii'. Recoding problematic characters into macros.
[2959] Utils.pm:164> WARN - The entry 'zah2010modelling' has characters which cannot be encoded in 'ascii'. Recoding problematic characters into macros.
[2991] Utils.pm:164> WARN - The entry 'helmer2016grain' has characters which cannot be encoded in 'ascii'. Recoding problematic characters into macros.
[2998] Utils.pm:164> WARN - The entry 'francois2006modeling' has characters which cannot be encoded in 'ascii'. Recoding problematic characters into macros.
[3002] Utils.pm:164> WARN - The entry 'franccois2015recent' has characters which cannot be encoded in 'ascii'. Recoding problematic characters into macros.
[3026] Utils.pm:164> WARN - The entry 'langer1977stability' has characters which cannot be encoded in 'ascii'. Recoding problematic characters into macros.
[3035] Utils.pm:164> WARN - The entry 'aveson2014origins' has characters which cannot be encoded in 'ascii'. Recoding problematic characters into macros.
[3065] bbl.pm:712> INFO - Output to main.bbl
[3086] Biber.pm:109> INFO - WARNINGS: 23
