\relax 
\providecommand\hyper@newdestlabel[2]{}
\@writefile{toc}{\contentsline {chapter}{\numberline {7}Effect of Fluid Flow and Surface Tension Gradient on Solidification}{108}{chapter.7}}
\@writefile{lof}{\addvspace {10\p@ }}
\@writefile{lot}{\addvspace {10\p@ }}
\newlabel{ch:chapter_7}{{7}{108}{Effect of Fluid Flow and Surface Tension Gradient on Solidification}{chapter.7}{}}
\newlabel{ch:chapter_7@cref}{{[chapter][7][]7}{108}}
\@writefile{toc}{\contentsline {section}{\numberline {7.1}Effect of Surface Tension on Convection}{108}{section.7.1}}
\newlabel{sahoo_eqn_ch7}{{7.1}{109}{Effect of Surface Tension on Convection}{equation.7.1.1}{}}
\newlabel{sahoo_eqn_ch7@cref}{{[equation][1][7]7.1}{109}}
\@writefile{toc}{\contentsline {section}{\numberline {7.2}Conservation Equations}{109}{section.7.2}}
\@writefile{lof}{\contentsline {figure}{\numberline {7.1}{\ignorespaces (a) Variation of surface tension with temperature (b) Top surface flow (c) Side view of the flow pattern\relax }}{110}{figure.caption.96}}
\newlabel{fig:7_schematic}{{7.1}{110}{(a) Variation of surface tension with temperature (b) Top surface flow (c) Side view of the flow pattern\relax }{figure.caption.96}{}}
\newlabel{fig:7_schematic@cref}{{[figure][1][7]7.1}{110}}
\newlabel{energy_eqn_ch7}{{7.2}{110}{Conservation Equations}{equation.7.2.2}{}}
\newlabel{energy_eqn_ch7@cref}{{[equation][2][7]7.2}{110}}
\newlabel{mass_eqn_ch7}{{7.3}{110}{Conservation Equations}{equation.7.2.3}{}}
\newlabel{mass_eqn_ch7@cref}{{[equation][3][7]7.3}{110}}
\newlabel{moment_eqn_ch7}{{7.4}{110}{Conservation Equations}{equation.7.2.4}{}}
\newlabel{moment_eqn_ch7@cref}{{[equation][4][7]7.4}{110}}
\@writefile{toc}{\contentsline {section}{\numberline {7.3}Simulation and Results}{110}{section.7.3}}
\@writefile{lof}{\contentsline {figure}{\numberline {7.2}{\ignorespaces Surface Tension as a function of temperature for IN718 with different surfactant concentration \cite {lee1998modelling}\relax }}{111}{figure.caption.97}}
\newlabel{fig:7_surfacetension}{{7.2}{111}{Surface Tension as a function of temperature for IN718 with different surfactant concentration \cite {lee1998modelling}\relax }{figure.caption.97}{}}
\newlabel{fig:7_surfacetension@cref}{{[figure][2][7]7.2}{111}}
\newlabel{STLS_eqn_ch7}{{7.5}{111}{Simulation and Results}{equation.7.3.5}{}}
\newlabel{STLS_eqn_ch7@cref}{{[equation][5][7]7.5}{111}}
\newlabel{STGLS_eqn_ch7}{{7.6}{111}{Simulation and Results}{equation.7.3.6}{}}
\newlabel{STGLS_eqn_ch7@cref}{{[equation][6][7]7.6}{111}}
\newlabel{STHS_eqn_ch7}{{7.7}{112}{Simulation and Results}{equation.7.3.7}{}}
\newlabel{STHS_eqn_ch7@cref}{{[equation][7][7]7.7}{112}}
\newlabel{STGHS_eqn_ch7}{{7.8}{112}{Simulation and Results}{equation.7.3.8}{}}
\newlabel{STGHS_eqn_ch7@cref}{{[equation][8][7]7.8}{112}}
\@writefile{toc}{\contentsline {subsection}{\numberline {7.3.1}Preaheat Temperature: 25\textdegree C}{112}{subsection.7.3.1}}
\@writefile{lof}{\contentsline {figure}{\numberline {7.3}{\ignorespaces Thermal gradient $G$ (a) Pure Heat transfer (b) Fluid flow (Low Surfactant) (c) Fluid flow (High Surfactant)\relax }}{112}{figure.caption.98}}
\newlabel{fig:7_25C_G}{{7.3}{112}{Thermal gradient $G$ (a) Pure Heat transfer (b) Fluid flow (Low Surfactant) (c) Fluid flow (High Surfactant)\relax }{figure.caption.98}{}}
\newlabel{fig:7_25C_G@cref}{{[figure][3][7]7.3}{112}}
\@writefile{lof}{\contentsline {figure}{\numberline {7.4}{\ignorespaces Comparison of fluid flow pattern for low and high surfactant concentration at (a) \SI {3}{\milli \second } (b) \SI {3.5}{\milli \second } (c) \SI {4.5}{\milli \second }\relax }}{113}{figure.caption.99}}
\newlabel{fig:7_25C_Velocity}{{7.4}{113}{Comparison of fluid flow pattern for low and high surfactant concentration at (a) \SI {3}{\milli \second } (b) \SI {3.5}{\milli \second } (c) \SI {4.5}{\milli \second }\relax }{figure.caption.99}{}}
\newlabel{fig:7_25C_Velocity@cref}{{[figure][4][7]7.4}{113}}
\@writefile{toc}{\contentsline {subsection}{\numberline {7.3.2}Preaheat Temperature: 1000\textdegree C}{113}{subsection.7.3.2}}
\@writefile{lof}{\contentsline {figure}{\numberline {7.5}{\ignorespaces Thermal gradient $G$ (a) Pure Heat transfer (b) Fluid flow (Low Surfactant) (c) Fluid flow (High Surfactant)\relax }}{113}{figure.caption.100}}
\newlabel{fig:7_1000C_G}{{7.5}{113}{Thermal gradient $G$ (a) Pure Heat transfer (b) Fluid flow (Low Surfactant) (c) Fluid flow (High Surfactant)\relax }{figure.caption.100}{}}
\newlabel{fig:7_1000C_G@cref}{{[figure][5][7]7.5}{113}}
\@writefile{lof}{\contentsline {figure}{\numberline {7.6}{\ignorespaces Comparison of fluid flow pattern for low and high surfactant concentration at (a) \SI {4}{\milli \second } (b) \SI {5}{\milli \second } (c) \SI {8}{\milli \second }\relax }}{114}{figure.caption.101}}
\newlabel{fig:7_1000C_Velocity}{{7.6}{114}{Comparison of fluid flow pattern for low and high surfactant concentration at (a) \SI {4}{\milli \second } (b) \SI {5}{\milli \second } (c) \SI {8}{\milli \second }\relax }{figure.caption.101}{}}
\newlabel{fig:7_1000C_Velocity@cref}{{[figure][6][7]7.6}{114}}
\@writefile{toc}{\contentsline {subsection}{\numberline {7.3.3}Comparison of Peclet number}{114}{subsection.7.3.3}}
\newlabel{eqn:peclet_ch7}{{7.9}{115}{Comparison of Peclet number}{equation.7.3.9}{}}
\newlabel{eqn:peclet_ch7@cref}{{[equation][9][7]7.9}{115}}
\@writefile{lof}{\contentsline {figure}{\numberline {7.7}{\ignorespaces Comparison of Peclet number for low and high surfactant concentration with preheat of 25\textdegree C at (a) \SI {3}{\milli \second } (b) \SI {3.5}{\milli \second } (c) \SI {4.5}{\milli \second }\relax }}{115}{figure.caption.102}}
\newlabel{fig:7_Peclet_100}{{7.7}{115}{Comparison of Peclet number for low and high surfactant concentration with preheat of 25\textdegree C at (a) \SI {3}{\milli \second } (b) \SI {3.5}{\milli \second } (c) \SI {4.5}{\milli \second }\relax }{figure.caption.102}{}}
\newlabel{fig:7_Peclet_100@cref}{{[figure][7][7]7.7}{115}}
\@writefile{lof}{\contentsline {figure}{\numberline {7.8}{\ignorespaces Comparison of Peclet for low and high surfactant concentration with preheat of 1000\textdegree C at (a) \SI {4}{\milli \second } (b) \SI {5}{\milli \second } (c) \SI {8}{\milli \second }\relax }}{116}{figure.caption.103}}
\newlabel{fig:7_Peclet_1000}{{7.8}{116}{Comparison of Peclet for low and high surfactant concentration with preheat of 1000\textdegree C at (a) \SI {4}{\milli \second } (b) \SI {5}{\milli \second } (c) \SI {8}{\milli \second }\relax }{figure.caption.103}{}}
\newlabel{fig:7_Peclet_1000@cref}{{[figure][8][7]7.8}{116}}
\@writefile{toc}{\contentsline {subsection}{\numberline {7.3.4}Effect of fluid flow on microstructure}{116}{subsection.7.3.4}}
\@writefile{lot}{\contentsline {table}{\numberline {7.1}{\ignorespaces Comparison of $\Phi $ value with and without fluid flow in the model\relax }}{116}{table.7.1}}
\newlabel{tab:phi_ch7}{{7.1}{116}{Comparison of $\Phi $ value with and without fluid flow in the model\relax }{table.7.1}{}}
\newlabel{tab:phi_ch7@cref}{{[table][1][7]7.1}{116}}
\@writefile{lof}{\contentsline {figure}{\numberline {7.9}{\ignorespaces Comparison of shape of simulated melt pool with internal point offset of \SI {200}{\micro \meter } (a) Pure heat transfer - top surface (XY plane) (b) Pure heat transfer - build direction (XZ plane) (c) heat transfer plus fluid flow (high surfactant) - top surface (XY plane) (d) heat transfer plus fluid flow (high surfactant) - build direction (XZ plane)\relax }}{117}{figure.caption.104}}
\newlabel{fig:7_200_comparison}{{7.9}{117}{Comparison of shape of simulated melt pool with internal point offset of \SI {200}{\micro \meter } (a) Pure heat transfer - top surface (XY plane) (b) Pure heat transfer - build direction (XZ plane) (c) heat transfer plus fluid flow (high surfactant) - top surface (XY plane) (d) heat transfer plus fluid flow (high surfactant) - build direction (XZ plane)\relax }{figure.caption.104}{}}
\newlabel{fig:7_200_comparison@cref}{{[figure][9][7]7.9}{117}}
\@writefile{toc}{\contentsline {subsection}{\numberline {7.3.5}Significance of Scan Strategy on Fluid Flow and Experimental Comparison of melt pool shape:}{117}{subsection.7.3.5}}
\@writefile{lof}{\contentsline {figure}{\numberline {7.10}{\ignorespaces Melt pool with internal point offset of \SI {200}{\micro \meter } (a) Top surface (XY plane) (b) Build direction (XZ plane)\relax }}{118}{figure.caption.105}}
\newlabel{fig:7_200_keyence}{{7.10}{118}{Melt pool with internal point offset of \SI {200}{\micro \meter } (a) Top surface (XY plane) (b) Build direction (XZ plane)\relax }{figure.caption.105}{}}
\newlabel{fig:7_200_keyence@cref}{{[figure][10][7]7.10}{118}}
\@writefile{lof}{\contentsline {figure}{\numberline {7.11}{\ignorespaces Comparison of shape of simulated melt pool with internal point offset of \SI {800}{\micro \meter } (a) Pure heat transfer - top surface (XY plane) (b) Pure heat transfer - build direction (XZ plane) (c) heat transfer plus fluid flow (high surfactant) - top surface (XY plane) (d) heat transfer plus fluid flow (high surfactant) - build direction (XZ plane)\relax }}{119}{figure.caption.106}}
\newlabel{fig:7_800_comparison}{{7.11}{119}{Comparison of shape of simulated melt pool with internal point offset of \SI {800}{\micro \meter } (a) Pure heat transfer - top surface (XY plane) (b) Pure heat transfer - build direction (XZ plane) (c) heat transfer plus fluid flow (high surfactant) - top surface (XY plane) (d) heat transfer plus fluid flow (high surfactant) - build direction (XZ plane)\relax }{figure.caption.106}{}}
\newlabel{fig:7_800_comparison@cref}{{[figure][11][7]7.11}{119}}
\@writefile{lof}{\contentsline {figure}{\numberline {7.12}{\ignorespaces Melt pool with internal point offset of \SI {800}{\micro \meter } (a) Top surface (XY plane) (b) Build direction (XZ plane)\relax }}{119}{figure.caption.107}}
\newlabel{fig:7_800_keyence}{{7.12}{119}{Melt pool with internal point offset of \SI {800}{\micro \meter } (a) Top surface (XY plane) (b) Build direction (XZ plane)\relax }{figure.caption.107}{}}
\newlabel{fig:7_800_keyence@cref}{{[figure][12][7]7.12}{119}}
\@writefile{lot}{\contentsline {table}{\numberline {7.2}{\ignorespaces Experimental comparison of width and depth of the melt pool with and without fluid flow in the model\relax }}{120}{table.7.2}}
\newlabel{tab:shape_ch7}{{7.2}{120}{Experimental comparison of width and depth of the melt pool with and without fluid flow in the model\relax }{table.7.2}{}}
\newlabel{tab:shape_ch7@cref}{{[table][2][7]7.2}{120}}
\@writefile{toc}{\contentsline {section}{\numberline {7.4}Summary}{120}{section.7.4}}
\@setckpt{chapter-7}{
\setcounter{page}{122}
\setcounter{equation}{9}
\setcounter{enumi}{3}
\setcounter{enumii}{0}
\setcounter{enumiii}{0}
\setcounter{enumiv}{0}
\setcounter{footnote}{0}
\setcounter{mpfootnote}{0}
\setcounter{part}{0}
\setcounter{chapter}{7}
\setcounter{section}{4}
\setcounter{subsection}{0}
\setcounter{subsubsection}{0}
\setcounter{paragraph}{0}
\setcounter{subparagraph}{0}
\setcounter{figure}{12}
\setcounter{table}{2}
\setcounter{parentequation}{0}
\setcounter{Item}{3}
\setcounter{Hfootnote}{0}
\setcounter{bookmark@seq@number}{76}
\setcounter{theorem}{0}
\setcounter{corollary}{0}
\setcounter{lemma}{0}
\setcounter{lstnumber}{1}
\setcounter{float@type}{8}
\setcounter{tabx@nest}{0}
\setcounter{listtotal}{0}
\setcounter{listcount}{0}
\setcounter{liststart}{0}
\setcounter{liststop}{0}
\setcounter{citecount}{0}
\setcounter{citetotal}{0}
\setcounter{multicitecount}{0}
\setcounter{multicitetotal}{0}
\setcounter{instcount}{277}
\setcounter{maxnames}{3}
\setcounter{minnames}{1}
\setcounter{maxitems}{3}
\setcounter{minitems}{1}
\setcounter{citecounter}{0}
\setcounter{savedcitecounter}{0}
\setcounter{uniquelist}{0}
\setcounter{uniquename}{0}
\setcounter{refsection}{0}
\setcounter{refsegment}{0}
\setcounter{maxextratitle}{0}
\setcounter{maxextratitleyear}{0}
\setcounter{maxextrayear}{0}
\setcounter{maxextraalpha}{0}
\setcounter{abbrvpenalty}{5000}
\setcounter{highnamepenalty}{5000}
\setcounter{lownamepenalty}{2500}
\setcounter{maxparens}{3}
\setcounter{parenlevel}{0}
\setcounter{mincomprange}{10}
\setcounter{maxcomprange}{100000}
\setcounter{mincompwidth}{1}
\setcounter{afterword}{0}
\setcounter{savedafterword}{0}
\setcounter{annotator}{0}
\setcounter{savedannotator}{0}
\setcounter{author}{0}
\setcounter{savedauthor}{0}
\setcounter{bookauthor}{0}
\setcounter{savedbookauthor}{0}
\setcounter{commentator}{0}
\setcounter{savedcommentator}{0}
\setcounter{editor}{0}
\setcounter{savededitor}{0}
\setcounter{editora}{0}
\setcounter{savededitora}{0}
\setcounter{editorb}{0}
\setcounter{savededitorb}{0}
\setcounter{editorc}{0}
\setcounter{savededitorc}{0}
\setcounter{foreword}{0}
\setcounter{savedforeword}{0}
\setcounter{holder}{0}
\setcounter{savedholder}{0}
\setcounter{introduction}{0}
\setcounter{savedintroduction}{0}
\setcounter{namea}{0}
\setcounter{savednamea}{0}
\setcounter{nameb}{0}
\setcounter{savednameb}{0}
\setcounter{namec}{0}
\setcounter{savednamec}{0}
\setcounter{translator}{0}
\setcounter{savedtranslator}{0}
\setcounter{shortauthor}{0}
\setcounter{savedshortauthor}{0}
\setcounter{shorteditor}{0}
\setcounter{savedshorteditor}{0}
\setcounter{labelname}{0}
\setcounter{savedlabelname}{0}
\setcounter{institution}{0}
\setcounter{savedinstitution}{0}
\setcounter{lista}{0}
\setcounter{savedlista}{0}
\setcounter{listb}{0}
\setcounter{savedlistb}{0}
\setcounter{listc}{0}
\setcounter{savedlistc}{0}
\setcounter{listd}{0}
\setcounter{savedlistd}{0}
\setcounter{liste}{0}
\setcounter{savedliste}{0}
\setcounter{listf}{0}
\setcounter{savedlistf}{0}
\setcounter{location}{0}
\setcounter{savedlocation}{0}
\setcounter{organization}{0}
\setcounter{savedorganization}{0}
\setcounter{origlocation}{0}
\setcounter{savedoriglocation}{0}
\setcounter{origpublisher}{0}
\setcounter{savedorigpublisher}{0}
\setcounter{publisher}{0}
\setcounter{savedpublisher}{0}
\setcounter{language}{0}
\setcounter{savedlanguage}{0}
\setcounter{pageref}{0}
\setcounter{savedpageref}{0}
\setcounter{textcitecount}{0}
\setcounter{textcitetotal}{0}
\setcounter{textcitemaxnames}{0}
\setcounter{biburlnumpenalty}{0}
\setcounter{biburlucpenalty}{0}
\setcounter{biburllcpenalty}{0}
\setcounter{smartand}{1}
\setcounter{bbx:relatedcount}{0}
\setcounter{bbx:relatedtotal}{0}
\setcounter{ContinuedFloat}{0}
\setcounter{lips@count}{0}
\setcounter{r@tfl@t}{0}
\setcounter{MYtempeqncnt}{0}
\setcounter{KVtest}{0}
\setcounter{subfigure}{0}
\setcounter{subfigure@save}{0}
\setcounter{lofdepth}{1}
\setcounter{subtable}{0}
\setcounter{subtable@save}{0}
\setcounter{lotdepth}{1}
\setcounter{@stackindex}{0}
\setcounter{ROWcellindex@}{0}
\setcounter{section@level}{1}
\setcounter{lstlisting}{0}
}
