\relax 
\providecommand\hyper@newdestlabel[2]{}
\@writefile{toc}{\contentsline {chapter}{\numberline {3}Overview of Numerical Modeling Framework}{36}{chapter.3}}
\@writefile{lof}{\addvspace {10\p@ }}
\@writefile{lot}{\addvspace {10\p@ }}
\newlabel{ch:chapter_3}{{3}{36}{Overview of Numerical Modeling Framework}{chapter.3}{}}
\newlabel{ch:chapter_3@cref}{{[chapter][3][]3}{36}}
\@writefile{toc}{\contentsline {section}{\numberline {3.1}Truchas}{36}{section.3.1}}
\@writefile{toc}{\contentsline {subsection}{\numberline {3.1.1}Conservation Equations}{36}{subsection.3.1.1}}
\newlabel{conserv_eqn_ch3}{{3.1}{37}{Conservation Equations}{equation.3.1.1}{}}
\newlabel{conserv_eqn_ch3@cref}{{[equation][1][3]3.1}{37}}
\@writefile{toc}{\contentsline {subsection}{\numberline {3.1.2}Heat Source Profile}{37}{subsection.3.1.2}}
\newlabel{Ixy_eqn_ch3}{{3.2}{37}{Heat Source Profile}{equation.3.1.2}{}}
\newlabel{Ixy_eqn_ch3@cref}{{[equation][2][3]3.2}{37}}
\newlabel{Iz_eqn_ch3}{{3.3}{38}{Heat Source Profile}{equation.3.1.3}{}}
\newlabel{Iz_eqn_ch3@cref}{{[equation][3][3]3.3}{38}}
\newlabel{ze_eqn_ch3}{{3.4}{38}{Heat Source Profile}{equation.3.1.4}{}}
\newlabel{ze_eqn_ch3@cref}{{[equation][4][3]3.4}{38}}
\newlabel{vol_eqn_ch3}{{3.5}{38}{Heat Source Profile}{equation.3.1.5}{}}
\newlabel{vol_eqn_ch3@cref}{{[equation][5][3]3.5}{38}}
\newlabel{qmax_eqn_ch3}{{3.6}{38}{Heat Source Profile}{equation.3.1.6}{}}
\newlabel{qmax_eqn_ch3@cref}{{[equation][6][3]3.6}{38}}
\newlabel{final_eqn_ch3}{{3.7}{39}{Heat Source Profile}{equation.3.1.7}{}}
\newlabel{final_eqn_ch3@cref}{{[equation][7][3]3.7}{39}}
\@writefile{toc}{\contentsline {subsection}{\numberline {3.1.3}Limitations and Assumptions of the model}{39}{subsection.3.1.3}}
\@writefile{toc}{\contentsline {subsection}{\numberline {3.1.4}Initial and Boundary Conditions}{39}{subsection.3.1.4}}
\newlabel{rad_eqn_ch3}{{3.8}{40}{Initial and Boundary Conditions}{equation.3.1.8}{}}
\newlabel{rad_eqn_ch3@cref}{{[equation][8][3]3.8}{40}}
\@writefile{toc}{\contentsline {subsection}{\numberline {3.1.5}Geometry and Meshing}{40}{subsection.3.1.5}}
\@writefile{toc}{\contentsline {subsection}{\numberline {3.1.6}Scaling of the Code}{40}{subsection.3.1.6}}
\newlabel{scaling_eqn_ch2}{{3.9}{41}{Scaling of the Code}{equation.3.1.9}{}}
\newlabel{scaling_eqn_ch2@cref}{{[equation][9][3]3.9}{41}}
\newlabel{newscaling_eqn_ch2}{{3.10}{41}{Scaling of the Code}{equation.3.1.10}{}}
\newlabel{newscaling_eqn_ch2@cref}{{[equation][10][3]3.10}{41}}
\@writefile{lot}{\contentsline {table}{\numberline {3.1}{\ignorespaces Strong Scaling: Wall Time Usage Analysis\relax }}{42}{table.3.1}}
\newlabel{scaling_tab_ch3}{{3.1}{42}{Strong Scaling: Wall Time Usage Analysis\relax }{table.3.1}{}}
\newlabel{scaling_tab_ch3@cref}{{[table][1][3]3.1}{42}}
\@writefile{toc}{\contentsline {subsection}{\numberline {3.1.7}Material Properties}{42}{subsection.3.1.7}}
\@writefile{toc}{\contentsline {subsection}{\numberline {3.1.8}Calculation of G and R}{42}{subsection.3.1.8}}
\newlabel{subsec:GR_calc_ch3}{{3.1.8}{42}{Calculation of G and R}{subsection.3.1.8}{}}
\newlabel{subsec:GR_calc_ch3@cref}{{[subsection][8][3,1]3.1.8}{42}}
\@writefile{lof}{\contentsline {figure}{\numberline {3.1}{\ignorespaces (a) Speed up ratio and (b) Scaling Efficiency of Truchas (Heat transfer and phase change)\relax }}{43}{figure.caption.47}}
\newlabel{fig:2_scaling}{{3.1}{43}{(a) Speed up ratio and (b) Scaling Efficiency of Truchas (Heat transfer and phase change)\relax }{figure.caption.47}{}}
\newlabel{fig:2_scaling@cref}{{[figure][1][3]3.1}{43}}
\@writefile{lot}{\contentsline {table}{\numberline {3.2}{\ignorespaces Thermophysical properties of IN718 \cite {kamnis2008mathematical, pottlacher2002thermophysical}\relax }}{43}{table.3.2}}
\newlabel{prop_tab_ch3}{{3.2}{43}{Thermophysical properties of IN718 \cite {kamnis2008mathematical, pottlacher2002thermophysical}\relax }{table.3.2}{}}
\newlabel{prop_tab_ch3@cref}{{[table][2][3]3.2}{43}}
\newlabel{G_eqn_ch3}{{3.11}{44}{Calculation of G and R}{equation.3.1.11}{}}
\newlabel{G_eqn_ch3@cref}{{[equation][11][3]3.11}{44}}
\newlabel{Gx_eqn_ch3}{{3.12}{44}{Calculation of G and R}{equation.3.1.12}{}}
\newlabel{Gx_eqn_ch3@cref}{{[equation][12][3]3.12}{44}}
\newlabel{GR_eqn_ch3}{{3.13}{44}{Calculation of G and R}{equation.3.1.13}{}}
\newlabel{GR_eqn_ch3@cref}{{[equation][13][3]3.13}{44}}
\newlabel{R_eqn_ch3}{{3.14}{44}{Calculation of G and R}{equation.3.1.14}{}}
\newlabel{R_eqn_ch3@cref}{{[equation][14][3]3.14}{44}}
\@writefile{lof}{\contentsline {figure}{\numberline {3.2}{\ignorespaces Transient Liquid-Solid interface tracking of melt pool (a) at the beginning of solidification 10ms (b) 20 ms, (c) 26 ms, and (d) end of solidification 30 ms.\relax }}{45}{figure.caption.48}}
\newlabel{fig:3_interfacetrack}{{3.2}{45}{Transient Liquid-Solid interface tracking of melt pool (a) at the beginning of solidification 10ms (b) 20 ms, (c) 26 ms, and (d) end of solidification 30 ms.\relax }{figure.caption.48}{}}
\newlabel{fig:3_interfacetrack@cref}{{[figure][2][3]3.2}{45}}
\@writefile{lof}{\contentsline {figure}{\numberline {3.3}{\ignorespaces Overlap of Thermal Gradient vector and Liquidus isotherm (1610 K) along the XZ plane.\relax }}{45}{figure.caption.49}}
\newlabel{fig:3_OverlapGradient}{{3.3}{45}{Overlap of Thermal Gradient vector and Liquidus isotherm (1610 K) along the XZ plane.\relax }{figure.caption.49}{}}
\newlabel{fig:3_OverlapGradient@cref}{{[figure][3][3]3.3}{45}}
\@writefile{lof}{\contentsline {figure}{\numberline {3.4}{\ignorespaces Variation of G and R as a function of solidification time\relax }}{46}{figure.caption.50}}
\newlabel{fig:3_GRVariation}{{3.4}{46}{Variation of G and R as a function of solidification time\relax }{figure.caption.50}{}}
\newlabel{fig:3_GRVariation@cref}{{[figure][4][3]3.4}{46}}
\@setckpt{chapter-3}{
\setcounter{page}{47}
\setcounter{equation}{14}
\setcounter{enumi}{3}
\setcounter{enumii}{0}
\setcounter{enumiii}{0}
\setcounter{enumiv}{0}
\setcounter{footnote}{0}
\setcounter{mpfootnote}{0}
\setcounter{part}{0}
\setcounter{chapter}{3}
\setcounter{section}{1}
\setcounter{subsection}{8}
\setcounter{subsubsection}{0}
\setcounter{paragraph}{0}
\setcounter{subparagraph}{0}
\setcounter{figure}{4}
\setcounter{table}{2}
\setcounter{parentequation}{0}
\setcounter{Item}{3}
\setcounter{Hfootnote}{0}
\setcounter{bookmark@seq@number}{34}
\setcounter{theorem}{0}
\setcounter{corollary}{0}
\setcounter{lemma}{0}
\setcounter{lstnumber}{1}
\setcounter{float@type}{8}
\setcounter{tabx@nest}{0}
\setcounter{listtotal}{0}
\setcounter{listcount}{0}
\setcounter{liststart}{0}
\setcounter{liststop}{0}
\setcounter{citecount}{0}
\setcounter{citetotal}{0}
\setcounter{multicitecount}{0}
\setcounter{multicitetotal}{0}
\setcounter{instcount}{189}
\setcounter{maxnames}{3}
\setcounter{minnames}{1}
\setcounter{maxitems}{3}
\setcounter{minitems}{1}
\setcounter{citecounter}{0}
\setcounter{savedcitecounter}{0}
\setcounter{uniquelist}{0}
\setcounter{uniquename}{0}
\setcounter{refsection}{0}
\setcounter{refsegment}{0}
\setcounter{maxextratitle}{0}
\setcounter{maxextratitleyear}{0}
\setcounter{maxextrayear}{0}
\setcounter{maxextraalpha}{0}
\setcounter{abbrvpenalty}{5000}
\setcounter{highnamepenalty}{5000}
\setcounter{lownamepenalty}{2500}
\setcounter{maxparens}{3}
\setcounter{parenlevel}{0}
\setcounter{mincomprange}{10}
\setcounter{maxcomprange}{100000}
\setcounter{mincompwidth}{1}
\setcounter{afterword}{0}
\setcounter{savedafterword}{0}
\setcounter{annotator}{0}
\setcounter{savedannotator}{0}
\setcounter{author}{0}
\setcounter{savedauthor}{0}
\setcounter{bookauthor}{0}
\setcounter{savedbookauthor}{0}
\setcounter{commentator}{0}
\setcounter{savedcommentator}{0}
\setcounter{editor}{0}
\setcounter{savededitor}{0}
\setcounter{editora}{0}
\setcounter{savededitora}{0}
\setcounter{editorb}{0}
\setcounter{savededitorb}{0}
\setcounter{editorc}{0}
\setcounter{savededitorc}{0}
\setcounter{foreword}{0}
\setcounter{savedforeword}{0}
\setcounter{holder}{0}
\setcounter{savedholder}{0}
\setcounter{introduction}{0}
\setcounter{savedintroduction}{0}
\setcounter{namea}{0}
\setcounter{savednamea}{0}
\setcounter{nameb}{0}
\setcounter{savednameb}{0}
\setcounter{namec}{0}
\setcounter{savednamec}{0}
\setcounter{translator}{0}
\setcounter{savedtranslator}{0}
\setcounter{shortauthor}{0}
\setcounter{savedshortauthor}{0}
\setcounter{shorteditor}{0}
\setcounter{savedshorteditor}{0}
\setcounter{labelname}{0}
\setcounter{savedlabelname}{0}
\setcounter{institution}{0}
\setcounter{savedinstitution}{0}
\setcounter{lista}{0}
\setcounter{savedlista}{0}
\setcounter{listb}{0}
\setcounter{savedlistb}{0}
\setcounter{listc}{0}
\setcounter{savedlistc}{0}
\setcounter{listd}{0}
\setcounter{savedlistd}{0}
\setcounter{liste}{0}
\setcounter{savedliste}{0}
\setcounter{listf}{0}
\setcounter{savedlistf}{0}
\setcounter{location}{0}
\setcounter{savedlocation}{0}
\setcounter{organization}{0}
\setcounter{savedorganization}{0}
\setcounter{origlocation}{0}
\setcounter{savedoriglocation}{0}
\setcounter{origpublisher}{0}
\setcounter{savedorigpublisher}{0}
\setcounter{publisher}{0}
\setcounter{savedpublisher}{0}
\setcounter{language}{0}
\setcounter{savedlanguage}{0}
\setcounter{pageref}{0}
\setcounter{savedpageref}{0}
\setcounter{textcitecount}{0}
\setcounter{textcitetotal}{0}
\setcounter{textcitemaxnames}{0}
\setcounter{biburlnumpenalty}{0}
\setcounter{biburlucpenalty}{0}
\setcounter{biburllcpenalty}{0}
\setcounter{smartand}{1}
\setcounter{bbx:relatedcount}{0}
\setcounter{bbx:relatedtotal}{0}
\setcounter{ContinuedFloat}{0}
\setcounter{lips@count}{0}
\setcounter{r@tfl@t}{0}
\setcounter{MYtempeqncnt}{0}
\setcounter{KVtest}{0}
\setcounter{subfigure}{0}
\setcounter{subfigure@save}{0}
\setcounter{lofdepth}{1}
\setcounter{subtable}{0}
\setcounter{subtable@save}{0}
\setcounter{lotdepth}{1}
\setcounter{@stackindex}{0}
\setcounter{ROWcellindex@}{0}
\setcounter{section@level}{2}
\setcounter{lstlisting}{0}
}
