\relax 
\providecommand\hyper@newdestlabel[2]{}
\@writefile{toc}{\contentsline {chapter}{\numberline {2}Literature Review and Scientific Gaps}{10}{chapter.2}}
\@writefile{lof}{\addvspace {10\p@ }}
\@writefile{lot}{\addvspace {10\p@ }}
\newlabel{ch:chapter_2}{{2}{10}{Literature Review and Scientific Gaps}{chapter.2}{}}
\newlabel{ch:chapter_2@cref}{{[chapter][2][]2}{10}}
\@writefile{toc}{\contentsline {section}{\numberline {2.1}Literature Review}{10}{section.2.1}}
\newlabel{lit_review}{{2.1}{10}{Literature Review}{section.2.1}{}}
\newlabel{lit_review@cref}{{[section][1][2]2.1}{10}}
\@writefile{toc}{\contentsline {subsection}{\numberline {2.1.1}Fundamentals of Solidification}{10}{subsection.2.1.1}}
\@writefile{toc}{\contentsline {subsubsection}{Nucleation}{10}{section*.21}}
\newlabel{freeenergy_eqn_ch2}{{2.1}{11}{Nucleation}{equation.2.1.1}{}}
\newlabel{freeenergy_eqn_ch2@cref}{{[equation][1][2]2.1}{11}}
\newlabel{expfreeenergy_eqn_ch2}{{2.2}{11}{Nucleation}{equation.2.1.2}{}}
\newlabel{expfreeenergy_eqn_ch2@cref}{{[equation][2][2]2.2}{11}}
\@writefile{lof}{\contentsline {figure}{\numberline {2.1}{\ignorespaces Free energy change during homogeneous nucleation of Aluminum \cite {dantzig2016solidification}\relax }}{12}{figure.caption.22}}
\newlabel{fig:2_Homonucleation}{{2.1}{12}{Free energy change during homogeneous nucleation of Aluminum \cite {dantzig2016solidification}\relax }{figure.caption.22}{}}
\newlabel{fig:2_Homonucleation@cref}{{[figure][1][2]2.1}{12}}
\newlabel{Rcritical_eqn_ch2}{{2.3}{12}{Nucleation}{equation.2.1.3}{}}
\newlabel{Rcritical_eqn_ch2@cref}{{[equation][3][2]2.3}{12}}
\newlabel{Gcritical_eqn_ch2}{{2.4}{12}{Nucleation}{equation.2.1.4}{}}
\newlabel{Gcritical_eqn_ch2@cref}{{[equation][4][2]2.4}{12}}
\@writefile{lof}{\contentsline {figure}{\numberline {2.2}{\ignorespaces Heterogeneous nucleation on an existing wall or substrate \cite {dantzig2016solidification}\relax }}{13}{figure.caption.23}}
\newlabel{fig:2_Heteronucleation}{{2.2}{13}{Heterogeneous nucleation on an existing wall or substrate \cite {dantzig2016solidification}\relax }{figure.caption.23}{}}
\newlabel{fig:2_Heteronucleation@cref}{{[figure][2][2]2.2}{13}}
\newlabel{heterofreeenergy_eqn_ch2}{{2.5}{13}{Nucleation}{equation.2.1.5}{}}
\newlabel{heterofreeenergy_eqn_ch2@cref}{{[equation][5][2]2.5}{13}}
\newlabel{simpheterofree_eqn_ch2}{{2.6}{14}{Nucleation}{equation.2.1.6}{}}
\newlabel{simpheterofree_eqn_ch2@cref}{{[equation][6][2]2.6}{14}}
\newlabel{Rcriticalhetero_eqn_ch2}{{2.7}{14}{Nucleation}{equation.2.1.7}{}}
\newlabel{Rcriticalhetero_eqn_ch2@cref}{{[equation][7][2]2.7}{14}}
\newlabel{Gcriticalhetero_eqn_ch2}{{2.8}{14}{Nucleation}{equation.2.1.8}{}}
\newlabel{Gcriticalhetero_eqn_ch2@cref}{{[equation][8][2]2.8}{14}}
\newlabel{ftheta_eqn_ch2}{{2.9}{14}{Nucleation}{equation.2.1.9}{}}
\newlabel{ftheta_eqn_ch2@cref}{{[equation][9][2]2.9}{14}}
\@writefile{lof}{\contentsline {figure}{\numberline {2.3}{\ignorespaces Qualitative Comparison of free energy change required for homogeneous, heterogeneous nucleation and epitaxial growth. \cite {david1989correlation}\relax }}{15}{figure.caption.24}}
\newlabel{fig:2_Gcomparison}{{2.3}{15}{Qualitative Comparison of free energy change required for homogeneous, heterogeneous nucleation and epitaxial growth. \cite {david1989correlation}\relax }{figure.caption.24}{}}
\newlabel{fig:2_Gcomparison@cref}{{[figure][3][2]2.3}{15}}
\@writefile{toc}{\contentsline {subsubsection}{Growth}{15}{section*.25}}
\@writefile{lof}{\contentsline {figure}{\numberline {2.4}{\ignorespaces Variation of solidification morphology as a function of \textbf  {G} and \textbf  {R}\relax }}{16}{figure.caption.26}}
\newlabel{fig:2_GRref}{{2.4}{16}{Variation of solidification morphology as a function of \textbf {G} and \textbf {R}\relax }{figure.caption.26}{}}
\newlabel{fig:2_GRref@cref}{{[figure][4][2]2.4}{16}}
\@writefile{lof}{\contentsline {figure}{\numberline {2.5}{\ignorespaces (a) Phase Diagram with respect to solute concentration (b) Solute enrichment at the interface\relax }}{17}{figure.caption.27}}
\newlabel{fig:2_const}{{2.5}{17}{(a) Phase Diagram with respect to solute concentration (b) Solute enrichment at the interface\relax }{figure.caption.27}{}}
\newlabel{fig:2_const@cref}{{[figure][5][2]2.5}{17}}
\newlabel{GRcond_eqn_ch2}{{2.10}{17}{Growth}{equation.2.1.10}{}}
\newlabel{GRcond_eqn_ch2@cref}{{[equation][10][2]2.10}{17}}
\@writefile{lof}{\contentsline {figure}{\numberline {2.6}{\ignorespaces (a) Solute enrichment (b) No constitutional undercooling at the interface (c) Presence of constitutional undercooling\relax }}{18}{figure.caption.28}}
\newlabel{fig:2_constG}{{2.6}{18}{(a) Solute enrichment (b) No constitutional undercooling at the interface (c) Presence of constitutional undercooling\relax }{figure.caption.28}{}}
\newlabel{fig:2_constG@cref}{{[figure][6][2]2.6}{18}}
\@writefile{lof}{\contentsline {figure}{\numberline {2.7}{\ignorespaces (a) Breakdown of liquid-solid interface due to solute rejection as a function of time (b) Change in morphology by introducing impurity \cite {kou2003welding}\relax }}{19}{figure.caption.29}}
\newlabel{fig:2_constexample}{{2.7}{19}{(a) Breakdown of liquid-solid interface due to solute rejection as a function of time (b) Change in morphology by introducing impurity \cite {kou2003welding}\relax }{figure.caption.29}{}}
\newlabel{fig:2_constexample@cref}{{[figure][7][2]2.7}{19}}
\@writefile{toc}{\contentsline {subsection}{\numberline {2.1.2}Evolution of Microstructure in Rapid Solidification Processes}{19}{subsection.2.1.2}}
\@writefile{toc}{\contentsline {subsubsection}{Lessons from Welding Literature}{19}{section*.30}}
\@writefile{lof}{\contentsline {figure}{\numberline {2.8}{\ignorespaces Epitaxial grain growth at (a) High velocity (b) Low velocity (c) Oscillation\cite {kou2003welding}\relax }}{20}{figure.caption.31}}
\newlabel{fig:2_weld}{{2.8}{20}{Epitaxial grain growth at (a) High velocity (b) Low velocity (c) Oscillation\cite {kou2003welding}\relax }{figure.caption.31}{}}
\newlabel{fig:2_weld@cref}{{[figure][8][2]2.8}{20}}
\@writefile{lof}{\contentsline {figure}{\numberline {2.9}{\ignorespaces EBSD of (a) unstirred melt pool vs (b) with magnetic stirring at 7Hz. \cite {lim2010effect}\relax }}{21}{figure.caption.32}}
\newlabel{fig:2_stirring}{{2.9}{21}{EBSD of (a) unstirred melt pool vs (b) with magnetic stirring at 7Hz. \cite {lim2010effect}\relax }{figure.caption.32}{}}
\newlabel{fig:2_stirring@cref}{{[figure][9][2]2.9}{21}}
\@writefile{toc}{\contentsline {subsection}{\numberline {2.1.3}Electron Beam Welding}{21}{subsection.2.1.3}}
\@writefile{lof}{\contentsline {figure}{\numberline {2.10}{\ignorespaces Velocity of electrons as a function of accelerating voltage.\cite {schultz1994electron}\relax }}{22}{figure.caption.33}}
\newlabel{fig:2_electronvelocity}{{2.10}{22}{Velocity of electrons as a function of accelerating voltage.\cite {schultz1994electron}\relax }{figure.caption.33}{}}
\newlabel{fig:2_electronvelocity@cref}{{[figure][10][2]2.10}{22}}
\@writefile{lof}{\contentsline {figure}{\numberline {2.11}{\ignorespaces Dissimiliar metal welding using electron beam. \cite {sun1996application}\relax }}{24}{figure.caption.34}}
\newlabel{fig:2_dissimilar}{{2.11}{24}{Dissimiliar metal welding using electron beam. \cite {sun1996application}\relax }{figure.caption.34}{}}
\newlabel{fig:2_dissimilar@cref}{{[figure][11][2]2.11}{24}}
\@writefile{toc}{\contentsline {subsection}{\numberline {2.1.4}Modeling of Rapid Solidification Process}{24}{subsection.2.1.4}}
\@writefile{toc}{\contentsline {subsubsection}{Analytical Models}{24}{section*.35}}
\newlabel{rosenthal_eqn_ch2}{{2.11}{25}{Analytical Models}{equation.2.1.11}{}}
\newlabel{rosenthal_eqn_ch2@cref}{{[equation][11][2]2.11}{25}}
\@writefile{lof}{\contentsline {figure}{\numberline {2.12}{\ignorespaces (a) Hump formation during welding as a function of welding speed \cite {nguyen2005humping} (b) Process map of humping as a function of welding speed and power \cite {nguyen2005humping} and (c) Melt ball formation in additive manufacturing \cite {zah2010modelling}.\relax }}{26}{figure.caption.36}}
\newlabel{fig:2_hump}{{2.12}{26}{(a) Hump formation during welding as a function of welding speed \cite {nguyen2005humping} (b) Process map of humping as a function of welding speed and power \cite {nguyen2005humping} and (c) Melt ball formation in additive manufacturing \cite {zah2010modelling}.\relax }{figure.caption.36}{}}
\newlabel{fig:2_hump@cref}{{[figure][12][2]2.12}{26}}
\@writefile{toc}{\contentsline {subsubsection}{Numerical Models}{26}{section*.37}}
\newlabel{langmuir_eqn_ch2}{{2.12}{27}{Numerical Models}{equation.2.1.12}{}}
\newlabel{langmuir_eqn_ch2@cref}{{[equation][12][2]2.12}{27}}
\@writefile{lof}{\contentsline {figure}{\numberline {2.13}{\ignorespaces Comparison of Langmuir`s model and Mundra et al`s model. \cite {mundra1993toward}\relax }}{28}{figure.caption.38}}
\newlabel{fig:2_vapor}{{2.13}{28}{Comparison of Langmuir`s model and Mundra et al`s model. \cite {mundra1993toward}\relax }{figure.caption.38}{}}
\newlabel{fig:2_vapor@cref}{{[figure][13][2]2.13}{28}}
\@writefile{toc}{\contentsline {subsubsection}{Feasibility of Site-Specific Microstructure Control in AM}{28}{section*.40}}
\@writefile{lof}{\contentsline {figure}{\numberline {2.14}{\ignorespaces Key-hole mode in AM: Normalized melt pool depth as a function of normalized enthalpy. \cite {king2014observation}\relax }}{29}{figure.caption.39}}
\newlabel{fig:2_keyhole}{{2.14}{29}{Key-hole mode in AM: Normalized melt pool depth as a function of normalized enthalpy. \cite {king2014observation}\relax }{figure.caption.39}{}}
\newlabel{fig:2_keyhole@cref}{{[figure][14][2]2.14}{29}}
\@writefile{lof}{\contentsline {figure}{\numberline {2.15}{\ignorespaces EBSD of Arcam\textsuperscript  {\textregistered } fabricated IN718 (a) XY plane and (b) XZ plane \cite {sames2015additive}.\relax }}{30}{figure.caption.41}}
\newlabel{fig:2_sames}{{2.15}{30}{EBSD of Arcam\textsuperscript {\textregistered } fabricated IN718 (a) XY plane and (b) XZ plane \cite {sames2015additive}.\relax }{figure.caption.41}{}}
\newlabel{fig:2_sames@cref}{{[figure][15][2]2.15}{30}}
\@writefile{lof}{\contentsline {figure}{\numberline {2.16}{\ignorespaces EBSD of plane along the build direction (XZ) of Arcam\textsuperscript  {\textregistered } fabricated IN718 with hatch spcaing and velocity of (a) \SI {150}{\micro \meter }, 2.2 m/s and (b) \SI {37.5}{\micro \meter }, 8.8 m/s \cite {helmer2016grain}.\relax }}{31}{figure.caption.42}}
\newlabel{fig:2_korner}{{2.16}{31}{EBSD of plane along the build direction (XZ) of Arcam\textsuperscript {\textregistered } fabricated IN718 with hatch spcaing and velocity of (a) \SI {150}{\micro \meter }, 2.2 m/s and (b) \SI {37.5}{\micro \meter }, 8.8 m/s \cite {helmer2016grain}.\relax }{figure.caption.42}{}}
\newlabel{fig:2_korner@cref}{{[figure][16][2]2.16}{31}}
\@writefile{lof}{\contentsline {figure}{\numberline {2.17}{\ignorespaces Crystallographic Texture Engineering by Modification of Melt Pattern \cite {dehoff2015site}\relax }}{31}{figure.caption.43}}
\newlabel{fig:2_DOE_2}{{2.17}{31}{Crystallographic Texture Engineering by Modification of Melt Pattern \cite {dehoff2015site}\relax }{figure.caption.43}{}}
\newlabel{fig:2_DOE_2@cref}{{[figure][17][2]2.17}{31}}
\@writefile{toc}{\contentsline {section}{\numberline {2.2}Scientific Gaps and Research Plan}{32}{section.2.2}}
\@writefile{toc}{\contentsline {subsection}{\numberline {2.2.1}Research Gaps}{32}{subsection.2.2.1}}
\@writefile{toc}{\contentsline {subsection}{\numberline {2.2.2}Material System}{32}{subsection.2.2.2}}
\@writefile{lot}{\contentsline {table}{\numberline {2.1}{\ignorespaces Nominal composition (wt\%) of Inconel 718 \cite {718compo}.\relax }}{33}{table.2.1}}
\newlabel{tab:comp_ch2}{{2.1}{33}{Nominal composition (wt\%) of Inconel 718 \cite {718compo}.\relax }{table.2.1}{}}
\newlabel{tab:comp_ch2@cref}{{[table][1][2]2.1}{33}}
\@writefile{toc}{\contentsline {subsection}{\numberline {2.2.3}Numerical Code}{33}{subsection.2.2.3}}
\@writefile{lot}{\contentsline {table}{\numberline {2.2}{\ignorespaces Verification and validation of Truchas \cite {parietti2006validation}.\relax }}{34}{table.2.2}}
\newlabel{tab:truchasvalid_ch2}{{2.2}{34}{Verification and validation of Truchas \cite {parietti2006validation}.\relax }{table.2.2}{}}
\newlabel{tab:truchasvalid_ch2@cref}{{[table][2][2]2.2}{34}}
\@writefile{toc}{\contentsline {subsubsection}{Why Truchas?}{34}{section*.44}}
\@writefile{toc}{\contentsline {subsection}{\numberline {2.2.4}Experimental Methodology}{35}{subsection.2.2.4}}
\@writefile{toc}{\contentsline {subsubsection}{Part Fabrication}{35}{section*.45}}
\@writefile{toc}{\contentsline {subsubsection}{Characterization}{35}{section*.46}}
\@setckpt{chapter-2}{
\setcounter{page}{36}
\setcounter{equation}{12}
\setcounter{enumi}{3}
\setcounter{enumii}{0}
\setcounter{enumiii}{0}
\setcounter{enumiv}{0}
\setcounter{footnote}{0}
\setcounter{mpfootnote}{0}
\setcounter{part}{0}
\setcounter{chapter}{2}
\setcounter{section}{2}
\setcounter{subsection}{4}
\setcounter{subsubsection}{0}
\setcounter{paragraph}{0}
\setcounter{subparagraph}{0}
\setcounter{figure}{17}
\setcounter{table}{2}
\setcounter{parentequation}{0}
\setcounter{Item}{3}
\setcounter{Hfootnote}{0}
\setcounter{bookmark@seq@number}{24}
\setcounter{theorem}{0}
\setcounter{corollary}{0}
\setcounter{lemma}{0}
\setcounter{lstnumber}{1}
\setcounter{float@type}{8}
\setcounter{tabx@nest}{0}
\setcounter{listtotal}{0}
\setcounter{listcount}{0}
\setcounter{liststart}{0}
\setcounter{liststop}{0}
\setcounter{citecount}{0}
\setcounter{citetotal}{0}
\setcounter{multicitecount}{0}
\setcounter{multicitetotal}{0}
\setcounter{instcount}{166}
\setcounter{maxnames}{3}
\setcounter{minnames}{1}
\setcounter{maxitems}{3}
\setcounter{minitems}{1}
\setcounter{citecounter}{0}
\setcounter{savedcitecounter}{0}
\setcounter{uniquelist}{0}
\setcounter{uniquename}{0}
\setcounter{refsection}{0}
\setcounter{refsegment}{0}
\setcounter{maxextratitle}{0}
\setcounter{maxextratitleyear}{0}
\setcounter{maxextrayear}{0}
\setcounter{maxextraalpha}{0}
\setcounter{abbrvpenalty}{5000}
\setcounter{highnamepenalty}{5000}
\setcounter{lownamepenalty}{2500}
\setcounter{maxparens}{3}
\setcounter{parenlevel}{0}
\setcounter{mincomprange}{10}
\setcounter{maxcomprange}{100000}
\setcounter{mincompwidth}{1}
\setcounter{afterword}{0}
\setcounter{savedafterword}{0}
\setcounter{annotator}{0}
\setcounter{savedannotator}{0}
\setcounter{author}{0}
\setcounter{savedauthor}{0}
\setcounter{bookauthor}{0}
\setcounter{savedbookauthor}{0}
\setcounter{commentator}{0}
\setcounter{savedcommentator}{0}
\setcounter{editor}{0}
\setcounter{savededitor}{0}
\setcounter{editora}{0}
\setcounter{savededitora}{0}
\setcounter{editorb}{0}
\setcounter{savededitorb}{0}
\setcounter{editorc}{0}
\setcounter{savededitorc}{0}
\setcounter{foreword}{0}
\setcounter{savedforeword}{0}
\setcounter{holder}{0}
\setcounter{savedholder}{0}
\setcounter{introduction}{0}
\setcounter{savedintroduction}{0}
\setcounter{namea}{0}
\setcounter{savednamea}{0}
\setcounter{nameb}{0}
\setcounter{savednameb}{0}
\setcounter{namec}{0}
\setcounter{savednamec}{0}
\setcounter{translator}{0}
\setcounter{savedtranslator}{0}
\setcounter{shortauthor}{0}
\setcounter{savedshortauthor}{0}
\setcounter{shorteditor}{0}
\setcounter{savedshorteditor}{0}
\setcounter{labelname}{0}
\setcounter{savedlabelname}{0}
\setcounter{institution}{0}
\setcounter{savedinstitution}{0}
\setcounter{lista}{0}
\setcounter{savedlista}{0}
\setcounter{listb}{0}
\setcounter{savedlistb}{0}
\setcounter{listc}{0}
\setcounter{savedlistc}{0}
\setcounter{listd}{0}
\setcounter{savedlistd}{0}
\setcounter{liste}{0}
\setcounter{savedliste}{0}
\setcounter{listf}{0}
\setcounter{savedlistf}{0}
\setcounter{location}{0}
\setcounter{savedlocation}{0}
\setcounter{organization}{0}
\setcounter{savedorganization}{0}
\setcounter{origlocation}{0}
\setcounter{savedoriglocation}{0}
\setcounter{origpublisher}{0}
\setcounter{savedorigpublisher}{0}
\setcounter{publisher}{0}
\setcounter{savedpublisher}{0}
\setcounter{language}{0}
\setcounter{savedlanguage}{0}
\setcounter{pageref}{0}
\setcounter{savedpageref}{0}
\setcounter{textcitecount}{0}
\setcounter{textcitetotal}{0}
\setcounter{textcitemaxnames}{0}
\setcounter{biburlnumpenalty}{0}
\setcounter{biburlucpenalty}{0}
\setcounter{biburllcpenalty}{0}
\setcounter{smartand}{1}
\setcounter{bbx:relatedcount}{0}
\setcounter{bbx:relatedtotal}{0}
\setcounter{ContinuedFloat}{0}
\setcounter{lips@count}{0}
\setcounter{r@tfl@t}{0}
\setcounter{MYtempeqncnt}{0}
\setcounter{KVtest}{0}
\setcounter{subfigure}{0}
\setcounter{subfigure@save}{0}
\setcounter{lofdepth}{1}
\setcounter{subtable}{0}
\setcounter{subtable@save}{0}
\setcounter{lotdepth}{1}
\setcounter{@stackindex}{0}
\setcounter{ROWcellindex@}{0}
\setcounter{section@level}{3}
\setcounter{lstlisting}{0}
}
