\relax 
\providecommand\hyper@newdestlabel[2]{}
\@writefile{toc}{\contentsline {chapter}{\numberline {8}Conclusion and Path Forward}{122}{chapter.8}}
\@writefile{lof}{\addvspace {10\p@ }}
\@writefile{lot}{\addvspace {10\p@ }}
\newlabel{ch:chapter_8}{{8}{122}{Conclusion and Path Forward}{chapter.8}{}}
\newlabel{ch:chapter_8@cref}{{[chapter][8][]8}{122}}
\@writefile{toc}{\contentsline {section}{\numberline {8.1}Summary}{122}{section.8.1}}
\@writefile{toc}{\contentsline {section}{\numberline {8.2}Path Forward}{123}{section.8.2}}
\@writefile{lof}{\contentsline {figure}{\numberline {8.1}{\ignorespaces Sequence of fill in an airfoil (a) Raster fill (b) Dehoff fill or spot fill.\relax }}{124}{figure.caption.108}}
\newlabel{fig:8_blade}{{8.1}{124}{Sequence of fill in an airfoil (a) Raster fill (b) Dehoff fill or spot fill.\relax }{figure.caption.108}{}}
\newlabel{fig:8_blade@cref}{{[figure][1][8]8.1}{124}}
\@writefile{lof}{\contentsline {figure}{\numberline {8.2}{\ignorespaces G vs R for the raster fill and "Dehoff" fill\relax }}{125}{figure.caption.109}}
\newlabel{fig:8_GRblade}{{8.2}{125}{G vs R for the raster fill and "Dehoff" fill\relax }{figure.caption.109}{}}
\newlabel{fig:8_GRblade@cref}{{[figure][2][8]8.2}{125}}
\@writefile{lof}{\contentsline {figure}{\numberline {8.3}{\ignorespaces (a) Variation in transient nature as a function of build height (b) Matrix format of complex geometry (triangle) without overhang (c) with overhang. \relax }}{127}{figure.caption.110}}
\newlabel{fig:8_matrix}{{8.3}{127}{(a) Variation in transient nature as a function of build height (b) Matrix format of complex geometry (triangle) without overhang (c) with overhang. \relax }{figure.caption.110}{}}
\newlabel{fig:8_matrix@cref}{{[figure][3][8]8.3}{127}}
\@writefile{lof}{\contentsline {figure}{\numberline {8.4}{\ignorespaces Integrated Computational and Machine Learning Framework to predict process-structure-property in AM process.\relax }}{127}{figure.caption.111}}
\newlabel{fig:8_ICME}{{8.4}{127}{Integrated Computational and Machine Learning Framework to predict process-structure-property in AM process.\relax }{figure.caption.111}{}}
\newlabel{fig:8_ICME@cref}{{[figure][4][8]8.4}{127}}
\@setckpt{chapter-8}{
\setcounter{page}{128}
\setcounter{equation}{0}
\setcounter{enumi}{3}
\setcounter{enumii}{0}
\setcounter{enumiii}{0}
\setcounter{enumiv}{0}
\setcounter{footnote}{0}
\setcounter{mpfootnote}{0}
\setcounter{part}{0}
\setcounter{chapter}{8}
\setcounter{section}{2}
\setcounter{subsection}{0}
\setcounter{subsubsection}{0}
\setcounter{paragraph}{0}
\setcounter{subparagraph}{0}
\setcounter{figure}{4}
\setcounter{table}{0}
\setcounter{parentequation}{0}
\setcounter{Item}{3}
\setcounter{Hfootnote}{0}
\setcounter{bookmark@seq@number}{79}
\setcounter{theorem}{0}
\setcounter{corollary}{0}
\setcounter{lemma}{0}
\setcounter{lstnumber}{1}
\setcounter{float@type}{8}
\setcounter{tabx@nest}{0}
\setcounter{listtotal}{0}
\setcounter{listcount}{0}
\setcounter{liststart}{0}
\setcounter{liststop}{0}
\setcounter{citecount}{0}
\setcounter{citetotal}{0}
\setcounter{multicitecount}{0}
\setcounter{multicitetotal}{0}
\setcounter{instcount}{280}
\setcounter{maxnames}{3}
\setcounter{minnames}{1}
\setcounter{maxitems}{3}
\setcounter{minitems}{1}
\setcounter{citecounter}{0}
\setcounter{savedcitecounter}{0}
\setcounter{uniquelist}{0}
\setcounter{uniquename}{0}
\setcounter{refsection}{0}
\setcounter{refsegment}{0}
\setcounter{maxextratitle}{0}
\setcounter{maxextratitleyear}{0}
\setcounter{maxextrayear}{0}
\setcounter{maxextraalpha}{0}
\setcounter{abbrvpenalty}{5000}
\setcounter{highnamepenalty}{5000}
\setcounter{lownamepenalty}{2500}
\setcounter{maxparens}{3}
\setcounter{parenlevel}{0}
\setcounter{mincomprange}{10}
\setcounter{maxcomprange}{100000}
\setcounter{mincompwidth}{1}
\setcounter{afterword}{0}
\setcounter{savedafterword}{0}
\setcounter{annotator}{0}
\setcounter{savedannotator}{0}
\setcounter{author}{0}
\setcounter{savedauthor}{0}
\setcounter{bookauthor}{0}
\setcounter{savedbookauthor}{0}
\setcounter{commentator}{0}
\setcounter{savedcommentator}{0}
\setcounter{editor}{0}
\setcounter{savededitor}{0}
\setcounter{editora}{0}
\setcounter{savededitora}{0}
\setcounter{editorb}{0}
\setcounter{savededitorb}{0}
\setcounter{editorc}{0}
\setcounter{savededitorc}{0}
\setcounter{foreword}{0}
\setcounter{savedforeword}{0}
\setcounter{holder}{0}
\setcounter{savedholder}{0}
\setcounter{introduction}{0}
\setcounter{savedintroduction}{0}
\setcounter{namea}{0}
\setcounter{savednamea}{0}
\setcounter{nameb}{0}
\setcounter{savednameb}{0}
\setcounter{namec}{0}
\setcounter{savednamec}{0}
\setcounter{translator}{0}
\setcounter{savedtranslator}{0}
\setcounter{shortauthor}{0}
\setcounter{savedshortauthor}{0}
\setcounter{shorteditor}{0}
\setcounter{savedshorteditor}{0}
\setcounter{labelname}{0}
\setcounter{savedlabelname}{0}
\setcounter{institution}{0}
\setcounter{savedinstitution}{0}
\setcounter{lista}{0}
\setcounter{savedlista}{0}
\setcounter{listb}{0}
\setcounter{savedlistb}{0}
\setcounter{listc}{0}
\setcounter{savedlistc}{0}
\setcounter{listd}{0}
\setcounter{savedlistd}{0}
\setcounter{liste}{0}
\setcounter{savedliste}{0}
\setcounter{listf}{0}
\setcounter{savedlistf}{0}
\setcounter{location}{0}
\setcounter{savedlocation}{0}
\setcounter{organization}{0}
\setcounter{savedorganization}{0}
\setcounter{origlocation}{0}
\setcounter{savedoriglocation}{0}
\setcounter{origpublisher}{0}
\setcounter{savedorigpublisher}{0}
\setcounter{publisher}{0}
\setcounter{savedpublisher}{0}
\setcounter{language}{0}
\setcounter{savedlanguage}{0}
\setcounter{pageref}{0}
\setcounter{savedpageref}{0}
\setcounter{textcitecount}{0}
\setcounter{textcitetotal}{0}
\setcounter{textcitemaxnames}{0}
\setcounter{biburlnumpenalty}{0}
\setcounter{biburlucpenalty}{0}
\setcounter{biburllcpenalty}{0}
\setcounter{smartand}{1}
\setcounter{bbx:relatedcount}{0}
\setcounter{bbx:relatedtotal}{0}
\setcounter{ContinuedFloat}{0}
\setcounter{lips@count}{0}
\setcounter{r@tfl@t}{0}
\setcounter{MYtempeqncnt}{0}
\setcounter{KVtest}{0}
\setcounter{subfigure}{0}
\setcounter{subfigure@save}{0}
\setcounter{lofdepth}{1}
\setcounter{subtable}{0}
\setcounter{subtable@save}{0}
\setcounter{lotdepth}{1}
\setcounter{@stackindex}{0}
\setcounter{ROWcellindex@}{0}
\setcounter{section@level}{1}
\setcounter{lstlisting}{0}
}
