\relax 
\providecommand\hyper@newdestlabel[2]{}
\providecommand\HyperFirstAtBeginDocument{\AtBeginDocument}
\HyperFirstAtBeginDocument{\ifx\hyper@anchor\@undefined
\global\let\oldcontentsline\contentsline
\gdef\contentsline#1#2#3#4{\oldcontentsline{#1}{#2}{#3}}
\global\let\oldnewlabel\newlabel
\gdef\newlabel#1#2{\newlabelxx{#1}#2}
\gdef\newlabelxx#1#2#3#4#5#6{\oldnewlabel{#1}{{#2}{#3}}}
\AtEndDocument{\ifx\hyper@anchor\@undefined
\let\contentsline\oldcontentsline
\let\newlabel\oldnewlabel
\fi}
\fi}
\global\let\hyper@last\relax 
\gdef\HyperFirstAtBeginDocument#1{#1}
\providecommand\HyField@AuxAddToFields[1]{}
\providecommand\HyField@AuxAddToCoFields[2]{}
\abx@aux@sortscheme{none}
\abx@aux@refcontext{none/global/}
\providecommand \oddpage@label [2]{}
\@writefile{toc}{\boolfalse {citerequest}\boolfalse {citetracker}\boolfalse {pagetracker}\boolfalse {backtracker}\relax }
\@writefile{lof}{\boolfalse {citerequest}\boolfalse {citetracker}\boolfalse {pagetracker}\boolfalse {backtracker}\relax }
\@writefile{lot}{\boolfalse {citerequest}\boolfalse {citetracker}\boolfalse {pagetracker}\boolfalse {backtracker}\relax }
\@input{dedication.aux}
\@input{acknowledgements.aux}
\@input{quote.aux}
\@input{abstract.aux}
\@input{chapter-1.aux}
\abx@aux@cite{wong2012review}
\abx@aux@segm{0}{0}{wong2012review}
\abx@aux@cite{guo2012feature}
\abx@aux@segm{0}{0}{guo2012feature}
\abx@aux@cite{nopparat2012resource}
\abx@aux@segm{0}{0}{nopparat2012resource}
\abx@aux@segm{0}{0}{nopparat2012resource}
\abx@aux@segm{0}{0}{nopparat2012resource}
\abx@aux@cite{toddGE}
\abx@aux@segm{0}{0}{toddGE}
\abx@aux@cite{genozzle}
\abx@aux@segm{0}{0}{genozzle}
\abx@aux@segm{0}{0}{genozzle}
\abx@aux@cite{cordero2017powder}
\abx@aux@segm{0}{0}{cordero2017powder}
\abx@aux@cite{gajapathi2011controlling}
\abx@aux@segm{0}{0}{gajapathi2011controlling}
\abx@aux@cite{Multibeam1850}
\abx@aux@segm{0}{0}{Multibeam1850}
\abx@aux@cite{sochalski2015comparison}
\abx@aux@segm{0}{0}{sochalski2015comparison}
\abx@aux@cite{arcamschematic}
\abx@aux@segm{0}{0}{arcamschematic}
\abx@aux@segm{0}{0}{arcamschematic}
\abx@aux@cite{pollock2006nickel}
\abx@aux@segm{0}{0}{pollock2006nickel}
\abx@aux@segm{0}{0}{pollock2006nickel}
\abx@aux@cite{ramsperger2016microstructure}
\abx@aux@segm{0}{0}{ramsperger2016microstructure}
\abx@aux@cite{carter2014influence}
\abx@aux@segm{0}{0}{carter2014influence}
\abx@aux@cite{Tioverview}
\abx@aux@segm{0}{0}{Tioverview}
\abx@aux@cite{brunette2012titanium}
\abx@aux@segm{0}{0}{brunette2012titanium}
\abx@aux@cite{jardini2014cranial}
\abx@aux@segm{0}{0}{jardini2014cranial}
\abx@aux@cite{murr2010next}
\abx@aux@segm{0}{0}{murr2010next}
\abx@aux@cite{dimiduk1999gamma}
\abx@aux@segm{0}{0}{dimiduk1999gamma}
\abx@aux@cite{kim1989intermetallic}
\abx@aux@segm{0}{0}{kim1989intermetallic}
\abx@aux@cite{murr2010characterization}
\abx@aux@segm{0}{0}{murr2010characterization}
\abx@aux@cite{tang2015additive}
\abx@aux@segm{0}{0}{tang2015additive}
\abx@aux@cite{ahmed1998phase}
\abx@aux@segm{0}{0}{ahmed1998phase}
\abx@aux@cite{xie2005ttt}
\abx@aux@segm{0}{0}{xie2005ttt}
\abx@aux@cite{oradei1991current}
\abx@aux@segm{0}{0}{oradei1991current}
\@input{chapter-2.aux}
\abx@aux@cite{david1989correlation}
\abx@aux@segm{0}{0}{david1989correlation}
\abx@aux@cite{kurzfundamentals}
\abx@aux@segm{0}{0}{kurzfundamentals}
\abx@aux@cite{dantzig2016solidification}
\abx@aux@segm{0}{0}{dantzig2016solidification}
\abx@aux@segm{0}{0}{dantzig2016solidification}
\abx@aux@segm{0}{0}{dantzig2016solidification}
\abx@aux@segm{0}{0}{dantzig2016solidification}
\abx@aux@segm{0}{0}{dantzig2016solidification}
\abx@aux@segm{0}{0}{david1989correlation}
\abx@aux@segm{0}{0}{david1989correlation}
\abx@aux@cite{kou2003welding}
\abx@aux@segm{0}{0}{kou2003welding}
\abx@aux@segm{0}{0}{kou2003welding}
\abx@aux@segm{0}{0}{kou2003welding}
\abx@aux@segm{0}{0}{kou2003welding}
\abx@aux@segm{0}{0}{kou2003welding}
\abx@aux@cite{kou1986nucleation}
\abx@aux@segm{0}{0}{kou1986nucleation}
\abx@aux@segm{0}{0}{kou2003welding}
\abx@aux@cite{easton1999grain}
\abx@aux@segm{0}{0}{easton1999grain}
\abx@aux@cite{lim2010effect}
\abx@aux@segm{0}{0}{lim2010effect}
\abx@aux@segm{0}{0}{lim2010effect}
\abx@aux@segm{0}{0}{lim2010effect}
\abx@aux@cite{gaumann2001single}
\abx@aux@segm{0}{0}{gaumann2001single}
\abx@aux@cite{gaumann1997nucleation}
\abx@aux@segm{0}{0}{gaumann1997nucleation}
\abx@aux@cite{vitek2005effect}
\abx@aux@segm{0}{0}{vitek2005effect}
\abx@aux@cite{schultz1994electron}
\abx@aux@segm{0}{0}{schultz1994electron}
\abx@aux@cite{electronindus1983}
\abx@aux@segm{0}{0}{electronindus1983}
\abx@aux@segm{0}{0}{schultz1994electron}
\abx@aux@cite{elmer2009introduction}
\abx@aux@segm{0}{0}{elmer2009introduction}
\abx@aux@segm{0}{0}{schultz1994electron}
\abx@aux@segm{0}{0}{schultz1994electron}
\abx@aux@segm{0}{0}{schultz1994electron}
\abx@aux@cite{messler2008principles}
\abx@aux@segm{0}{0}{messler2008principles}
\abx@aux@segm{0}{0}{schultz1994electron}
\abx@aux@cite{sun1996application}
\abx@aux@segm{0}{0}{sun1996application}
\abx@aux@segm{0}{0}{sun1996application}
\abx@aux@cite{kim2007electron}
\abx@aux@segm{0}{0}{kim2007electron}
\abx@aux@segm{0}{0}{sun1996application}
\abx@aux@segm{0}{0}{sun1996application}
\abx@aux@cite{rappaz1990analysis}
\abx@aux@segm{0}{0}{rappaz1990analysis}
\abx@aux@cite{david1990microstructure}
\abx@aux@segm{0}{0}{david1990microstructure}
\abx@aux@cite{su2002electron}
\abx@aux@segm{0}{0}{su2002electron}
\abx@aux@cite{rosenthal}
\abx@aux@segm{0}{0}{rosenthal}
\abx@aux@cite{grong1997metallurgical}
\abx@aux@segm{0}{0}{grong1997metallurgical}
\abx@aux@cite{nunes1983extended}
\abx@aux@segm{0}{0}{nunes1983extended}
\abx@aux@cite{tsai1983heat}
\abx@aux@segm{0}{0}{tsai1983heat}
\abx@aux@cite{gratzke1992theoretical}
\abx@aux@segm{0}{0}{gratzke1992theoretical}
\abx@aux@cite{zah2010modelling}
\abx@aux@segm{0}{0}{zah2010modelling}
\abx@aux@cite{nguyen2005humping}
\abx@aux@segm{0}{0}{nguyen2005humping}
\abx@aux@segm{0}{0}{nguyen2005humping}
\abx@aux@segm{0}{0}{zah2010modelling}
\abx@aux@segm{0}{0}{nguyen2005humping}
\abx@aux@segm{0}{0}{nguyen2005humping}
\abx@aux@segm{0}{0}{zah2010modelling}
\abx@aux@cite{zacharia1989three}
\abx@aux@segm{0}{0}{zacharia1989three}
\abx@aux@cite{zhang2003modeling}
\abx@aux@segm{0}{0}{zhang2003modeling}
\abx@aux@cite{rai2008heat}
\abx@aux@segm{0}{0}{rai2008heat}
\abx@aux@cite{he2003heat}
\abx@aux@segm{0}{0}{he2003heat}
\abx@aux@cite{zacharia1995modeling}
\abx@aux@segm{0}{0}{zacharia1995modeling}
\abx@aux@cite{rai2007heat}
\abx@aux@segm{0}{0}{rai2007heat}
\abx@aux@segm{0}{0}{rai2008heat}
\abx@aux@segm{0}{0}{he2003heat}
\abx@aux@cite{price2012evaluations}
\abx@aux@segm{0}{0}{price2012evaluations}
\abx@aux@cite{price2013experimental}
\abx@aux@segm{0}{0}{price2013experimental}
\abx@aux@cite{mireles2015closed}
\abx@aux@segm{0}{0}{mireles2015closed}
\abx@aux@cite{tapia2014review}
\abx@aux@segm{0}{0}{tapia2014review}
\abx@aux@cite{raghavan2013heat}
\abx@aux@segm{0}{0}{raghavan2013heat}
\abx@aux@cite{powell1997transport}
\abx@aux@segm{0}{0}{powell1997transport}
\abx@aux@cite{debroy1995physical}
\abx@aux@segm{0}{0}{debroy1995physical}
\abx@aux@cite{khan1984alloying}
\abx@aux@segm{0}{0}{khan1984alloying}
\abx@aux@cite{metzbower1993keyhole}
\abx@aux@segm{0}{0}{metzbower1993keyhole}
\abx@aux@cite{sahoo1988effects}
\abx@aux@segm{0}{0}{sahoo1988effects}
\abx@aux@cite{mundra1993toward}
\abx@aux@segm{0}{0}{mundra1993toward}
\abx@aux@segm{0}{0}{mundra1993toward}
\abx@aux@segm{0}{0}{mundra1993toward}
\abx@aux@cite{he2003alloying}
\abx@aux@segm{0}{0}{he2003alloying}
\abx@aux@cite{he2003probing}
\abx@aux@segm{0}{0}{he2003probing}
\abx@aux@segm{0}{0}{rai2007heat}
\abx@aux@cite{king2014observation}
\abx@aux@segm{0}{0}{king2014observation}
\abx@aux@segm{0}{0}{king2014observation}
\abx@aux@segm{0}{0}{king2014observation}
\abx@aux@cite{liu2011effect}
\abx@aux@segm{0}{0}{liu2011effect}
\abx@aux@cite{antonysamy2012microstructure}
\abx@aux@segm{0}{0}{antonysamy2012microstructure}
\abx@aux@cite{jia2014selective}
\abx@aux@segm{0}{0}{jia2014selective}
\abx@aux@cite{murr2012metal}
\abx@aux@segm{0}{0}{murr2012metal}
\abx@aux@cite{sames2015additive}
\abx@aux@segm{0}{0}{sames2015additive}
\abx@aux@segm{0}{0}{sames2015additive}
\abx@aux@segm{0}{0}{sames2015additive}
\abx@aux@cite{bontha2009effects}
\abx@aux@segm{0}{0}{bontha2009effects}
\abx@aux@segm{0}{0}{bontha2009effects}
\abx@aux@cite{helmer2016grain}
\abx@aux@segm{0}{0}{helmer2016grain}
\abx@aux@segm{0}{0}{helmer2016grain}
\abx@aux@segm{0}{0}{helmer2016grain}
\abx@aux@cite{dehoff2015site}
\abx@aux@segm{0}{0}{dehoff2015site}
\abx@aux@segm{0}{0}{dehoff2015site}
\abx@aux@segm{0}{0}{dehoff2015site}
\abx@aux@segm{0}{0}{dehoff2015site}
\abx@aux@cite{718compo}
\abx@aux@segm{0}{0}{718compo}
\abx@aux@segm{0}{0}{718compo}
\abx@aux@cite{korzekwa2009truchas}
\abx@aux@segm{0}{0}{korzekwa2009truchas}
\abx@aux@cite{parietti2006validation}
\abx@aux@segm{0}{0}{parietti2006validation}
\abx@aux@cite{francois2006modeling}
\abx@aux@segm{0}{0}{francois2006modeling}
\abx@aux@segm{0}{0}{korzekwa2009truchas}
\abx@aux@cite{franccois2015recent}
\abx@aux@segm{0}{0}{franccois2015recent}
\abx@aux@segm{0}{0}{parietti2006validation}
\abx@aux@segm{0}{0}{he2003probing}
\abx@aux@segm{0}{0}{he2003probing}
\abx@aux@segm{0}{0}{parietti2006validation}
\abx@aux@segm{0}{0}{parietti2006validation}
\abx@aux@cite{weller1998tensorial}
\abx@aux@segm{0}{0}{weller1998tensorial}
\@input{chapter-3.aux}
\abx@aux@segm{0}{0}{korzekwa2009truchas}
\abx@aux@segm{0}{0}{zah2010modelling}
\abx@aux@cite{schiller1982electron}
\abx@aux@segm{0}{0}{schiller1982electron}
\abx@aux@cite{qin2004temperature}
\abx@aux@segm{0}{0}{qin2004temperature}
\abx@aux@segm{0}{0}{messler2008principles}
\abx@aux@cite{nandwana2016recyclability}
\abx@aux@segm{0}{0}{nandwana2016recyclability}
\abx@aux@cite{Arcam}
\abx@aux@segm{0}{0}{Arcam}
\abx@aux@cite{keller2015total}
\abx@aux@segm{0}{0}{keller2015total}
\abx@aux@cite{alkahari2012thermal}
\abx@aux@segm{0}{0}{alkahari2012thermal}
\abx@aux@cite{blacker1994cubit}
\abx@aux@segm{0}{0}{blacker1994cubit}
\abx@aux@cite{keyes1998scalable}
\abx@aux@segm{0}{0}{keyes1998scalable}
\abx@aux@segm{0}{0}{keyes1998scalable}
\abx@aux@cite{kamnis2008mathematical}
\abx@aux@segm{0}{0}{kamnis2008mathematical}
\abx@aux@cite{pottlacher2002thermophysical}
\abx@aux@segm{0}{0}{pottlacher2002thermophysical}
\abx@aux@segm{0}{0}{kamnis2008mathematical}
\abx@aux@segm{0}{0}{pottlacher2002thermophysical}
\abx@aux@cite{rappaz1989modelling}
\abx@aux@segm{0}{0}{rappaz1989modelling}
\abx@aux@cite{visit2003visit}
\abx@aux@segm{0}{0}{visit2003visit}
\abx@aux@cite{nastac2001advances}
\abx@aux@segm{0}{0}{nastac2001advances}
\abx@aux@segm{0}{0}{he2003heat}
\abx@aux@cite{he2005heat}
\abx@aux@segm{0}{0}{he2005heat}
\abx@aux@segm{0}{0}{rai2008heat}
\abx@aux@segm{0}{0}{zhang2003modeling}
\@input{chapter-4.aux}
\abx@aux@cite{dieter1986mechanical}
\abx@aux@segm{0}{0}{dieter1986mechanical}
\abx@aux@cite{Stollof1996}
\abx@aux@segm{0}{0}{Stollof1996}
\abx@aux@cite{drapier1978high}
\abx@aux@segm{0}{0}{drapier1978high}
\abx@aux@cite{lamm2007effect}
\abx@aux@segm{0}{0}{lamm2007effect}
\abx@aux@cite{trivedi1984interdendritic}
\abx@aux@segm{0}{0}{trivedi1984interdendritic}
\abx@aux@cite{kurz1981dendrite}
\abx@aux@segm{0}{0}{kurz1981dendrite}
\abx@aux@cite{langer1977stability}
\abx@aux@segm{0}{0}{langer1977stability}
\abx@aux@segm{0}{0}{kurz1981dendrite}
\abx@aux@cite{lee2014effect}
\abx@aux@segm{0}{0}{lee2014effect}
\abx@aux@segm{0}{0}{lee2014effect}
\abx@aux@segm{0}{0}{lee2014effect}
\abx@aux@cite{kirka2016microstructure}
\abx@aux@segm{0}{0}{kirka2016microstructure}
\abx@aux@cite{zhang2017homogenization}
\abx@aux@segm{0}{0}{zhang2017homogenization}
\abx@aux@segm{0}{0}{kirka2016microstructure}
\abx@aux@segm{0}{0}{zhang2017homogenization}
\abx@aux@segm{0}{0}{zhang2017homogenization}
\abx@aux@segm{0}{0}{nastac2001advances}
\abx@aux@cite{beckermann2000development}
\abx@aux@segm{0}{0}{beckermann2000development}
\abx@aux@segm{0}{0}{pollock2006nickel}
\abx@aux@cite{aveson2014origins}
\abx@aux@segm{0}{0}{aveson2014origins}
\abx@aux@cite{porter2009phase}
\abx@aux@segm{0}{0}{porter2009phase}
\abx@aux@cite{uttormark1997repeated}
\abx@aux@segm{0}{0}{uttormark1997repeated}
\abx@aux@cite{yang2011cooling}
\abx@aux@segm{0}{0}{yang2011cooling}
\abx@aux@segm{0}{0}{he2005heat}
\abx@aux@segm{0}{0}{yang2011cooling}
\abx@aux@segm{0}{0}{uttormark1997repeated}
\abx@aux@segm{0}{0}{david1989correlation}
\abx@aux@cite{rappaz2009solidification}
\abx@aux@segm{0}{0}{rappaz2009solidification}
\abx@aux@segm{0}{0}{helmer2016grain}
\abx@aux@cite{wei2017three}
\abx@aux@segm{0}{0}{wei2017three}
\@input{chapter-5.aux}
\abx@aux@segm{0}{0}{liu2011effect}
\abx@aux@segm{0}{0}{antonysamy2012microstructure}
\abx@aux@segm{0}{0}{jia2014selective}
\abx@aux@segm{0}{0}{murr2012metal}
\abx@aux@cite{raghavan2016numerical}
\abx@aux@segm{0}{0}{raghavan2016numerical}
\abx@aux@segm{0}{0}{dehoff2015site}
\abx@aux@segm{0}{0}{nastac2001advances}
\abx@aux@segm{0}{0}{nastac2001advances}
\abx@aux@segm{0}{0}{nastac2001advances}
\abx@aux@segm{0}{0}{bontha2009effects}
\abx@aux@cite{hunt1984steady}
\abx@aux@segm{0}{0}{hunt1984steady}
\abx@aux@segm{0}{0}{gaumann2001single}
\abx@aux@segm{0}{0}{gaumann2001single}
\abx@aux@segm{0}{0}{vitek2005effect}
\abx@aux@cite{anderson2010origin}
\abx@aux@segm{0}{0}{anderson2010origin}
\abx@aux@segm{0}{0}{gaumann2001single}
\abx@aux@segm{0}{0}{vitek2005effect}
\abx@aux@segm{0}{0}{anderson2010origin}
\abx@aux@segm{0}{0}{gaumann2001single}
\abx@aux@segm{0}{0}{gaumann2001single}
\abx@aux@segm{0}{0}{vitek2005effect}
\abx@aux@cite{raghavan2017corrigendum}
\abx@aux@segm{0}{0}{raghavan2017corrigendum}
\abx@aux@cite{montgomery2017design}
\abx@aux@segm{0}{0}{montgomery2017design}
\@input{chapter-6.aux}
\abx@aux@cite{raplee2017thermographic}
\abx@aux@segm{0}{0}{raplee2017thermographic}
\abx@aux@segm{0}{0}{nandwana2016recyclability}
\abx@aux@cite{dinwiddie2013thermographic}
\abx@aux@segm{0}{0}{dinwiddie2013thermographic}
\abx@aux@cite{dinwiddie2016calibrating}
\abx@aux@segm{0}{0}{dinwiddie2016calibrating}
\abx@aux@segm{0}{0}{dinwiddie2016calibrating}
\abx@aux@segm{0}{0}{dinwiddie2016calibrating}
\abx@aux@segm{0}{0}{raplee2017thermographic}
\abx@aux@segm{0}{0}{raplee2017thermographic}
\abx@aux@segm{0}{0}{raplee2017thermographic}
\abx@aux@segm{0}{0}{raplee2017thermographic}
\abx@aux@segm{0}{0}{raplee2017thermographic}
\abx@aux@segm{0}{0}{raplee2017thermographic}
\abx@aux@segm{0}{0}{nastac2001advances}
\abx@aux@segm{0}{0}{nastac2001advances}
\@input{chapter-7.aux}
\abx@aux@cite{oreper1983convection}
\abx@aux@segm{0}{0}{oreper1983convection}
\abx@aux@cite{kou1986weld}
\abx@aux@segm{0}{0}{kou1986weld}
\abx@aux@segm{0}{0}{zacharia1989three}
\abx@aux@segm{0}{0}{zhang2003modeling}
\abx@aux@segm{0}{0}{rai2008heat}
\abx@aux@segm{0}{0}{he2003heat}
\abx@aux@cite{heiple1981effect}
\abx@aux@segm{0}{0}{heiple1981effect}
\abx@aux@cite{heiple1982mechanism}
\abx@aux@segm{0}{0}{heiple1982mechanism}
\abx@aux@cite{heiple1981effects}
\abx@aux@segm{0}{0}{heiple1981effects}
\abx@aux@cite{heiple1983surface}
\abx@aux@segm{0}{0}{heiple1983surface}
\abx@aux@cite{heiple1985effects}
\abx@aux@segm{0}{0}{heiple1985effects}
\abx@aux@segm{0}{0}{heiple1982mechanism}
\abx@aux@cite{sahoo1988surface}
\abx@aux@segm{0}{0}{sahoo1988surface}
\abx@aux@segm{0}{0}{sahoo1988surface}
\abx@aux@segm{0}{0}{sahoo1988surface}
\abx@aux@cite{mills1990factors}
\abx@aux@segm{0}{0}{mills1990factors}
\abx@aux@cite{lee1998modelling}
\abx@aux@segm{0}{0}{lee1998modelling}
\abx@aux@segm{0}{0}{lee1998modelling}
\abx@aux@cite{leonard1979stable}
\abx@aux@segm{0}{0}{leonard1979stable}
\abx@aux@cite{RAGHAVAN2017375}
\abx@aux@segm{0}{0}{RAGHAVAN2017375}
\abx@aux@cite{schneider2012nih}
\abx@aux@segm{0}{0}{schneider2012nih}
\@input{chapter-8.aux}
\abx@aux@cite{adams2009dakota}
\abx@aux@segm{0}{0}{adams2009dakota}
\abx@aux@cite{hunt2015puq}
\abx@aux@segm{0}{0}{hunt2015puq}
\abx@aux@cite{martin20173d}
\abx@aux@segm{0}{0}{martin20173d}
\@writefile{toc}{\contentsline {chapter}{Bibliography}{128}{section*.112}}
\@writefile{toc}{\contentsline {chapter}{Appendices}{142}{section*.113}}
\@input{back-matter/Appendix-1.aux}
\abx@aux@segm{0}{0}{uttormark1997repeated}
\abx@aux@segm{0}{0}{yang2011cooling}
\abx@aux@cite{turnbull1950formation}
\abx@aux@segm{0}{0}{turnbull1950formation}
\@input{back-matter/Appendix-2.aux}
\@input{back-matter/Appendix-3.aux}
\@input{back-matter/vita.aux}
\@writefile{toc}{\contentsline {chapter}{Vita}{150}{section*.114}}
\abx@aux@refcontextdefaultsdone
\abx@aux@defaultrefcontext{0}{wong2012review}{none/global/}
\abx@aux@defaultrefcontext{0}{guo2012feature}{none/global/}
\abx@aux@defaultrefcontext{0}{nopparat2012resource}{none/global/}
\abx@aux@defaultrefcontext{0}{toddGE}{none/global/}
\abx@aux@defaultrefcontext{0}{genozzle}{none/global/}
\abx@aux@defaultrefcontext{0}{cordero2017powder}{none/global/}
\abx@aux@defaultrefcontext{0}{gajapathi2011controlling}{none/global/}
\abx@aux@defaultrefcontext{0}{Multibeam1850}{none/global/}
\abx@aux@defaultrefcontext{0}{sochalski2015comparison}{none/global/}
\abx@aux@defaultrefcontext{0}{arcamschematic}{none/global/}
\abx@aux@defaultrefcontext{0}{pollock2006nickel}{none/global/}
\abx@aux@defaultrefcontext{0}{ramsperger2016microstructure}{none/global/}
\abx@aux@defaultrefcontext{0}{carter2014influence}{none/global/}
\abx@aux@defaultrefcontext{0}{Tioverview}{none/global/}
\abx@aux@defaultrefcontext{0}{brunette2012titanium}{none/global/}
\abx@aux@defaultrefcontext{0}{jardini2014cranial}{none/global/}
\abx@aux@defaultrefcontext{0}{murr2010next}{none/global/}
\abx@aux@defaultrefcontext{0}{dimiduk1999gamma}{none/global/}
\abx@aux@defaultrefcontext{0}{kim1989intermetallic}{none/global/}
\abx@aux@defaultrefcontext{0}{murr2010characterization}{none/global/}
\abx@aux@defaultrefcontext{0}{tang2015additive}{none/global/}
\abx@aux@defaultrefcontext{0}{ahmed1998phase}{none/global/}
\abx@aux@defaultrefcontext{0}{xie2005ttt}{none/global/}
\abx@aux@defaultrefcontext{0}{oradei1991current}{none/global/}
\abx@aux@defaultrefcontext{0}{david1989correlation}{none/global/}
\abx@aux@defaultrefcontext{0}{kurzfundamentals}{none/global/}
\abx@aux@defaultrefcontext{0}{dantzig2016solidification}{none/global/}
\abx@aux@defaultrefcontext{0}{kou2003welding}{none/global/}
\abx@aux@defaultrefcontext{0}{kou1986nucleation}{none/global/}
\abx@aux@defaultrefcontext{0}{easton1999grain}{none/global/}
\abx@aux@defaultrefcontext{0}{lim2010effect}{none/global/}
\abx@aux@defaultrefcontext{0}{gaumann2001single}{none/global/}
\abx@aux@defaultrefcontext{0}{gaumann1997nucleation}{none/global/}
\abx@aux@defaultrefcontext{0}{vitek2005effect}{none/global/}
\abx@aux@defaultrefcontext{0}{schultz1994electron}{none/global/}
\abx@aux@defaultrefcontext{0}{electronindus1983}{none/global/}
\abx@aux@defaultrefcontext{0}{elmer2009introduction}{none/global/}
\abx@aux@defaultrefcontext{0}{messler2008principles}{none/global/}
\abx@aux@defaultrefcontext{0}{sun1996application}{none/global/}
\abx@aux@defaultrefcontext{0}{kim2007electron}{none/global/}
\abx@aux@defaultrefcontext{0}{rappaz1990analysis}{none/global/}
\abx@aux@defaultrefcontext{0}{david1990microstructure}{none/global/}
\abx@aux@defaultrefcontext{0}{su2002electron}{none/global/}
\abx@aux@defaultrefcontext{0}{rosenthal}{none/global/}
\abx@aux@defaultrefcontext{0}{grong1997metallurgical}{none/global/}
\abx@aux@defaultrefcontext{0}{nunes1983extended}{none/global/}
\abx@aux@defaultrefcontext{0}{tsai1983heat}{none/global/}
\abx@aux@defaultrefcontext{0}{gratzke1992theoretical}{none/global/}
\abx@aux@defaultrefcontext{0}{zah2010modelling}{none/global/}
\abx@aux@defaultrefcontext{0}{nguyen2005humping}{none/global/}
\abx@aux@defaultrefcontext{0}{zacharia1989three}{none/global/}
\abx@aux@defaultrefcontext{0}{zhang2003modeling}{none/global/}
\abx@aux@defaultrefcontext{0}{rai2008heat}{none/global/}
\abx@aux@defaultrefcontext{0}{he2003heat}{none/global/}
\abx@aux@defaultrefcontext{0}{zacharia1995modeling}{none/global/}
\abx@aux@defaultrefcontext{0}{rai2007heat}{none/global/}
\abx@aux@defaultrefcontext{0}{price2012evaluations}{none/global/}
\abx@aux@defaultrefcontext{0}{price2013experimental}{none/global/}
\abx@aux@defaultrefcontext{0}{mireles2015closed}{none/global/}
\abx@aux@defaultrefcontext{0}{tapia2014review}{none/global/}
\abx@aux@defaultrefcontext{0}{raghavan2013heat}{none/global/}
\abx@aux@defaultrefcontext{0}{powell1997transport}{none/global/}
\abx@aux@defaultrefcontext{0}{debroy1995physical}{none/global/}
\abx@aux@defaultrefcontext{0}{khan1984alloying}{none/global/}
\abx@aux@defaultrefcontext{0}{metzbower1993keyhole}{none/global/}
\abx@aux@defaultrefcontext{0}{sahoo1988effects}{none/global/}
\abx@aux@defaultrefcontext{0}{mundra1993toward}{none/global/}
\abx@aux@defaultrefcontext{0}{he2003alloying}{none/global/}
\abx@aux@defaultrefcontext{0}{he2003probing}{none/global/}
\abx@aux@defaultrefcontext{0}{king2014observation}{none/global/}
\abx@aux@defaultrefcontext{0}{liu2011effect}{none/global/}
\abx@aux@defaultrefcontext{0}{antonysamy2012microstructure}{none/global/}
\abx@aux@defaultrefcontext{0}{jia2014selective}{none/global/}
\abx@aux@defaultrefcontext{0}{murr2012metal}{none/global/}
\abx@aux@defaultrefcontext{0}{sames2015additive}{none/global/}
\abx@aux@defaultrefcontext{0}{bontha2009effects}{none/global/}
\abx@aux@defaultrefcontext{0}{helmer2016grain}{none/global/}
\abx@aux@defaultrefcontext{0}{dehoff2015site}{none/global/}
\abx@aux@defaultrefcontext{0}{718compo}{none/global/}
\abx@aux@defaultrefcontext{0}{korzekwa2009truchas}{none/global/}
\abx@aux@defaultrefcontext{0}{parietti2006validation}{none/global/}
\abx@aux@defaultrefcontext{0}{francois2006modeling}{none/global/}
\abx@aux@defaultrefcontext{0}{franccois2015recent}{none/global/}
\abx@aux@defaultrefcontext{0}{weller1998tensorial}{none/global/}
\abx@aux@defaultrefcontext{0}{schiller1982electron}{none/global/}
\abx@aux@defaultrefcontext{0}{qin2004temperature}{none/global/}
\abx@aux@defaultrefcontext{0}{nandwana2016recyclability}{none/global/}
\abx@aux@defaultrefcontext{0}{Arcam}{none/global/}
\abx@aux@defaultrefcontext{0}{keller2015total}{none/global/}
\abx@aux@defaultrefcontext{0}{alkahari2012thermal}{none/global/}
\abx@aux@defaultrefcontext{0}{blacker1994cubit}{none/global/}
\abx@aux@defaultrefcontext{0}{keyes1998scalable}{none/global/}
\abx@aux@defaultrefcontext{0}{kamnis2008mathematical}{none/global/}
\abx@aux@defaultrefcontext{0}{pottlacher2002thermophysical}{none/global/}
\abx@aux@defaultrefcontext{0}{rappaz1989modelling}{none/global/}
\abx@aux@defaultrefcontext{0}{visit2003visit}{none/global/}
\abx@aux@defaultrefcontext{0}{nastac2001advances}{none/global/}
\abx@aux@defaultrefcontext{0}{he2005heat}{none/global/}
\abx@aux@defaultrefcontext{0}{dieter1986mechanical}{none/global/}
\abx@aux@defaultrefcontext{0}{Stollof1996}{none/global/}
\abx@aux@defaultrefcontext{0}{drapier1978high}{none/global/}
\abx@aux@defaultrefcontext{0}{lamm2007effect}{none/global/}
\abx@aux@defaultrefcontext{0}{trivedi1984interdendritic}{none/global/}
\abx@aux@defaultrefcontext{0}{kurz1981dendrite}{none/global/}
\abx@aux@defaultrefcontext{0}{langer1977stability}{none/global/}
\abx@aux@defaultrefcontext{0}{lee2014effect}{none/global/}
\abx@aux@defaultrefcontext{0}{kirka2016microstructure}{none/global/}
\abx@aux@defaultrefcontext{0}{zhang2017homogenization}{none/global/}
\abx@aux@defaultrefcontext{0}{beckermann2000development}{none/global/}
\abx@aux@defaultrefcontext{0}{aveson2014origins}{none/global/}
\abx@aux@defaultrefcontext{0}{porter2009phase}{none/global/}
\abx@aux@defaultrefcontext{0}{uttormark1997repeated}{none/global/}
\abx@aux@defaultrefcontext{0}{yang2011cooling}{none/global/}
\abx@aux@defaultrefcontext{0}{rappaz2009solidification}{none/global/}
\abx@aux@defaultrefcontext{0}{wei2017three}{none/global/}
\abx@aux@defaultrefcontext{0}{raghavan2016numerical}{none/global/}
\abx@aux@defaultrefcontext{0}{hunt1984steady}{none/global/}
\abx@aux@defaultrefcontext{0}{anderson2010origin}{none/global/}
\abx@aux@defaultrefcontext{0}{raghavan2017corrigendum}{none/global/}
\abx@aux@defaultrefcontext{0}{montgomery2017design}{none/global/}
\abx@aux@defaultrefcontext{0}{raplee2017thermographic}{none/global/}
\abx@aux@defaultrefcontext{0}{dinwiddie2013thermographic}{none/global/}
\abx@aux@defaultrefcontext{0}{dinwiddie2016calibrating}{none/global/}
\abx@aux@defaultrefcontext{0}{oreper1983convection}{none/global/}
\abx@aux@defaultrefcontext{0}{kou1986weld}{none/global/}
\abx@aux@defaultrefcontext{0}{heiple1981effect}{none/global/}
\abx@aux@defaultrefcontext{0}{heiple1982mechanism}{none/global/}
\abx@aux@defaultrefcontext{0}{heiple1981effects}{none/global/}
\abx@aux@defaultrefcontext{0}{heiple1983surface}{none/global/}
\abx@aux@defaultrefcontext{0}{heiple1985effects}{none/global/}
\abx@aux@defaultrefcontext{0}{sahoo1988surface}{none/global/}
\abx@aux@defaultrefcontext{0}{mills1990factors}{none/global/}
\abx@aux@defaultrefcontext{0}{lee1998modelling}{none/global/}
\abx@aux@defaultrefcontext{0}{leonard1979stable}{none/global/}
\abx@aux@defaultrefcontext{0}{RAGHAVAN2017375}{none/global/}
\abx@aux@defaultrefcontext{0}{schneider2012nih}{none/global/}
\abx@aux@defaultrefcontext{0}{adams2009dakota}{none/global/}
\abx@aux@defaultrefcontext{0}{hunt2015puq}{none/global/}
\abx@aux@defaultrefcontext{0}{martin20173d}{none/global/}
\abx@aux@defaultrefcontext{0}{turnbull1950formation}{none/global/}
