\relax 
\providecommand\hyper@newdestlabel[2]{}
\@writefile{toc}{\contentsline {chapter}{\numberline {A}Appendix-1}{143}{appendix.A}}
\@writefile{lof}{\addvspace {10\p@ }}
\@writefile{lot}{\addvspace {10\p@ }}
\newlabel{ch:Appendix-1}{{A}{143}{Appendix-1}{appendix.A}{}}
\newlabel{ch:Appendix-1@cref}{{[appendix][1][2147483647]A}{143}}
\@writefile{toc}{\contentsline {section}{\numberline {A.1}Nucleation Rate as a Function of Cooling Rate}{143}{section.A.1}}
\newlabel{coolingrate_eqn}{{A.1}{143}{Nucleation Rate as a Function of Cooling Rate}{equation.A.1.1}{}}
\newlabel{coolingrate_eqn@cref}{{[equation][1][2147483647,1]A.1}{143}}
\newlabel{numberofnuclei_eqn}{{A.2}{143}{Nucleation Rate as a Function of Cooling Rate}{equation.A.1.2}{}}
\newlabel{numberofnuclei_eqn@cref}{{[equation][2][2147483647,1]A.2}{143}}
\newlabel{derived_eqn}{{A.3}{143}{Nucleation Rate as a Function of Cooling Rate}{equation.A.1.3}{}}
\newlabel{derived_eqn@cref}{{[equation][3][2147483647,1]A.3}{143}}
\newlabel{derived_eqn}{{A.4}{143}{Nucleation Rate as a Function of Cooling Rate}{equation.A.1.4}{}}
\newlabel{derived_eqn@cref}{{[equation][4][2147483647,1]A.4}{143}}
\newlabel{surfnucl_eqn_app_1}{{A.5}{144}{Nucleation Rate as a Function of Cooling Rate}{equation.A.1.5}{}}
\newlabel{surfnucl_eqn_app_1@cref}{{[equation][5][2147483647,1]A.5}{144}}
\newlabel{phi_eqn_app_1}{{A.6}{144}{Nucleation Rate as a Function of Cooling Rate}{equation.A.1.6}{}}
\newlabel{phi_eqn_app_1@cref}{{[equation][6][2147483647,1]A.6}{144}}
\newlabel{psi_eqn_app_1}{{A.7}{144}{Nucleation Rate as a Function of Cooling Rate}{equation.A.1.7}{}}
\newlabel{psi_eqn_app_1@cref}{{[equation][7][2147483647,1]A.7}{144}}
\newlabel{ns_eqn_app_1}{{A.8}{144}{Nucleation Rate as a Function of Cooling Rate}{equation.A.1.8}{}}
\newlabel{ns_eqn_app_1@cref}{{[equation][8][2147483647,1]A.8}{144}}
\newlabel{phi_eqn_app_1}{{A.9}{144}{Nucleation Rate as a Function of Cooling Rate}{equation.A.1.9}{}}
\newlabel{phi_eqn_app_1@cref}{{[equation][9][2147483647,1]A.9}{144}}
\newlabel{phi_eqn_app_1}{{A.10}{144}{Nucleation Rate as a Function of Cooling Rate}{equation.A.1.10}{}}
\newlabel{phi_eqn_app_1@cref}{{[equation][10][2147483647,1]A.10}{144}}
\@setckpt{back-matter/Appendix-1}{
\setcounter{page}{145}
\setcounter{equation}{10}
\setcounter{enumi}{3}
\setcounter{enumii}{0}
\setcounter{enumiii}{0}
\setcounter{enumiv}{0}
\setcounter{footnote}{0}
\setcounter{mpfootnote}{0}
\setcounter{part}{0}
\setcounter{chapter}{1}
\setcounter{section}{1}
\setcounter{subsection}{0}
\setcounter{subsubsection}{0}
\setcounter{paragraph}{0}
\setcounter{subparagraph}{0}
\setcounter{figure}{0}
\setcounter{table}{0}
\setcounter{parentequation}{0}
\setcounter{Item}{3}
\setcounter{Hfootnote}{0}
\setcounter{bookmark@seq@number}{83}
\setcounter{theorem}{0}
\setcounter{corollary}{0}
\setcounter{lemma}{0}
\setcounter{lstnumber}{1}
\setcounter{float@type}{8}
\setcounter{tabx@nest}{0}
\setcounter{listtotal}{0}
\setcounter{listcount}{0}
\setcounter{liststart}{0}
\setcounter{liststop}{0}
\setcounter{citecount}{0}
\setcounter{citetotal}{0}
\setcounter{multicitecount}{0}
\setcounter{multicitetotal}{0}
\setcounter{instcount}{423}
\setcounter{maxnames}{3}
\setcounter{minnames}{1}
\setcounter{maxitems}{3}
\setcounter{minitems}{1}
\setcounter{citecounter}{0}
\setcounter{savedcitecounter}{0}
\setcounter{uniquelist}{0}
\setcounter{uniquename}{0}
\setcounter{refsection}{0}
\setcounter{refsegment}{0}
\setcounter{maxextratitle}{0}
\setcounter{maxextratitleyear}{0}
\setcounter{maxextrayear}{0}
\setcounter{maxextraalpha}{0}
\setcounter{abbrvpenalty}{5000}
\setcounter{highnamepenalty}{5000}
\setcounter{lownamepenalty}{2500}
\setcounter{maxparens}{3}
\setcounter{parenlevel}{0}
\setcounter{mincomprange}{10}
\setcounter{maxcomprange}{100000}
\setcounter{mincompwidth}{1}
\setcounter{afterword}{0}
\setcounter{savedafterword}{0}
\setcounter{annotator}{0}
\setcounter{savedannotator}{0}
\setcounter{author}{0}
\setcounter{savedauthor}{0}
\setcounter{bookauthor}{0}
\setcounter{savedbookauthor}{0}
\setcounter{commentator}{0}
\setcounter{savedcommentator}{0}
\setcounter{editor}{0}
\setcounter{savededitor}{0}
\setcounter{editora}{0}
\setcounter{savededitora}{0}
\setcounter{editorb}{0}
\setcounter{savededitorb}{0}
\setcounter{editorc}{0}
\setcounter{savededitorc}{0}
\setcounter{foreword}{0}
\setcounter{savedforeword}{0}
\setcounter{holder}{0}
\setcounter{savedholder}{0}
\setcounter{introduction}{0}
\setcounter{savedintroduction}{0}
\setcounter{namea}{0}
\setcounter{savednamea}{0}
\setcounter{nameb}{0}
\setcounter{savednameb}{0}
\setcounter{namec}{0}
\setcounter{savednamec}{0}
\setcounter{translator}{0}
\setcounter{savedtranslator}{0}
\setcounter{shortauthor}{0}
\setcounter{savedshortauthor}{0}
\setcounter{shorteditor}{0}
\setcounter{savedshorteditor}{0}
\setcounter{labelname}{0}
\setcounter{savedlabelname}{0}
\setcounter{institution}{0}
\setcounter{savedinstitution}{0}
\setcounter{lista}{0}
\setcounter{savedlista}{0}
\setcounter{listb}{0}
\setcounter{savedlistb}{0}
\setcounter{listc}{0}
\setcounter{savedlistc}{0}
\setcounter{listd}{0}
\setcounter{savedlistd}{0}
\setcounter{liste}{0}
\setcounter{savedliste}{0}
\setcounter{listf}{0}
\setcounter{savedlistf}{0}
\setcounter{location}{0}
\setcounter{savedlocation}{0}
\setcounter{organization}{0}
\setcounter{savedorganization}{0}
\setcounter{origlocation}{0}
\setcounter{savedoriglocation}{0}
\setcounter{origpublisher}{0}
\setcounter{savedorigpublisher}{0}
\setcounter{publisher}{0}
\setcounter{savedpublisher}{0}
\setcounter{language}{0}
\setcounter{savedlanguage}{0}
\setcounter{pageref}{0}
\setcounter{savedpageref}{0}
\setcounter{textcitecount}{0}
\setcounter{textcitetotal}{0}
\setcounter{textcitemaxnames}{0}
\setcounter{biburlnumpenalty}{0}
\setcounter{biburlucpenalty}{0}
\setcounter{biburllcpenalty}{0}
\setcounter{smartand}{1}
\setcounter{bbx:relatedcount}{0}
\setcounter{bbx:relatedtotal}{0}
\setcounter{ContinuedFloat}{0}
\setcounter{lips@count}{0}
\setcounter{r@tfl@t}{0}
\setcounter{MYtempeqncnt}{0}
\setcounter{KVtest}{0}
\setcounter{subfigure}{0}
\setcounter{subfigure@save}{0}
\setcounter{lofdepth}{1}
\setcounter{subtable}{0}
\setcounter{subtable@save}{0}
\setcounter{lotdepth}{1}
\setcounter{@stackindex}{0}
\setcounter{ROWcellindex@}{0}
\setcounter{section@level}{1}
\setcounter{lstlisting}{0}
}
