\relax 
\providecommand\hyper@newdestlabel[2]{}
\@writefile{toc}{\contentsline {chapter}{\numberline {1}Introduction}{1}{chapter.1}}
\@writefile{lof}{\addvspace {10\p@ }}
\@writefile{lot}{\addvspace {10\p@ }}
\newlabel{ch:chapter_1}{{1}{1}{Introduction}{chapter.1}{}}
\newlabel{ch:chapter_1@cref}{{[chapter][1][]1}{1}}
\@writefile{toc}{\contentsline {section}{\numberline {1.1}Introduction to Additive Manufacturing Process}{1}{section.1.1}}
\@writefile{lof}{\contentsline {figure}{\numberline {1.1}{\ignorespaces Classification of metal AM systems\relax }}{2}{figure.caption.15}}
\providecommand*\caption@xref[2]{\@setref\relax\@undefined{#1}}
\newlabel{AM_Classification}{{1.1}{2}{Classification of metal AM systems\relax }{figure.caption.15}{}}
\newlabel{AM_Classification@cref}{{[figure][1][1]1.1}{2}}
\@writefile{toc}{\contentsline {subsection}{\numberline {1.1.1}Business and Environmental Implications of Additive Manufacturing Technology}{2}{subsection.1.1.1}}
\@writefile{lof}{\contentsline {figure}{\numberline {1.2}{\ignorespaces Energy Usage Comparison between AM and IM \cite {nopparat2012resource}\relax }}{4}{figure.caption.16}}
\newlabel{fig:1_AM_business}{{1.2}{4}{Energy Usage Comparison between AM and IM \cite {nopparat2012resource}\relax }{figure.caption.16}{}}
\newlabel{fig:1_AM_business@cref}{{[figure][2][1]1.2}{4}}
\@writefile{toc}{\contentsline {subsubsection}{Industrialization of Metal AM}{5}{section*.17}}
\@writefile{toc}{\contentsline {subsection}{\numberline {1.1.2}A Brief Introduction to Arcam\textsuperscript  {\textregistered } process}{5}{subsection.1.1.2}}
\@writefile{lof}{\contentsline {figure}{\numberline {1.3}{\ignorespaces Production scale additively manufactured fuel nozzle from GE Aviation \cite {genozzle}\relax }}{6}{figure.caption.18}}
\newlabel{fig:1_genozzle}{{1.3}{6}{Production scale additively manufactured fuel nozzle from GE Aviation \cite {genozzle}\relax }{figure.caption.18}{}}
\newlabel{fig:1_genozzle@cref}{{[figure][3][1]1.3}{6}}
\@writefile{lof}{\contentsline {figure}{\numberline {1.4}{\ignorespaces Processing steps in Arcam\textsuperscript  {\textregistered }\relax }}{6}{figure.caption.19}}
\newlabel{fig:arcam_steps}{{1.4}{6}{Processing steps in Arcam\textsuperscript {\textregistered }\relax }{figure.caption.19}{}}
\newlabel{fig:arcam_steps@cref}{{[figure][4][1]1.4}{6}}
\@writefile{lof}{\contentsline {figure}{\numberline {1.5}{\ignorespaces Schematic of an Arcam\textsuperscript  {\textregistered } machine and corresponding picture of the build chamber \cite {arcamschematic}\relax }}{7}{figure.caption.20}}
\newlabel{fig:1_arcam}{{1.5}{7}{Schematic of an Arcam\textsuperscript {\textregistered } machine and corresponding picture of the build chamber \cite {arcamschematic}\relax }{figure.caption.20}{}}
\newlabel{fig:1_arcam@cref}{{[figure][5][1]1.5}{7}}
\@writefile{toc}{\contentsline {subsection}{\numberline {1.1.3}Alloys used in powder bed AM processes}{7}{subsection.1.1.3}}
\@writefile{toc}{\contentsline {section}{\numberline {1.2}Factors Affecting Mechanical Performance of Engineering Components}{8}{section.1.2}}
\@setckpt{chapter-1}{
\setcounter{page}{10}
\setcounter{equation}{0}
\setcounter{enumi}{3}
\setcounter{enumii}{0}
\setcounter{enumiii}{0}
\setcounter{enumiv}{0}
\setcounter{footnote}{0}
\setcounter{mpfootnote}{0}
\setcounter{part}{0}
\setcounter{chapter}{1}
\setcounter{section}{2}
\setcounter{subsection}{0}
\setcounter{subsubsection}{0}
\setcounter{paragraph}{0}
\setcounter{subparagraph}{0}
\setcounter{figure}{5}
\setcounter{table}{0}
\setcounter{parentequation}{0}
\setcounter{Item}{3}
\setcounter{Hfootnote}{0}
\setcounter{bookmark@seq@number}{13}
\setcounter{theorem}{0}
\setcounter{corollary}{0}
\setcounter{lemma}{0}
\setcounter{lstnumber}{1}
\setcounter{float@type}{8}
\setcounter{tabx@nest}{0}
\setcounter{listtotal}{0}
\setcounter{listcount}{0}
\setcounter{liststart}{0}
\setcounter{liststop}{0}
\setcounter{citecount}{0}
\setcounter{citetotal}{0}
\setcounter{multicitecount}{0}
\setcounter{multicitetotal}{0}
\setcounter{instcount}{58}
\setcounter{maxnames}{3}
\setcounter{minnames}{1}
\setcounter{maxitems}{3}
\setcounter{minitems}{1}
\setcounter{citecounter}{0}
\setcounter{savedcitecounter}{0}
\setcounter{uniquelist}{0}
\setcounter{uniquename}{0}
\setcounter{refsection}{0}
\setcounter{refsegment}{0}
\setcounter{maxextratitle}{0}
\setcounter{maxextratitleyear}{0}
\setcounter{maxextrayear}{0}
\setcounter{maxextraalpha}{0}
\setcounter{abbrvpenalty}{5000}
\setcounter{highnamepenalty}{5000}
\setcounter{lownamepenalty}{2500}
\setcounter{maxparens}{3}
\setcounter{parenlevel}{0}
\setcounter{mincomprange}{10}
\setcounter{maxcomprange}{100000}
\setcounter{mincompwidth}{1}
\setcounter{afterword}{0}
\setcounter{savedafterword}{0}
\setcounter{annotator}{0}
\setcounter{savedannotator}{0}
\setcounter{author}{0}
\setcounter{savedauthor}{0}
\setcounter{bookauthor}{0}
\setcounter{savedbookauthor}{0}
\setcounter{commentator}{0}
\setcounter{savedcommentator}{0}
\setcounter{editor}{0}
\setcounter{savededitor}{0}
\setcounter{editora}{0}
\setcounter{savededitora}{0}
\setcounter{editorb}{0}
\setcounter{savededitorb}{0}
\setcounter{editorc}{0}
\setcounter{savededitorc}{0}
\setcounter{foreword}{0}
\setcounter{savedforeword}{0}
\setcounter{holder}{0}
\setcounter{savedholder}{0}
\setcounter{introduction}{0}
\setcounter{savedintroduction}{0}
\setcounter{namea}{0}
\setcounter{savednamea}{0}
\setcounter{nameb}{0}
\setcounter{savednameb}{0}
\setcounter{namec}{0}
\setcounter{savednamec}{0}
\setcounter{translator}{0}
\setcounter{savedtranslator}{0}
\setcounter{shortauthor}{0}
\setcounter{savedshortauthor}{0}
\setcounter{shorteditor}{0}
\setcounter{savedshorteditor}{0}
\setcounter{labelname}{0}
\setcounter{savedlabelname}{0}
\setcounter{institution}{0}
\setcounter{savedinstitution}{0}
\setcounter{lista}{0}
\setcounter{savedlista}{0}
\setcounter{listb}{0}
\setcounter{savedlistb}{0}
\setcounter{listc}{0}
\setcounter{savedlistc}{0}
\setcounter{listd}{0}
\setcounter{savedlistd}{0}
\setcounter{liste}{0}
\setcounter{savedliste}{0}
\setcounter{listf}{0}
\setcounter{savedlistf}{0}
\setcounter{location}{0}
\setcounter{savedlocation}{0}
\setcounter{organization}{0}
\setcounter{savedorganization}{0}
\setcounter{origlocation}{0}
\setcounter{savedoriglocation}{0}
\setcounter{origpublisher}{0}
\setcounter{savedorigpublisher}{0}
\setcounter{publisher}{0}
\setcounter{savedpublisher}{0}
\setcounter{language}{0}
\setcounter{savedlanguage}{0}
\setcounter{pageref}{0}
\setcounter{savedpageref}{0}
\setcounter{textcitecount}{0}
\setcounter{textcitetotal}{0}
\setcounter{textcitemaxnames}{0}
\setcounter{biburlnumpenalty}{0}
\setcounter{biburlucpenalty}{0}
\setcounter{biburllcpenalty}{0}
\setcounter{smartand}{1}
\setcounter{bbx:relatedcount}{0}
\setcounter{bbx:relatedtotal}{0}
\setcounter{ContinuedFloat}{0}
\setcounter{lips@count}{0}
\setcounter{r@tfl@t}{0}
\setcounter{MYtempeqncnt}{0}
\setcounter{KVtest}{0}
\setcounter{subfigure}{0}
\setcounter{subfigure@save}{0}
\setcounter{lofdepth}{1}
\setcounter{subtable}{0}
\setcounter{subtable@save}{0}
\setcounter{lotdepth}{1}
\setcounter{@stackindex}{0}
\setcounter{ROWcellindex@}{0}
\setcounter{section@level}{1}
\setcounter{lstlisting}{0}
}
