\boolfalse {citerequest}\boolfalse {citetracker}\boolfalse {pagetracker}\boolfalse {backtracker}\relax 
\addvspace {10\p@ }
\addvspace {10\p@ }
\contentsline {table}{\numberline {2.1}{\ignorespaces Nominal composition (wt\%) of Inconel 718 \cite {718compo}.\relax }}{33}{table.2.1}
\contentsline {table}{\numberline {2.2}{\ignorespaces Verification and validation of Truchas \cite {parietti2006validation}.\relax }}{34}{table.2.2}
\addvspace {10\p@ }
\contentsline {table}{\numberline {3.1}{\ignorespaces Strong Scaling: Wall Time Usage Analysis\relax }}{42}{table.3.1}
\contentsline {table}{\numberline {3.2}{\ignorespaces Thermophysical properties of IN718 \cite {kamnis2008mathematical, pottlacher2002thermophysical}\relax }}{43}{table.3.2}
\addvspace {10\p@ }
\contentsline {table}{\numberline {4.1}{\ignorespaces Values of input parameters of proposed scan strategy\relax }}{51}{table.4.1}
\contentsline {table}{\numberline {4.2}{\ignorespaces Properties of IN718 used in analytical equations to predict PDAS \cite {lee2014effect}.\relax }}{54}{table.4.2}
\addvspace {10\p@ }
\contentsline {table}{\numberline {5.1}{\ignorespaces Values of input parameters of proposed scan strategy\relax }}{78}{table.5.1}
\contentsline {table}{\numberline {5.2}{\ignorespaces $2^4$ simulation combinations and the corresponding volume fraction of equiaxed grains used in DOX\relax }}{79}{table.5.2}
\contentsline {table}{\numberline {5.3}{\ignorespaces Analysis of Variance (ANOVA) of the design\relax }}{80}{table.5.3}
\addvspace {10\p@ }
\contentsline {table}{\numberline {6.1}{\ignorespaces Spot melt parameter list to study the effect of geometry on CET\relax }}{90}{table.6.1}
\contentsline {table}{\numberline {6.2}{\ignorespaces Spot melt parameter list to study the effect of geometry on CET\relax }}{98}{table.6.2}
\addvspace {10\p@ }
\contentsline {table}{\numberline {7.1}{\ignorespaces Comparison of $\Phi $ value with and without fluid flow in the model\relax }}{116}{table.7.1}
\contentsline {table}{\numberline {7.2}{\ignorespaces Experimental comparison of width and depth of the melt pool with and without fluid flow in the model\relax }}{120}{table.7.2}
\addvspace {10\p@ }
\addvspace {10\p@ }
\addvspace {10\p@ }
