\relax 
\providecommand\hyper@newdestlabel[2]{}
\@writefile{toc}{\contentsline {chapter}{\numberline {5}Evaluation of Columnar to Equiaxed Transition (CET)}{72}{chapter.5}}
\@writefile{lof}{\addvspace {10\p@ }}
\@writefile{lot}{\addvspace {10\p@ }}
\newlabel{ch:chapter_5}{{5}{72}{Evaluation of Columnar to Equiaxed Transition (CET)}{chapter.5}{}}
\newlabel{ch:chapter_5@cref}{{[chapter][5][]5}{72}}
\@writefile{toc}{\contentsline {section}{\numberline {5.1}Motivation}{72}{section.5.1}}
\@writefile{toc}{\contentsline {section}{\numberline {5.2}Qualitative Analysis of Parameters}{73}{section.5.2}}
\@writefile{lof}{\contentsline {figure}{\numberline {5.1}{\ignorespaces G vs. R plotted on reference solidification map \cite {nastac2001advances} for the simulation with beam current of \SI {20}{\milli \ampere } and ON time of \SI {1}{\milli \second }. \relax }}{74}{figure.caption.74}}
\newlabel{fig:5_GRref}{{5.1}{74}{G vs. R plotted on reference solidification map \cite {nastac2001advances} for the simulation with beam current of \SI {20}{\milli \ampere } and ON time of \SI {1}{\milli \second }. \relax }{figure.caption.74}{}}
\newlabel{fig:5_GRref@cref}{{[figure][1][5]5.1}{74}}
\@writefile{lof}{\contentsline {figure}{\numberline {5.2}{\ignorespaces Variation of temperature gradient (G) and liquid-solid interface velocity (R) of spot melt profile as a function of (a) preheat temperature, (b) spot ON time, (c) beam diameter, and (d) spot beam current. \relax }}{75}{figure.caption.75}}
\newlabel{fig:5_paramquali}{{5.2}{75}{Variation of temperature gradient (G) and liquid-solid interface velocity (R) of spot melt profile as a function of (a) preheat temperature, (b) spot ON time, (c) beam diameter, and (d) spot beam current. \relax }{figure.caption.75}{}}
\newlabel{fig:5_paramquali@cref}{{[figure][2][5]5.2}{75}}
\@writefile{toc}{\contentsline {section}{\numberline {5.3}Quantitative Analysis}{76}{section.5.3}}
\@writefile{toc}{\contentsline {subsection}{\numberline {5.3.1}Theory}{76}{subsection.5.3.1}}
\newlabel{CET_eqn_5}{{5.1}{76}{Theory}{equation.5.3.1}{}}
\newlabel{CET_eqn_5@cref}{{[equation][1][5]5.1}{76}}
\newlabel{simpCET_eqn_5}{{5.2}{77}{Theory}{equation.5.3.2}{}}
\newlabel{simpCET_eqn_5@cref}{{[equation][2][5]5.2}{77}}
\@writefile{toc}{\contentsline {subsection}{\numberline {5.3.2}Calculation of Spatio-temporal $\Phi $}{77}{subsection.5.3.2}}
\@writefile{lof}{\contentsline {figure}{\numberline {5.3}{\ignorespaces Change in volume fraction of equiaxed grains ($\Phi $) or solidification morphology with respect to different input parameters.\relax }}{78}{figure.caption.76}}
\newlabel{fig:5_histo}{{5.3}{78}{Change in volume fraction of equiaxed grains ($\Phi $) or solidification morphology with respect to different input parameters.\relax }{figure.caption.76}{}}
\newlabel{fig:5_histo@cref}{{[figure][3][5]5.3}{78}}
\newlabel{weightphi_eqn_5}{{5.3}{78}{Calculation of Spatio-temporal $\Phi $}{equation.5.3.3}{}}
\newlabel{weightphi_eqn_5@cref}{{[equation][3][5]5.3}{78}}
\@writefile{toc}{\contentsline {subsection}{\numberline {5.3.3}ANOVA}{78}{subsection.5.3.3}}
\@writefile{lot}{\contentsline {table}{\numberline {5.1}{\ignorespaces Values of input parameters of proposed scan strategy\relax }}{78}{table.5.1}}
\newlabel{spot_param_tab_ch5}{{5.1}{78}{Values of input parameters of proposed scan strategy\relax }{table.5.1}{}}
\newlabel{spot_param_tab_ch5@cref}{{[table][1][5]5.1}{78}}
\@writefile{lot}{\contentsline {table}{\numberline {5.2}{\ignorespaces $2^4$ simulation combinations and the corresponding volume fraction of equiaxed grains used in DOX\relax }}{79}{table.5.2}}
\newlabel{tab_DOX_ch5}{{5.2}{79}{$2^4$ simulation combinations and the corresponding volume fraction of equiaxed grains used in DOX\relax }{table.5.2}{}}
\newlabel{tab_DOX_ch5@cref}{{[table][2][5]5.2}{79}}
\@writefile{lot}{\contentsline {table}{\numberline {5.3}{\ignorespaces Analysis of Variance (ANOVA) of the design\relax }}{80}{table.5.3}}
\newlabel{tab_ANOVA_ch5}{{5.3}{80}{Analysis of Variance (ANOVA) of the design\relax }{table.5.3}{}}
\newlabel{tab_ANOVA_ch5@cref}{{[table][3][5]5.3}{80}}
\newlabel{response_eqn_5}{{5.4}{80}{ANOVA}{equation.5.3.4}{}}
\newlabel{response_eqn_5@cref}{{[equation][4][5]5.4}{80}}
\@writefile{toc}{\contentsline {section}{\numberline {5.4}Experimental Validation}{81}{section.5.4}}
\@writefile{toc}{\contentsline {subsection}{\numberline {5.4.1}Scan Strategy and Fabrication}{81}{subsection.5.4.1}}
\@writefile{toc}{\contentsline {subsection}{\numberline {5.4.2}Insignificance of Beam Diameter}{81}{subsection.5.4.2}}
\@writefile{lof}{\contentsline {figure}{\numberline {5.4}{\ignorespaces Qualitative comparison of (a) raster scan and (b) spot melting strategy\relax }}{82}{figure.caption.77}}
\newlabel{fig:5_scan}{{5.4}{82}{Qualitative comparison of (a) raster scan and (b) spot melting strategy\relax }{figure.caption.77}{}}
\newlabel{fig:5_scan@cref}{{[figure][4][5]5.4}{82}}
\@writefile{lof}{\contentsline {figure}{\numberline {5.5}{\ignorespaces (a) Top view of samples fabricated using spot melting strategy with varying beam current and beam ON time (b) Energy deposited (kJ) per layer of samples \relax }}{82}{figure.caption.78}}
\newlabel{fig:5_fabsample}{{5.5}{82}{(a) Top view of samples fabricated using spot melting strategy with varying beam current and beam ON time (b) Energy deposited (kJ) per layer of samples \relax }{figure.caption.78}{}}
\newlabel{fig:5_fabsample@cref}{{[figure][5][5]5.5}{82}}
\@writefile{toc}{\contentsline {subsection}{\numberline {5.4.3}Significance of Preheat Temperature}{83}{subsection.5.4.3}}
\@writefile{lof}{\contentsline {figure}{\numberline {5.6}{\ignorespaces EBSD: Inverse pole figure of samples (XZ plane) fabricated with beam current of \SI {20}{\milli \ampere }, beam ON time of \SI {1}{\milli \second } and focus offset coil current of (a) \SI {0}{\milli \ampere } (b) \SI {20}{\milli \ampere }. Grain aspect ratio of sample built with focus offset coil current of (c) \SI {0}{\milli \ampere } and (d) \SI {20}{\milli \ampere }\relax }}{84}{figure.caption.79}}
\newlabel{fig:5_beamdia}{{5.6}{84}{EBSD: Inverse pole figure of samples (XZ plane) fabricated with beam current of \SI {20}{\milli \ampere }, beam ON time of \SI {1}{\milli \second } and focus offset coil current of (a) \SI {0}{\milli \ampere } (b) \SI {20}{\milli \ampere }. Grain aspect ratio of sample built with focus offset coil current of (c) \SI {0}{\milli \ampere } and (d) \SI {20}{\milli \ampere }\relax }{figure.caption.79}{}}
\newlabel{fig:5_beamdia@cref}{{[figure][6][5]5.6}{84}}
\@writefile{lof}{\contentsline {figure}{\numberline {5.7}{\ignorespaces Melt pool of samples fabricated with beam current of (a) \SI {10}{\milli \ampere } (b) \SI {20}{\milli \ampere } with beam ON time of \SI {0.25}{\milli \second }\relax }}{85}{figure.caption.80}}
\newlabel{fig:5_meltpool}{{5.7}{85}{Melt pool of samples fabricated with beam current of (a) \SI {10}{\milli \ampere } (b) \SI {20}{\milli \ampere } with beam ON time of \SI {0.25}{\milli \second }\relax }{figure.caption.80}{}}
\newlabel{fig:5_meltpool@cref}{{[figure][7][5]5.7}{85}}
\@writefile{toc}{\contentsline {section}{\numberline {5.5}Summary}{85}{section.5.5}}
\@writefile{lof}{\contentsline {figure}{\numberline {5.8}{\ignorespaces EBSD: (a) Inverse pole figure of samples (XZ plane) fabricated with beam current of \SI {10}{\milli \ampere } and (b) \SI {20}{\milli \ampere } (c) Grain aspect ratio of sample built with \SI {10}{\milli \ampere } and (d) \SI {20}{\milli \ampere } with beam ON time of \SI {0.25}{\milli \second } \relax }}{86}{figure.caption.81}}
\newlabel{fig:5_preheat}{{5.8}{86}{EBSD: (a) Inverse pole figure of samples (XZ plane) fabricated with beam current of \SI {10}{\milli \ampere } and (b) \SI {20}{\milli \ampere } (c) Grain aspect ratio of sample built with \SI {10}{\milli \ampere } and (d) \SI {20}{\milli \ampere } with beam ON time of \SI {0.25}{\milli \second } \relax }{figure.caption.81}{}}
\newlabel{fig:5_preheat@cref}{{[figure][8][5]5.8}{86}}
\@setckpt{chapter-5}{
\setcounter{page}{88}
\setcounter{equation}{4}
\setcounter{enumi}{3}
\setcounter{enumii}{0}
\setcounter{enumiii}{0}
\setcounter{enumiv}{0}
\setcounter{footnote}{0}
\setcounter{mpfootnote}{0}
\setcounter{part}{0}
\setcounter{chapter}{5}
\setcounter{section}{5}
\setcounter{subsection}{0}
\setcounter{subsubsection}{0}
\setcounter{paragraph}{0}
\setcounter{subparagraph}{0}
\setcounter{figure}{8}
\setcounter{table}{3}
\setcounter{parentequation}{0}
\setcounter{Item}{3}
\setcounter{Hfootnote}{0}
\setcounter{bookmark@seq@number}{57}
\setcounter{theorem}{0}
\setcounter{corollary}{0}
\setcounter{lemma}{0}
\setcounter{lstnumber}{1}
\setcounter{float@type}{8}
\setcounter{tabx@nest}{0}
\setcounter{listtotal}{0}
\setcounter{listcount}{0}
\setcounter{liststart}{0}
\setcounter{liststop}{0}
\setcounter{citecount}{0}
\setcounter{citetotal}{0}
\setcounter{multicitecount}{0}
\setcounter{multicitetotal}{0}
\setcounter{instcount}{242}
\setcounter{maxnames}{3}
\setcounter{minnames}{1}
\setcounter{maxitems}{3}
\setcounter{minitems}{1}
\setcounter{citecounter}{0}
\setcounter{savedcitecounter}{0}
\setcounter{uniquelist}{0}
\setcounter{uniquename}{0}
\setcounter{refsection}{0}
\setcounter{refsegment}{0}
\setcounter{maxextratitle}{0}
\setcounter{maxextratitleyear}{0}
\setcounter{maxextrayear}{0}
\setcounter{maxextraalpha}{0}
\setcounter{abbrvpenalty}{5000}
\setcounter{highnamepenalty}{5000}
\setcounter{lownamepenalty}{2500}
\setcounter{maxparens}{3}
\setcounter{parenlevel}{0}
\setcounter{mincomprange}{10}
\setcounter{maxcomprange}{100000}
\setcounter{mincompwidth}{1}
\setcounter{afterword}{0}
\setcounter{savedafterword}{0}
\setcounter{annotator}{0}
\setcounter{savedannotator}{0}
\setcounter{author}{0}
\setcounter{savedauthor}{0}
\setcounter{bookauthor}{0}
\setcounter{savedbookauthor}{0}
\setcounter{commentator}{0}
\setcounter{savedcommentator}{0}
\setcounter{editor}{0}
\setcounter{savededitor}{0}
\setcounter{editora}{0}
\setcounter{savededitora}{0}
\setcounter{editorb}{0}
\setcounter{savededitorb}{0}
\setcounter{editorc}{0}
\setcounter{savededitorc}{0}
\setcounter{foreword}{0}
\setcounter{savedforeword}{0}
\setcounter{holder}{0}
\setcounter{savedholder}{0}
\setcounter{introduction}{0}
\setcounter{savedintroduction}{0}
\setcounter{namea}{0}
\setcounter{savednamea}{0}
\setcounter{nameb}{0}
\setcounter{savednameb}{0}
\setcounter{namec}{0}
\setcounter{savednamec}{0}
\setcounter{translator}{0}
\setcounter{savedtranslator}{0}
\setcounter{shortauthor}{0}
\setcounter{savedshortauthor}{0}
\setcounter{shorteditor}{0}
\setcounter{savedshorteditor}{0}
\setcounter{labelname}{0}
\setcounter{savedlabelname}{0}
\setcounter{institution}{0}
\setcounter{savedinstitution}{0}
\setcounter{lista}{0}
\setcounter{savedlista}{0}
\setcounter{listb}{0}
\setcounter{savedlistb}{0}
\setcounter{listc}{0}
\setcounter{savedlistc}{0}
\setcounter{listd}{0}
\setcounter{savedlistd}{0}
\setcounter{liste}{0}
\setcounter{savedliste}{0}
\setcounter{listf}{0}
\setcounter{savedlistf}{0}
\setcounter{location}{0}
\setcounter{savedlocation}{0}
\setcounter{organization}{0}
\setcounter{savedorganization}{0}
\setcounter{origlocation}{0}
\setcounter{savedoriglocation}{0}
\setcounter{origpublisher}{0}
\setcounter{savedorigpublisher}{0}
\setcounter{publisher}{0}
\setcounter{savedpublisher}{0}
\setcounter{language}{0}
\setcounter{savedlanguage}{0}
\setcounter{pageref}{0}
\setcounter{savedpageref}{0}
\setcounter{textcitecount}{0}
\setcounter{textcitetotal}{0}
\setcounter{textcitemaxnames}{0}
\setcounter{biburlnumpenalty}{0}
\setcounter{biburlucpenalty}{0}
\setcounter{biburllcpenalty}{0}
\setcounter{smartand}{1}
\setcounter{bbx:relatedcount}{0}
\setcounter{bbx:relatedtotal}{0}
\setcounter{ContinuedFloat}{0}
\setcounter{lips@count}{0}
\setcounter{r@tfl@t}{0}
\setcounter{MYtempeqncnt}{0}
\setcounter{KVtest}{0}
\setcounter{subfigure}{0}
\setcounter{subfigure@save}{0}
\setcounter{lofdepth}{1}
\setcounter{subtable}{0}
\setcounter{subtable@save}{0}
\setcounter{lotdepth}{1}
\setcounter{@stackindex}{0}
\setcounter{ROWcellindex@}{0}
\setcounter{section@level}{1}
\setcounter{lstlisting}{0}
}
