\relax 
\providecommand\hyper@newdestlabel[2]{}
\@writefile{toc}{\contentsline {chapter}{\numberline {4}Grain size and Primary Dendrite Arm Spacing control}{47}{chapter.4}}
\@writefile{lof}{\addvspace {10\p@ }}
\@writefile{lot}{\addvspace {10\p@ }}
\newlabel{ch:chapter_4}{{4}{47}{Grain size and Primary Dendrite Arm Spacing control}{chapter.4}{}}
\newlabel{ch:chapter_4@cref}{{[chapter][4][]4}{47}}
\@writefile{toc}{\contentsline {section}{\numberline {4.1}Influence of Grain Size on Mechanical Properties}{47}{section.4.1}}
\@writefile{lof}{\contentsline {figure}{\numberline {4.1}{\ignorespaces Types of raster melt-scan (a) unidirectional (b) bidirectional.\relax }}{48}{figure.caption.51}}
\newlabel{Raster}{{4.1}{48}{Types of raster melt-scan (a) unidirectional (b) bidirectional.\relax }{figure.caption.51}{}}
\newlabel{Raster@cref}{{[figure][1][4]4.1}{48}}
\@writefile{toc}{\contentsline {section}{\numberline {4.2}Melt-Scan Strategy}{48}{section.4.2}}
\newlabel{raster_melt}{{4.2}{48}{Melt-Scan Strategy}{section.4.2}{}}
\newlabel{raster_melt@cref}{{[section][2][4]4.2}{48}}
\@writefile{toc}{\contentsline {subsection}{\numberline {4.2.1}Conventional Melt Sequence}{48}{subsection.4.2.1}}
\@writefile{toc}{\contentsline {subsection}{\numberline {4.2.2}Proposed Melt Strategy}{49}{subsection.4.2.2}}
\@writefile{lof}{\contentsline {figure}{\numberline {4.2}{\ignorespaces Proposed Melt Scan Strategy (a) Partitioning of melt area into subdomains (b)Distribution of spots within one subdomain.\relax }}{50}{figure.caption.52}}
\newlabel{5spot}{{4.2}{50}{Proposed Melt Scan Strategy (a) Partitioning of melt area into subdomains (b)Distribution of spots within one subdomain.\relax }{figure.caption.52}{}}
\newlabel{5spot@cref}{{[figure][2][4]4.2}{50}}
\@writefile{toc}{\contentsline {section}{\numberline {4.3}Experimental Set up}{50}{section.4.3}}
\@writefile{lot}{\contentsline {table}{\numberline {4.1}{\ignorespaces Values of input parameters of proposed scan strategy\relax }}{51}{table.4.1}}
\newlabel{spot_param}{{4.1}{51}{Values of input parameters of proposed scan strategy\relax }{table.4.1}{}}
\newlabel{spot_param@cref}{{[table][1][4]4.1}{51}}
\@writefile{toc}{\contentsline {section}{\numberline {4.4}Results and Discussions}{51}{section.4.4}}
\@writefile{toc}{\contentsline {subsection}{\numberline {4.4.1}Melt pool shape}{51}{subsection.4.4.1}}
\@writefile{lof}{\contentsline {figure}{\numberline {4.3}{\ignorespaces Top view of fabricated samples with internal point offset of (1)\SI {200}{\micro \meter } (2)\SI {400}{\micro \meter } (3)\SI {600}{\micro \meter } (4)\SI {800}{\micro \meter }\relax }}{52}{figure.caption.53}}
\newlabel{4_sample}{{4.3}{52}{Top view of fabricated samples with internal point offset of (1)\SI {200}{\micro \meter } (2)\SI {400}{\micro \meter } (3)\SI {600}{\micro \meter } (4)\SI {800}{\micro \meter }\relax }{figure.caption.53}{}}
\newlabel{4_sample@cref}{{[figure][3][4]4.3}{52}}
\@writefile{lof}{\contentsline {figure}{\numberline {4.4}{\ignorespaces The top surface of fabricated samples showing the variation in met-pool shape as a function of internal point offset (1)\SI {200}{\micro \meter } (2)\SI {400}{\micro \meter } (3)\SI {600}{\micro \meter } (4)\SI {800}{\micro \meter }\relax }}{52}{figure.caption.54}}
\newlabel{4_meltpool}{{4.4}{52}{The top surface of fabricated samples showing the variation in met-pool shape as a function of internal point offset (1)\SI {200}{\micro \meter } (2)\SI {400}{\micro \meter } (3)\SI {600}{\micro \meter } (4)\SI {800}{\micro \meter }\relax }{figure.caption.54}{}}
\newlabel{4_meltpool@cref}{{[figure][4][4]4.4}{52}}
\@writefile{lof}{\contentsline {figure}{\numberline {4.5}{\ignorespaces Size and shape of the top surface of the simulated met-pool as a function of internal point offset (a)\SI {200}{\micro \meter } (b)\SI {400}{\micro \meter } (c)\SI {600}{\micro \meter } (d)\SI {800}{\micro \meter }\relax }}{53}{figure.caption.55}}
\newlabel{4_simmeltpool}{{4.5}{53}{Size and shape of the top surface of the simulated met-pool as a function of internal point offset (a)\SI {200}{\micro \meter } (b)\SI {400}{\micro \meter } (c)\SI {600}{\micro \meter } (d)\SI {800}{\micro \meter }\relax }{figure.caption.55}{}}
\newlabel{4_simmeltpool@cref}{{[figure][5][4]4.5}{53}}
\@writefile{lot}{\contentsline {table}{\numberline {4.2}{\ignorespaces Properties of IN718 used in analytical equations to predict PDAS \cite {lee2014effect}.\relax }}{54}{table.4.2}}
\newlabel{pdas}{{4.2}{54}{Properties of IN718 used in analytical equations to predict PDAS \cite {lee2014effect}.\relax }{table.4.2}{}}
\newlabel{pdas@cref}{{[table][2][4]4.2}{54}}
\@writefile{toc}{\contentsline {subsection}{\numberline {4.4.2}Variation in Primary Dendrite Arm Spacing}{54}{subsection.4.4.2}}
\@writefile{toc}{\contentsline {subsubsection}{Theory}{54}{section*.56}}
\newlabel{trivedi_eqn}{{4.1}{54}{Theory}{equation.4.4.1}{}}
\newlabel{trivedi_eqn@cref}{{[equation][1][4]4.1}{54}}
\newlabel{kurz_eqn}{{4.2}{54}{Theory}{equation.4.4.2}{}}
\newlabel{kurz_eqn@cref}{{[equation][2][4]4.2}{54}}
\newlabel{sim_trivedi_eqn}{{4.3}{55}{Theory}{equation.4.4.3}{}}
\newlabel{sim_trivedi_eqn@cref}{{[equation][3][4]4.3}{55}}
\newlabel{sim_kurz_eqn}{{4.4}{55}{Theory}{equation.4.4.4}{}}
\newlabel{sim_kurz_eqn@cref}{{[equation][4][4]4.4}{55}}
\@writefile{toc}{\contentsline {subsubsection}{Experimental Observation}{55}{section*.57}}
\@writefile{lof}{\contentsline {figure}{\numberline {4.6}{\ignorespaces Experimentally Measured Temperature Profile of the bottom of the substrate during the build.\relax }}{56}{figure.caption.58}}
\newlabel{4_temp}{{4.6}{56}{Experimentally Measured Temperature Profile of the bottom of the substrate during the build.\relax }{figure.caption.58}{}}
\newlabel{4_temp@cref}{{[figure][6][4]4.6}{56}}
\@writefile{lof}{\contentsline {figure}{\numberline {4.7}{\ignorespaces Experimentally Measured Temperature Profile during melting of the first layer.\relax }}{57}{figure.caption.59}}
\newlabel{fig:4_firstlayertemp}{{4.7}{57}{Experimentally Measured Temperature Profile during melting of the first layer.\relax }{figure.caption.59}{}}
\newlabel{fig:4_firstlayertemp@cref}{{[figure][7][4]4.7}{57}}
\@writefile{lof}{\contentsline {figure}{\numberline {4.8}{\ignorespaces Visible dendritic morphology on top layers ($\thicksim \SI {500}{\micro \meter }$) of the sample with internal point offset of \SI {200}{\micro \meter }.\relax }}{58}{figure.caption.60}}
\newlabel{4_dendrites}{{4.8}{58}{Visible dendritic morphology on top layers ($\thicksim \SI {500}{\micro \meter }$) of the sample with internal point offset of \SI {200}{\micro \meter }.\relax }{figure.caption.60}{}}
\newlabel{4_dendrites@cref}{{[figure][8][4]4.8}{58}}
\@writefile{toc}{\contentsline {subsubsection}{Numerical Prediction}{58}{section*.61}}
\@writefile{lof}{\contentsline {figure}{\numberline {4.9}{\ignorespaces Variation (along XZ plane of melt pool) of PDAS predicted by the (a) Trivedi and (b) Kurz-Fisher model.\relax }}{59}{figure.caption.62}}
\newlabel{4_pdas}{{4.9}{59}{Variation (along XZ plane of melt pool) of PDAS predicted by the (a) Trivedi and (b) Kurz-Fisher model.\relax }{figure.caption.62}{}}
\newlabel{4_pdas@cref}{{[figure][9][4]4.9}{59}}
\@writefile{lof}{\contentsline {figure}{\numberline {4.10}{\ignorespaces Variation of PDAS (Kurz-Fisher model) as a function of G and R on the reference solidification map for the internal point offset of \SI {200}{\micro \meter }.\relax }}{60}{figure.caption.63}}
\newlabel{4_pdasGR}{{4.10}{60}{Variation of PDAS (Kurz-Fisher model) as a function of G and R on the reference solidification map for the internal point offset of \SI {200}{\micro \meter }.\relax }{figure.caption.63}{}}
\newlabel{4_pdasGR@cref}{{[figure][10][4]4.10}{60}}
\@writefile{lof}{\contentsline {figure}{\numberline {4.11}{\ignorespaces Comparison of numerically predicted and experimentally measured PDAS.\relax }}{61}{figure.caption.64}}
\newlabel{4_pdascomp}{{4.11}{61}{Comparison of numerically predicted and experimentally measured PDAS.\relax }{figure.caption.64}{}}
\newlabel{4_pdascomp@cref}{{[figure][11][4]4.11}{61}}
\@writefile{toc}{\contentsline {subsection}{\numberline {4.4.3}Variation in Grain Size}{61}{subsection.4.4.3}}
\@writefile{toc}{\contentsline {subsubsection}{Theory}{61}{section*.65}}
\newlabel{nucleation_eqn_ch4}{{4.5}{62}{Theory}{equation.4.4.5}{}}
\newlabel{nucleation_eqn_ch4@cref}{{[equation][5][4]4.5}{62}}
\newlabel{derivednucleation_eqn_ch4}{{4.6}{63}{Theory}{equation.4.4.6}{}}
\newlabel{derivednucleation_eqn_ch4@cref}{{[equation][6][4]4.6}{63}}
\@writefile{toc}{\contentsline {subsubsection}{Experimental Observation}{63}{section*.66}}
\@writefile{lof}{\contentsline {figure}{\numberline {4.12}{\ignorespaces Variation in grain size and corresponding qualitative texture plot as a function of internal point offset.\relax }}{64}{figure.caption.67}}
\newlabel{4_grainsize}{{4.12}{64}{Variation in grain size and corresponding qualitative texture plot as a function of internal point offset.\relax }{figure.caption.67}{}}
\newlabel{4_grainsize@cref}{{[figure][12][4]4.12}{64}}
\@writefile{toc}{\contentsline {subsubsection}{Epitaxial Growth}{64}{section*.69}}
\@writefile{lof}{\contentsline {figure}{\numberline {4.13}{\ignorespaces Variation of experimentally measured grain size and area as a function of internal point offset in the proposed melt strategy.\relax }}{65}{figure.caption.68}}
\newlabel{4_quantitativegrainsize}{{4.13}{65}{Variation of experimentally measured grain size and area as a function of internal point offset in the proposed melt strategy.\relax }{figure.caption.68}{}}
\newlabel{4_quantitativegrainsize@cref}{{[figure][13][4]4.13}{65}}
\@writefile{lof}{\contentsline {figure}{\numberline {4.14}{\ignorespaces Distribution of dendritic growth direction of the bottom \SI {50}{\micro \meter } of the melt pool.\relax }}{66}{figure.caption.70}}
\newlabel{4_angle}{{4.14}{66}{Distribution of dendritic growth direction of the bottom \SI {50}{\micro \meter } of the melt pool.\relax }{figure.caption.70}{}}
\newlabel{4_angle@cref}{{[figure][14][4]4.14}{66}}
\newlabel{direction_eqn_ch4}{{4.7}{66}{Epitaxial Growth}{equation.4.4.7}{}}
\newlabel{direction_eqn_ch4@cref}{{[equation][7][4]4.7}{66}}
\@writefile{lof}{\contentsline {figure}{\numberline {4.15}{\ignorespaces Variation of cooling rate with respect to internal point offset.\relax }}{67}{figure.caption.72}}
\newlabel{4_coolingrate}{{4.15}{67}{Variation of cooling rate with respect to internal point offset.\relax }{figure.caption.72}{}}
\newlabel{4_coolingrate@cref}{{[figure][15][4]4.15}{67}}
\@writefile{toc}{\contentsline {subsubsection}{Heterogeneous Nucleation and Growth}{67}{section*.71}}
\newlabel{R001_eqn_ch4}{{4.8}{68}{Heterogeneous Nucleation and Growth}{equation.4.4.8}{}}
\newlabel{R001_eqn_ch4@cref}{{[equation][8][4]4.8}{68}}
\@writefile{lof}{\contentsline {figure}{\numberline {4.16}{\ignorespaces Evidence for heterogeneous nucleation by changing the scan strategy along the build direction.\relax }}{69}{figure.caption.73}}
\newlabel{4_nucleation}{{4.16}{69}{Evidence for heterogeneous nucleation by changing the scan strategy along the build direction.\relax }{figure.caption.73}{}}
\newlabel{4_nucleation@cref}{{[figure][16][4]4.16}{69}}
\@writefile{toc}{\contentsline {section}{\numberline {4.5}Summary}{71}{section.4.5}}
\@setckpt{chapter-4}{
\setcounter{page}{72}
\setcounter{equation}{8}
\setcounter{enumi}{3}
\setcounter{enumii}{0}
\setcounter{enumiii}{0}
\setcounter{enumiv}{0}
\setcounter{footnote}{0}
\setcounter{mpfootnote}{0}
\setcounter{part}{0}
\setcounter{chapter}{4}
\setcounter{section}{5}
\setcounter{subsection}{0}
\setcounter{subsubsection}{0}
\setcounter{paragraph}{0}
\setcounter{subparagraph}{0}
\setcounter{figure}{16}
\setcounter{table}{2}
\setcounter{parentequation}{0}
\setcounter{Item}{3}
\setcounter{Hfootnote}{0}
\setcounter{bookmark@seq@number}{45}
\setcounter{theorem}{0}
\setcounter{corollary}{0}
\setcounter{lemma}{0}
\setcounter{lstnumber}{1}
\setcounter{float@type}{8}
\setcounter{tabx@nest}{0}
\setcounter{listtotal}{0}
\setcounter{listcount}{0}
\setcounter{liststart}{0}
\setcounter{liststop}{0}
\setcounter{citecount}{0}
\setcounter{citetotal}{0}
\setcounter{multicitecount}{0}
\setcounter{multicitetotal}{0}
\setcounter{instcount}{219}
\setcounter{maxnames}{3}
\setcounter{minnames}{1}
\setcounter{maxitems}{3}
\setcounter{minitems}{1}
\setcounter{citecounter}{0}
\setcounter{savedcitecounter}{0}
\setcounter{uniquelist}{0}
\setcounter{uniquename}{0}
\setcounter{refsection}{0}
\setcounter{refsegment}{0}
\setcounter{maxextratitle}{0}
\setcounter{maxextratitleyear}{0}
\setcounter{maxextrayear}{0}
\setcounter{maxextraalpha}{0}
\setcounter{abbrvpenalty}{5000}
\setcounter{highnamepenalty}{5000}
\setcounter{lownamepenalty}{2500}
\setcounter{maxparens}{3}
\setcounter{parenlevel}{0}
\setcounter{mincomprange}{10}
\setcounter{maxcomprange}{100000}
\setcounter{mincompwidth}{1}
\setcounter{afterword}{0}
\setcounter{savedafterword}{0}
\setcounter{annotator}{0}
\setcounter{savedannotator}{0}
\setcounter{author}{0}
\setcounter{savedauthor}{0}
\setcounter{bookauthor}{0}
\setcounter{savedbookauthor}{0}
\setcounter{commentator}{0}
\setcounter{savedcommentator}{0}
\setcounter{editor}{0}
\setcounter{savededitor}{0}
\setcounter{editora}{0}
\setcounter{savededitora}{0}
\setcounter{editorb}{0}
\setcounter{savededitorb}{0}
\setcounter{editorc}{0}
\setcounter{savededitorc}{0}
\setcounter{foreword}{0}
\setcounter{savedforeword}{0}
\setcounter{holder}{0}
\setcounter{savedholder}{0}
\setcounter{introduction}{0}
\setcounter{savedintroduction}{0}
\setcounter{namea}{0}
\setcounter{savednamea}{0}
\setcounter{nameb}{0}
\setcounter{savednameb}{0}
\setcounter{namec}{0}
\setcounter{savednamec}{0}
\setcounter{translator}{0}
\setcounter{savedtranslator}{0}
\setcounter{shortauthor}{0}
\setcounter{savedshortauthor}{0}
\setcounter{shorteditor}{0}
\setcounter{savedshorteditor}{0}
\setcounter{labelname}{0}
\setcounter{savedlabelname}{0}
\setcounter{institution}{0}
\setcounter{savedinstitution}{0}
\setcounter{lista}{0}
\setcounter{savedlista}{0}
\setcounter{listb}{0}
\setcounter{savedlistb}{0}
\setcounter{listc}{0}
\setcounter{savedlistc}{0}
\setcounter{listd}{0}
\setcounter{savedlistd}{0}
\setcounter{liste}{0}
\setcounter{savedliste}{0}
\setcounter{listf}{0}
\setcounter{savedlistf}{0}
\setcounter{location}{0}
\setcounter{savedlocation}{0}
\setcounter{organization}{0}
\setcounter{savedorganization}{0}
\setcounter{origlocation}{0}
\setcounter{savedoriglocation}{0}
\setcounter{origpublisher}{0}
\setcounter{savedorigpublisher}{0}
\setcounter{publisher}{0}
\setcounter{savedpublisher}{0}
\setcounter{language}{0}
\setcounter{savedlanguage}{0}
\setcounter{pageref}{0}
\setcounter{savedpageref}{0}
\setcounter{textcitecount}{0}
\setcounter{textcitetotal}{0}
\setcounter{textcitemaxnames}{0}
\setcounter{biburlnumpenalty}{0}
\setcounter{biburlucpenalty}{0}
\setcounter{biburllcpenalty}{0}
\setcounter{smartand}{1}
\setcounter{bbx:relatedcount}{0}
\setcounter{bbx:relatedtotal}{0}
\setcounter{ContinuedFloat}{0}
\setcounter{lips@count}{0}
\setcounter{r@tfl@t}{0}
\setcounter{MYtempeqncnt}{0}
\setcounter{KVtest}{0}
\setcounter{subfigure}{0}
\setcounter{subfigure@save}{0}
\setcounter{lofdepth}{1}
\setcounter{subtable}{0}
\setcounter{subtable@save}{0}
\setcounter{lotdepth}{1}
\setcounter{@stackindex}{0}
\setcounter{ROWcellindex@}{0}
\setcounter{section@level}{1}
\setcounter{lstlisting}{0}
}
