[1] Config.pm:354> INFO - This is Biber 2.7
[2] Config.pm:357> INFO - Logfile is 'references.blg'
[152] biber-MSWIN64:303> INFO - === 
[1718] Utils.pm:180> ERROR - Cannot find control file 'references.bcf'! - did you pass the "backend=biber" option to BibLaTeX?
[1719] Biber.pm:113> INFO - ERRORS: 1
