0 0 1.58 150
0.625 0 1.58 150
0.625 0.625 1.58 150
0 0.625 1.58 150
0 1.25 1.58 150
0.625 1.25 1.58 150
1.25 1.25 1.58 150
1.25 0.625 1.58 150
1.25 0 1.58 150
1.875 0 1.58 150
1.875 0.625 1.58 150
2.5 0.625 1.58 150
2.5 0 1.58 150
3.125 0 1.58 150
3.125 0.625 1.58 150
3.125 1.25 1.58 150
2.5 1.25 1.58 150
1.875 1.25 1.58 150
1.875 1.875 1.58 150
1.875 2.5 1.58 150
2.5 2.5 1.58 150
2.5 1.875 1.58 150
3.125 1.875 1.58 150
3.125 2.5 1.58 150
3.125 3.125 1.58 150
2.5 3.125 1.58 150
1.875 3.125 1.58 150
1.25 3.125 1.58 150
0.625 3.125 1.58 150
0.625 2.5 1.58 150
1.25 2.5 1.58 150
1.25 1.875 1.58 150
0.625 1.875 1.58 150
0 1.875 1.58 150
0 2.5 1.58 150
0 3.125 1.58 150
0 3.75 1.58 150
0.625 3.75 1.58 150
0.625 4.375 1.58 150
0 4.375 1.58 150
0 5 1.58 150
0.625 5 1.58 150
1.25 5 1.58 150
1.25 4.375 1.58 150
1.25 3.75 1.58 150
1.875 3.75 1.58 150
2.5 3.75 1.58 150
2.5 4.375 1.58 150
1.875 4.375 1.58 150
1.875 5 1.58 150
2.5 5 1.58 150
3.125 5 1.58 150
3.125 4.375 1.58 150
3.125 3.75 1.58 150
3.75 3.75 1.58 150
4.375 3.75 1.58 150
4.375 4.375 1.58 150
3.75 4.375 1.58 150
3.75 5 1.58 150
4.375 5 1.58 150
5 5 1.58 150
5 4.375 1.58 150
5 3.75 1.58 150
5 3.125 1.58 150
5 2.5 1.58 150
4.375 2.5 1.58 150
4.375 3.125 1.58 150
3.75 3.125 1.58 150
3.75 2.5 1.58 150
3.75 1.875 1.58 150
4.375 1.875 1.58 150
5 1.875 1.58 150
5 1.25 1.58 150
5 0.625 1.58 150
4.375 0.625 1.58 150
4.375 1.25 1.58 150
3.75 1.25 1.58 150
3.75 0.625 1.58 150
3.75 0 1.58 150
4.375 0 1.58 150
5 0 1.58 150
