module knative.dev/serving

go 1.16

require (
	github.com/Azure/azure-sdk-for-go v50.2.0+incompatible // indirect
	github.com/Azure/go-autorest/autorest v0.11.17 // indirect
	github.com/Azure/go-autorest/autorest/adal v0.9.10 // indirect
	github.com/Azure/go-autorest/autorest/to v0.4.0 // indirect
	github.com/Azure/go-autorest/autorest/validation v0.3.1 // indirect
	github.com/ahmetb/gen-crd-api-reference-docs v0.3.1-0.20210609063737-0067dc6dcea2
	github.com/aws/aws-sdk-go v1.37.1 // indirect
	github.com/davecgh/go-spew v1.1.1
	github.com/emicklei/go-restful v2.15.0+incompatible // indirect
	github.com/go-openapi/spec v0.20.2 // indirect
	github.com/gogo/protobuf v1.3.2
	github.com/google/go-cmp v0.5.6
	github.com/google/go-containerregistry v0.6.0
	github.com/google/go-containerregistry/pkg/authn/k8schain v0.0.0-20210624211700-ce35c99b3faf
	github.com/google/gofuzz v1.2.0
	github.com/google/mako v0.0.0-20190821191249-122f8dcef9e3
	github.com/googleapis/gnostic v0.5.3 // indirect
	github.com/gorilla/websocket v1.4.2
	github.com/hashicorp/golang-lru v0.5.4
	github.com/kelseyhightower/envconfig v1.4.0
	github.com/prometheus/client_golang v1.11.0
	github.com/prometheus/client_model v0.2.0
	github.com/tsenart/vegeta/v12 v12.8.4
	go.opencensus.io v0.23.0
	go.uber.org/atomic v1.9.0
	go.uber.org/automaxprocs v1.4.0
	go.uber.org/goleak v1.1.11-0.20210813005559-691160354723
	go.uber.org/zap v1.19.1
	golang.org/x/net v0.0.0-20210928044308-7d9f5e0b762b
	golang.org/x/oauth2 v0.0.0-20210819190943-2bc19b11175f
	golang.org/x/sync v0.0.0-20210220032951-036812b2e83c
	golang.org/x/time v0.0.0-20210723032227-1f47c861a9ac
	gonum.org/v1/gonum v0.0.0-20190331200053-3d26580ed485 // indirect
	google.golang.org/api v0.58.0
	google.golang.org/grpc v1.41.0
	gopkg.in/check.v1 v1.0.0-20200902074654-038fdea0a05b // indirect
	k8s.io/api v0.21.4
	k8s.io/apimachinery v0.21.4
	k8s.io/client-go v0.21.4
	k8s.io/code-generator v0.21.4
	k8s.io/kube-openapi v0.0.0-20210305001622-591a79e4bda7
	k8s.io/utils v0.0.0-20210111153108-fddb29f9d009 // indirect
	knative.dev/caching v0.0.0-20210923061712-f2ac32bda031
	knative.dev/hack v0.0.0-20210806075220-815cd312d65c
	knative.dev/networking v0.0.0-20210929003422-f9355c551dbe
	knative.dev/pkg v0.0.0-20210929111822-2267a4cbebb8
	sigs.k8s.io/yaml v1.3.0
)
