{
  "annotations": {
    "list": [
      {
        "builtIn": 1,
        "datasource": "-- Grafana --",
        "enable": true,
        "hide": true,
        "iconColor": "rgba(0, 211, 255, 1)",
        "name": "Annotations & Alerts",
        "target": {
          "limit": 100,
          "matchAny": false,
          "tags": [],
          "type": "dashboard"
        },
        "type": "dashboard"
      }
    ]
  },
  "description": "Physical servers status based on glances data",
  "editable": true,
  "fiscalYearStartMonth": 0,
  "gnetId": null,
  "graphTooltip": 0,
  "id": 2,
  "iteration": 1646132596803,
  "links": [],
  "liveNow": false,
  "panels": [
    {
      "cacheTimeout": null,
      "datasource": "Glances",
      "fieldConfig": {
        "defaults": {
          "color": {
            "mode": "thresholds"
          },
          "mappings": [
            {
              "options": {
                "match": "null",
                "result": {
                  "text": "N/A"
                }
              },
              "type": "special"
            }
          ],
          "thresholds": {
            "mode": "absolute",
            "steps": [
              {
                "color": "green",
                "value": null
              },
              {
                "color": "red",
                "value": 80
              }
            ]
          },
          "unit": "none"
        },
        "overrides": []
      },
      "gridPos": {
        "h": 6,
        "w": 2,
        "x": 0,
        "y": 0
      },
      "id": 5,
      "interval": null,
      "links": [],
      "maxDataPoints": 100,
      "options": {
        "colorMode": "none",
        "graphMode": "none",
        "justifyMode": "auto",
        "orientation": "horizontal",
        "reduceOptions": {
          "calcs": [
            "mean"
          ],
          "fields": "",
          "values": false
        },
        "text": {},
        "textMode": "auto"
      },
      "pluginVersion": "8.2.5",
      "targets": [
        {
          "column": "cpucore",
          "dsType": "influxdb",
          "function": "mean",
          "groupBy": [
            {
              "params": [
                "auto"
              ],
              "type": "time"
            }
          ],
          "measurement": "load",
          "orderByTime": "ASC",
          "policy": "default",
          "query": "SELECT mean(\"cpucore\") FROM \"$host.load\" WHERE $timeFilter GROUP BY time($interval)",
          "refId": "A",
          "resultFormat": "time_series",
          "select": [
            [
              {
                "params": [
                  "cpucore"
                ],
                "type": "field"
              },
              {
                "params": [],
                "type": "max"
              }
            ]
          ],
          "series": "load",
          "tags": [
            {
              "key": "hostname",
              "operator": "=~",
              "value": "/^$host$/"
            }
          ]
        }
      ],
      "title": "Core",
      "type": "stat"
    },
    {
      "aliasColors": {},
      "annotate": {
        "enable": false
      },
      "bars": false,
      "dashLength": 10,
      "dashes": false,
      "datasource": "Glances",
      "fill": 1,
      "fillGradient": 0,
      "grid": {
        "max": null,
        "min": null
      },
      "gridPos": {
        "h": 6,
        "w": 20,
        "x": 2,
        "y": 0
      },
      "hiddenSeries": false,
      "id": 4,
      "interactive": true,
      "legend": {
        "alignAsTable": true,
        "avg": true,
        "current": false,
        "max": true,
        "min": true,
        "rightSide": true,
        "show": true,
        "total": false,
        "values": true
      },
      "legend_counts": true,
      "lines": true,
      "linewidth": 2,
      "links": [],
      "nullPointMode": "null",
      "options": {
        "alertThreshold": true
      },
      "percentage": false,
      "pluginVersion": "8.2.5",
      "pointradius": 5,
      "points": false,
      "renderer": "flot",
      "resolution": 100,
      "scale": 1,
      "seriesOverrides": [],
      "spaceLength": 10,
      "spyable": true,
      "stack": true,
      "steppedLine": false,
      "targets": [
        {
          "alias": "1min",
          "column": "min1",
          "dsType": "influxdb",
          "function": "mean",
          "groupBy": [
            {
              "params": [
                "auto"
              ],
              "type": "time"
            },
            {
              "params": [
                "none"
              ],
              "type": "fill"
            }
          ],
          "measurement": "load",
          "orderByTime": "ASC",
          "policy": "default",
          "query": "SELECT mean(\"min1\") FROM \"$host.load\" WHERE $timeFilter GROUP BY time($interval) fill(null)",
          "refId": "A",
          "resultFormat": "time_series",
          "select": [
            [
              {
                "params": [
                  "min1"
                ],
                "type": "field"
              },
              {
                "params": [],
                "type": "mean"
              }
            ]
          ],
          "series": "load",
          "tags": [
            {
              "key": "hostname",
              "operator": "=~",
              "value": "/^$host$/"
            }
          ],
          "target": "randomWalk('random walk')"
        },
        {
          "alias": "5mins",
          "column": "min5",
          "dsType": "influxdb",
          "function": "mean",
          "groupBy": [
            {
              "params": [
                "auto"
              ],
              "type": "time"
            },
            {
              "params": [
                "none"
              ],
              "type": "fill"
            }
          ],
          "measurement": "load",
          "orderByTime": "ASC",
          "policy": "default",
          "query": "SELECT mean(\"min5\") FROM \"$host.load\" WHERE $timeFilter GROUP BY time($interval) fill(null)",
          "refId": "B",
          "resultFormat": "time_series",
          "select": [
            [
              {
                "params": [
                  "min5"
                ],
                "type": "field"
              },
              {
                "params": [],
                "type": "mean"
              }
            ]
          ],
          "series": "load",
          "tags": [
            {
              "key": "hostname",
              "operator": "=~",
              "value": "/^$host$/"
            }
          ],
          "target": ""
        },
        {
          "alias": "15mins",
          "column": "min15",
          "dsType": "influxdb",
          "function": "mean",
          "groupBy": [
            {
              "params": [
                "auto"
              ],
              "type": "time"
            },
            {
              "params": [
                "none"
              ],
              "type": "fill"
            }
          ],
          "measurement": "load",
          "orderByTime": "ASC",
          "policy": "default",
          "query": "SELECT mean(\"min15\") FROM \"$host.load\" WHERE $timeFilter GROUP BY time($interval) fill(null)",
          "refId": "C",
          "resultFormat": "time_series",
          "select": [
            [
              {
                "params": [
                  "min15"
                ],
                "type": "field"
              },
              {
                "params": [],
                "type": "mean"
              }
            ]
          ],
          "series": "load",
          "tags": [
            {
              "key": "hostname",
              "operator": "=~",
              "value": "/^$host$/"
            }
          ],
          "target": ""
        }
      ],
      "thresholds": [],
      "timeFrom": null,
      "timeRegions": [],
      "timeShift": null,
      "timezone": "browser",
      "title": "Load",
      "tooltip": {
        "query_as_alias": true,
        "shared": false,
        "sort": 0,
        "value_type": "cumulative"
      },
      "type": "graph",
      "xaxis": {
        "buckets": null,
        "mode": "time",
        "name": null,
        "show": true,
        "values": []
      },
      "yaxes": [
        {
          "format": "short",
          "logBase": 1,
          "max": null,
          "min": null,
          "show": true
        },
        {
          "format": "short",
          "logBase": 1,
          "max": null,
          "min": null,
          "show": true
        }
      ],
      "yaxis": {
        "align": false,
        "alignLevel": null
      }
    },
    {
      "cacheTimeout": null,
      "datasource": "Glances",
      "fieldConfig": {
        "defaults": {
          "color": {
            "fixedColor": "rgb(31, 120, 193)",
            "mode": "fixed"
          },
          "mappings": [
            {
              "options": {
                "match": "null",
                "result": {
                  "text": "N/A"
                }
              },
              "type": "special"
            }
          ],
          "thresholds": {
            "mode": "absolute",
            "steps": [
              {
                "color": "green",
                "value": null
              },
              {
                "color": "red",
                "value": 80
              }
            ]
          },
          "unit": "none"
        },
        "overrides": []
      },
      "gridPos": {
        "h": 6,
        "w": 2,
        "x": 22,
        "y": 0
      },
      "id": 18,
      "interval": null,
      "links": [],
      "maxDataPoints": 100,
      "options": {
        "colorMode": "none",
        "graphMode": "area",
        "justifyMode": "auto",
        "orientation": "horizontal",
        "reduceOptions": {
          "calcs": [
            "mean"
          ],
          "fields": "",
          "values": false
        },
        "text": {},
        "textMode": "auto"
      },
      "pluginVersion": "8.2.5",
      "targets": [
        {
          "column": "total",
          "dsType": "influxdb",
          "function": "mean",
          "groupBy": [
            {
              "params": [
                "$__interval"
              ],
              "type": "time"
            }
          ],
          "measurement": "processcount",
          "orderByTime": "ASC",
          "policy": "default",
          "query": "SELECT mean(\"total\") FROM \"$host.processcount\" WHERE $timeFilter GROUP BY time($interval)",
          "refId": "A",
          "resultFormat": "time_series",
          "select": [
            [
              {
                "params": [
                  "total"
                ],
                "type": "field"
              },
              {
                "params": [],
                "type": "last"
              }
            ]
          ],
          "series": "processcount",
          "tags": [
            {
              "key": "hostname",
              "operator": "=~",
              "value": "/^$host$/"
            }
          ]
        }
      ],
      "title": "Processes",
      "type": "stat"
    },
    {
      "aliasColors": {},
      "bars": false,
      "dashLength": 10,
      "dashes": false,
      "datasource": "Glances",
      "editable": true,
      "error": false,
      "fill": 0,
      "fillGradient": 0,
      "grid": {},
      "gridPos": {
        "h": 7,
        "w": 12,
        "x": 0,
        "y": 6
      },
      "hiddenSeries": false,
      "id": 6,
      "legend": {
        "avg": true,
        "current": false,
        "max": true,
        "min": true,
        "rightSide": false,
        "show": true,
        "total": false,
        "values": false
      },
      "lines": true,
      "linewidth": 1,
      "links": [],
      "nullPointMode": "null",
      "options": {
        "alertThreshold": true
      },
      "percentage": false,
      "pluginVersion": "8.2.5",
      "pointradius": 5,
      "points": false,
      "renderer": "flot",
      "seriesOverrides": [],
      "spaceLength": 10,
      "stack": false,
      "steppedLine": false,
      "targets": [
        {
          "alias": "User",
          "column": "user",
          "dsType": "influxdb",
          "function": "mean",
          "groupBy": [
            {
              "params": [
                "auto"
              ],
              "type": "time"
            },
            {
              "params": [
                "none"
              ],
              "type": "fill"
            }
          ],
          "measurement": "cpu",
          "orderByTime": "ASC",
          "policy": "default",
          "query": "SELECT mean(\"user\") FROM \"$host.cpu\" WHERE $timeFilter GROUP BY time($interval) fill(null)",
          "refId": "A",
          "resultFormat": "time_series",
          "select": [
            [
              {
                "params": [
                  "user"
                ],
                "type": "field"
              },
              {
                "params": [],
                "type": "mean"
              }
            ]
          ],
          "series": "cpu",
          "tags": [
            {
              "key": "hostname",
              "operator": "=~",
              "value": "/^$host$/"
            }
          ]
        },
        {
          "alias": "System",
          "column": "system",
          "dsType": "influxdb",
          "function": "mean",
          "groupBy": [
            {
              "params": [
                "auto"
              ],
              "type": "time"
            },
            {
              "params": [
                "none"
              ],
              "type": "fill"
            }
          ],
          "measurement": "cpu",
          "orderByTime": "ASC",
          "policy": "default",
          "query": "SELECT mean(\"system\") FROM \"$host.cpu\" WHERE $timeFilter GROUP BY time($interval) fill(null)",
          "refId": "B",
          "resultFormat": "time_series",
          "select": [
            [
              {
                "params": [
                  "system"
                ],
                "type": "field"
              },
              {
                "params": [],
                "type": "mean"
              }
            ]
          ],
          "series": "cpu",
          "tags": [
            {
              "key": "hostname",
              "operator": "=~",
              "value": "/^$host$/"
            }
          ],
          "target": ""
        },
        {
          "alias": "IoWait",
          "column": "iowait",
          "dsType": "influxdb",
          "function": "mean",
          "groupBy": [
            {
              "params": [
                "auto"
              ],
              "type": "time"
            },
            {
              "params": [
                "none"
              ],
              "type": "fill"
            }
          ],
          "measurement": "cpu",
          "orderByTime": "ASC",
          "policy": "default",
          "query": "SELECT mean(\"iowait\") FROM \"$host.cpu\" WHERE $timeFilter GROUP BY time($interval) fill(null)",
          "refId": "C",
          "resultFormat": "time_series",
          "select": [
            [
              {
                "params": [
                  "iowait"
                ],
                "type": "field"
              },
              {
                "params": [],
                "type": "mean"
              }
            ]
          ],
          "series": "cpu",
          "tags": [
            {
              "key": "hostname",
              "operator": "=~",
              "value": "/^$host$/"
            }
          ],
          "target": ""
        }
      ],
      "thresholds": [],
      "timeFrom": null,
      "timeRegions": [],
      "timeShift": null,
      "title": "CPU (%)",
      "tooltip": {
        "shared": false,
        "sort": 0,
        "value_type": "cumulative"
      },
      "type": "graph",
      "xaxis": {
        "buckets": null,
        "mode": "time",
        "name": null,
        "show": true,
        "values": []
      },
      "yaxes": [
        {
          "format": "percent",
          "logBase": 1,
          "max": null,
          "min": null,
          "show": true
        },
        {
          "format": "short",
          "logBase": 1,
          "max": null,
          "min": null,
          "show": true
        }
      ],
      "yaxis": {
        "align": false,
        "alignLevel": null
      }
    },
    {
      "aliasColors": {
        "Max": "#BF1B00"
      },
      "bars": false,
      "dashLength": 10,
      "dashes": false,
      "datasource": "Glances",
      "editable": true,
      "error": false,
      "fill": 0,
      "fillGradient": 0,
      "grid": {},
      "gridPos": {
        "h": 7,
        "w": 12,
        "x": 12,
        "y": 6
      },
      "hiddenSeries": false,
      "id": 7,
      "legend": {
        "avg": false,
        "current": false,
        "max": false,
        "min": false,
        "show": true,
        "total": false,
        "values": false
      },
      "lines": true,
      "linewidth": 1,
      "links": [],
      "nullPointMode": "null",
      "options": {
        "alertThreshold": true
      },
      "percentage": false,
      "pluginVersion": "8.2.5",
      "pointradius": 5,
      "points": false,
      "renderer": "flot",
      "seriesOverrides": [],
      "spaceLength": 10,
      "stack": false,
      "steppedLine": false,
      "targets": [
        {
          "alias": "Used",
          "column": "used",
          "dsType": "influxdb",
          "function": "mean",
          "groupBy": [
            {
              "params": [
                "$__interval"
              ],
              "type": "time"
            },
            {
              "params": [
                "none"
              ],
              "type": "fill"
            }
          ],
          "measurement": "mem",
          "orderByTime": "ASC",
          "policy": "default",
          "query": "SELECT mean(\"used\") FROM \"mem\" WHERE (\"hostname\" =~ /^$host$/) AND $timeFilter GROUP BY time($__interval) fill(none)",
          "rawQuery": false,
          "refId": "A",
          "resultFormat": "time_series",
          "select": [
            [
              {
                "params": [
                  "used"
                ],
                "type": "field"
              },
              {
                "params": [],
                "type": "mean"
              }
            ]
          ],
          "series": "mem",
          "tags": [
            {
              "key": "hostname",
              "operator": "=~",
              "value": "/^$host$/"
            }
          ]
        },
        {
          "alias": "Max",
          "column": "total",
          "dsType": "influxdb",
          "function": "mean",
          "groupBy": [
            {
              "params": [
                "$__interval"
              ],
              "type": "time"
            },
            {
              "params": [
                "none"
              ],
              "type": "fill"
            }
          ],
          "measurement": "mem",
          "orderByTime": "ASC",
          "policy": "default",
          "query": "SELECT mean(\"total\") FROM \"mem\" WHERE $timeFilter GROUP BY time($__interval) fill(none)",
          "rawQuery": false,
          "refId": "B",
          "resultFormat": "time_series",
          "select": [
            [
              {
                "params": [
                  "total"
                ],
                "type": "field"
              },
              {
                "params": [],
                "type": "mean"
              }
            ]
          ],
          "series": "mem",
          "tags": [
            {
              "key": "hostname",
              "operator": "=~",
              "value": "/^$host$/"
            }
          ],
          "target": ""
        }
      ],
      "thresholds": [],
      "timeFrom": null,
      "timeRegions": [],
      "timeShift": null,
      "title": "MEM",
      "tooltip": {
        "shared": false,
        "sort": 0,
        "value_type": "cumulative"
      },
      "type": "graph",
      "xaxis": {
        "buckets": null,
        "mode": "time",
        "name": null,
        "show": true,
        "values": []
      },
      "yaxes": [
        {
          "$$hashKey": "object:2371",
          "format": "bytes",
          "logBase": 1,
          "max": null,
          "min": "0",
          "show": true
        },
        {
          "$$hashKey": "object:2372",
          "format": "short",
          "logBase": 1,
          "max": null,
          "min": null,
          "show": true
        }
      ],
      "yaxis": {
        "align": false,
        "alignLevel": null
      }
    },
    {
      "aliasColors": {},
      "bars": false,
      "dashLength": 10,
      "dashes": false,
      "datasource": "Glances",
      "editable": true,
      "error": false,
      "fill": 3,
      "fillGradient": 0,
      "grid": {},
      "gridPos": {
        "h": 7,
        "w": 12,
        "x": 0,
        "y": 13
      },
      "hiddenSeries": false,
      "id": 9,
      "legend": {
        "avg": true,
        "current": false,
        "max": true,
        "min": true,
        "show": true,
        "total": false,
        "values": true
      },
      "lines": true,
      "linewidth": 1,
      "links": [],
      "nullPointMode": "null",
      "options": {
        "alertThreshold": true
      },
      "percentage": false,
      "pluginVersion": "8.2.5",
      "pointradius": 5,
      "points": false,
      "renderer": "flot",
      "seriesOverrides": [
        {
          "alias": "Tx",
          "yaxis": 1
        }
      ],
      "spaceLength": 10,
      "stack": false,
      "steppedLine": false,
      "targets": [
        {
          "alias": "In",
          "column": "enp0s25.rx",
          "dsType": "influxdb",
          "function": "mean",
          "groupBy": [
            {
              "params": [
                "auto"
              ],
              "type": "time"
            },
            {
              "params": [
                "null"
              ],
              "type": "fill"
            }
          ],
          "interval": "",
          "measurement": "$host.network",
          "orderByTime": "ASC",
          "policy": "default",
          "query": "SELECT mean(\"rx\")/mean(\"time_since_update\")*8 FROM \"network\" WHERE (\"hostname\" =~ /^$host$/) AND (\"interface_name\" =~ /^$interface$/) AND $timeFilter GROUP BY time($interval) fill(none)",
          "rawQuery": true,
          "refId": "A",
          "resultFormat": "time_series",
          "select": [
            [
              {
                "params": [
                  "eth0.rx"
                ],
                "type": "field"
              },
              {
                "params": [],
                "type": "mean"
              }
            ]
          ],
          "series": "network",
          "tags": []
        },
        {
          "alias": "Out",
          "column": "eth0.tx*-1",
          "dsType": "influxdb",
          "function": "mean",
          "groupBy": [
            {
              "params": [
                "auto"
              ],
              "type": "time"
            },
            {
              "params": [
                "null"
              ],
              "type": "fill"
            }
          ],
          "measurement": "$host.network",
          "orderByTime": "ASC",
          "policy": "default",
          "query": "SELECT mean(\"tx\")/mean(\"time_since_update\")*-8 FROM \"network\" WHERE (\"hostname\" =~ /^$host$/) AND (\"interface_name\" =~ /^$interface$/) AND $timeFilter GROUP BY time($interval) fill(none)",
          "rawQuery": true,
          "refId": "B",
          "resultFormat": "time_series",
          "select": [
            [
              {
                "params": [
                  "eth0.tx"
                ],
                "type": "field"
              },
              {
                "params": [],
                "type": "mean"
              }
            ]
          ],
          "series": "network",
          "tags": [],
          "target": ""
        }
      ],
      "thresholds": [],
      "timeFrom": null,
      "timeRegions": [],
      "timeShift": null,
      "title": "$interface network interface",
      "tooltip": {
        "shared": false,
        "sort": 0,
        "value_type": "cumulative"
      },
      "type": "graph",
      "xaxis": {
        "buckets": null,
        "mode": "time",
        "name": null,
        "show": true,
        "values": []
      },
      "yaxes": [
        {
          "$$hashKey": "object:2467",
          "format": "bps",
          "logBase": 1,
          "max": null,
          "min": null,
          "show": true
        },
        {
          "$$hashKey": "object:2468",
          "format": "short",
          "logBase": 1,
          "max": null,
          "min": null,
          "show": true
        }
      ],
      "yaxis": {
        "align": false,
        "alignLevel": null
      }
    },
    {
      "aliasColors": {
        "Max": "#BF1B00"
      },
      "bars": false,
      "dashLength": 10,
      "dashes": false,
      "datasource": "Glances",
      "editable": true,
      "error": false,
      "fill": 0,
      "fillGradient": 0,
      "grid": {},
      "gridPos": {
        "h": 7,
        "w": 12,
        "x": 12,
        "y": 13
      },
      "hiddenSeries": false,
      "id": 8,
      "legend": {
        "avg": false,
        "current": false,
        "max": false,
        "min": false,
        "show": true,
        "total": false,
        "values": false
      },
      "lines": true,
      "linewidth": 1,
      "links": [],
      "nullPointMode": "null",
      "options": {
        "alertThreshold": true
      },
      "percentage": false,
      "pluginVersion": "8.2.5",
      "pointradius": 5,
      "points": false,
      "renderer": "flot",
      "seriesOverrides": [],
      "spaceLength": 10,
      "stack": false,
      "steppedLine": false,
      "targets": [
        {
          "alias": "Used",
          "column": "used",
          "dsType": "influxdb",
          "function": "mean",
          "groupBy": [
            {
              "params": [
                "$__interval"
              ],
              "type": "time"
            }
          ],
          "measurement": "$host.memswap",
          "orderByTime": "ASC",
          "policy": "default",
          "query": "SELECT mean(\"used\") FROM \"memswap\" WHERE (\"hostname\" =~ /^$host$/) AND $timeFilter GROUP BY time($__interval) fill(none)",
          "rawQuery": true,
          "refId": "A",
          "resultFormat": "time_series",
          "select": [
            [
              {
                "params": [
                  "used"
                ],
                "type": "field"
              },
              {
                "params": [],
                "type": "mean"
              }
            ]
          ],
          "series": "memswap",
          "tags": []
        },
        {
          "alias": "Max",
          "column": "total",
          "dsType": "influxdb",
          "function": "mean",
          "groupBy": [
            {
              "params": [
                "$__interval"
              ],
              "type": "time"
            }
          ],
          "measurement": "$host.memswap",
          "orderByTime": "ASC",
          "policy": "default",
          "query": "SELECT mean(\"total\") FROM \"memswap\" WHERE (\"hostname\" =~ /^$host$/) AND $timeFilter GROUP BY time($__interval) fill(none)",
          "rawQuery": true,
          "refId": "B",
          "resultFormat": "time_series",
          "select": [
            [
              {
                "params": [
                  "total"
                ],
                "type": "field"
              },
              {
                "params": [],
                "type": "mean"
              }
            ]
          ],
          "series": "memswap",
          "tags": [],
          "target": ""
        }
      ],
      "thresholds": [],
      "timeFrom": null,
      "timeRegions": [],
      "timeShift": null,
      "title": "SWAP",
      "tooltip": {
        "shared": false,
        "sort": 0,
        "value_type": "cumulative"
      },
      "type": "graph",
      "xaxis": {
        "buckets": null,
        "mode": "time",
        "name": null,
        "show": true,
        "values": []
      },
      "yaxes": [
        {
          "$$hashKey": "object:2690",
          "format": "bytes",
          "logBase": 1,
          "max": null,
          "min": "0",
          "show": true
        },
        {
          "$$hashKey": "object:2691",
          "format": "short",
          "logBase": 1,
          "max": null,
          "min": null,
          "show": true
        }
      ],
      "yaxis": {
        "align": false,
        "alignLevel": null
      }
    },
    {
      "aliasColors": {},
      "bars": false,
      "dashLength": 10,
      "dashes": false,
      "datasource": "Glances",
      "editable": true,
      "error": false,
      "fill": 0,
      "fillGradient": 0,
      "grid": {},
      "gridPos": {
        "h": 7,
        "w": 12,
        "x": 0,
        "y": 20
      },
      "hiddenSeries": false,
      "id": 10,
      "legend": {
        "avg": true,
        "current": false,
        "max": true,
        "min": true,
        "show": true,
        "total": false,
        "values": true
      },
      "lines": true,
      "linewidth": 1,
      "links": [],
      "nullPointMode": "null",
      "options": {
        "alertThreshold": true
      },
      "percentage": false,
      "pluginVersion": "8.2.5",
      "pointradius": 5,
      "points": false,
      "renderer": "flot",
      "seriesOverrides": [
        {
          "alias": "Write",
          "yaxis": 2
        }
      ],
      "spaceLength": 10,
      "stack": false,
      "steppedLine": false,
      "targets": [
        {
          "alias": "Read",
          "column": "sda2.read_bytes",
          "dsType": "influxdb",
          "function": "mean",
          "groupBy": [
            {
              "params": [
                "auto"
              ],
              "type": "time"
            },
            {
              "params": [
                "none"
              ],
              "type": "fill"
            }
          ],
          "measurement": "$host.diskio",
          "orderByTime": "ASC",
          "policy": "default",
          "query": "SELECT mean(\"read_bytes\")/mean(\"time_since_update\") FROM \"diskio\" WHERE (\"hostname\" =~ /^$host$/) AND  (\"disk_name\" =~ /^$disk$/) AND $timeFilter GROUP BY time($__interval) fill(none)",
          "rawQuery": true,
          "refId": "A",
          "resultFormat": "time_series",
          "select": [
            [
              {
                "params": [
                  "sda2.read_bytes"
                ],
                "type": "field"
              },
              {
                "params": [],
                "type": "mean"
              }
            ]
          ],
          "series": "diskio",
          "tags": []
        },
        {
          "alias": "Write",
          "column": "sda2.write_bytes",
          "dsType": "influxdb",
          "function": "mean",
          "groupBy": [
            {
              "params": [
                "auto"
              ],
              "type": "time"
            },
            {
              "params": [
                "none"
              ],
              "type": "fill"
            }
          ],
          "measurement": "$host.diskio",
          "orderByTime": "ASC",
          "policy": "default",
          "query": "SELECT mean(\"write_bytes\")/mean(\"time_since_update\") FROM \"diskio\" WHERE (\"hostname\" =~ /^$host$/) AND  (\"disk_name\" =~ /^$disk$/) AND $timeFilter GROUP BY time($__interval) fill(none)",
          "rawQuery": true,
          "refId": "B",
          "resultFormat": "time_series",
          "select": [
            [
              {
                "params": [
                  "sda2.write_bytes"
                ],
                "type": "field"
              },
              {
                "params": [],
                "type": "mean"
              }
            ]
          ],
          "series": "diskio",
          "tags": [],
          "target": ""
        }
      ],
      "thresholds": [],
      "timeFrom": null,
      "timeRegions": [],
      "timeShift": null,
      "title": "$disk disk IO",
      "tooltip": {
        "shared": false,
        "sort": 0,
        "value_type": "cumulative"
      },
      "type": "graph",
      "xaxis": {
        "buckets": null,
        "mode": "time",
        "name": null,
        "show": true,
        "values": []
      },
      "yaxes": [
        {
          "$$hashKey": "object:2782",
          "format": "bytes",
          "logBase": 1,
          "max": null,
          "min": null,
          "show": true
        },
        {
          "$$hashKey": "object:2783",
          "format": "bytes",
          "logBase": 1,
          "max": null,
          "min": null,
          "show": true
        }
      ],
      "yaxis": {
        "align": false,
        "alignLevel": null
      }
    },
    {
      "aliasColors": {
        "Max": "#BF1B00"
      },
      "bars": false,
      "dashLength": 10,
      "dashes": false,
      "datasource": "Glances",
      "editable": true,
      "error": false,
      "fill": 0,
      "fillGradient": 0,
      "grid": {},
      "gridPos": {
        "h": 7,
        "w": 8,
        "x": 12,
        "y": 20
      },
      "hiddenSeries": false,
      "id": 11,
      "legend": {
        "avg": false,
        "current": false,
        "max": false,
        "min": false,
        "show": true,
        "total": false,
        "values": false
      },
      "lines": true,
      "linewidth": 3,
      "links": [],
      "nullPointMode": "null",
      "options": {
        "alertThreshold": true
      },
      "percentage": false,
      "pluginVersion": "8.2.5",
      "pointradius": 5,
      "points": false,
      "renderer": "flot",
      "seriesOverrides": [
        {
          "$$hashKey": "object:3095",
          "alias": "Used",
          "fill": 10,
          "fillGradient": 8
        }
      ],
      "spaceLength": 10,
      "stack": false,
      "steppedLine": false,
      "targets": [
        {
          "alias": "Used",
          "column": "\"/.used\"",
          "dsType": "influxdb",
          "function": "mean",
          "groupBy": [
            {
              "params": [
                "$__interval"
              ],
              "type": "time"
            },
            {
              "params": [
                "none"
              ],
              "type": "fill"
            }
          ],
          "measurement": "fs",
          "orderByTime": "ASC",
          "policy": "default",
          "query": "SELECT mean(\"/.used\") FROM \"$host.fs\" WHERE $timeFilter GROUP BY time($interval) fill(null)",
          "refId": "A",
          "resultFormat": "time_series",
          "select": [
            [
              {
                "params": [
                  "used"
                ],
                "type": "field"
              },
              {
                "params": [],
                "type": "mean"
              }
            ]
          ],
          "series": "fs",
          "tags": [
            {
              "key": "mnt_point",
              "operator": "=",
              "value": "/"
            },
            {
              "condition": "AND",
              "key": "hostname",
              "operator": "=~",
              "value": "/^$host$/"
            }
          ]
        },
        {
          "alias": "Max",
          "column": "\"/.size\"",
          "dsType": "influxdb",
          "function": "mean",
          "groupBy": [
            {
              "params": [
                "$__interval"
              ],
              "type": "time"
            },
            {
              "params": [
                "none"
              ],
              "type": "fill"
            }
          ],
          "measurement": "fs",
          "orderByTime": "ASC",
          "policy": "default",
          "query": "SELECT mean(\"/.size\") FROM \"$host.fs\" WHERE $timeFilter GROUP BY time($interval) fill(null)",
          "refId": "B",
          "resultFormat": "time_series",
          "select": [
            [
              {
                "params": [
                  "size"
                ],
                "type": "field"
              },
              {
                "params": [],
                "type": "mean"
              }
            ]
          ],
          "series": "fs",
          "tags": [
            {
              "key": "mnt_point",
              "operator": "=",
              "value": "/"
            },
            {
              "condition": "AND",
              "key": "hostname",
              "operator": "=~",
              "value": "/^$host$/"
            }
          ],
          "target": ""
        }
      ],
      "thresholds": [],
      "timeFrom": null,
      "timeRegions": [],
      "timeShift": null,
      "title": "/ Size",
      "tooltip": {
        "shared": false,
        "sort": 0,
        "value_type": "cumulative"
      },
      "type": "graph",
      "xaxis": {
        "buckets": null,
        "mode": "time",
        "name": null,
        "show": true,
        "values": []
      },
      "yaxes": [
        {
          "$$hashKey": "object:2891",
          "format": "bytes",
          "logBase": 1,
          "max": null,
          "min": 0,
          "show": true
        },
        {
          "$$hashKey": "object:2892",
          "format": "short",
          "logBase": 1,
          "max": null,
          "min": null,
          "show": true
        }
      ],
      "yaxis": {
        "align": false,
        "alignLevel": null
      }
    },
    {
      "cacheTimeout": null,
      "datasource": "Glances",
      "fieldConfig": {
        "defaults": {
          "color": {
            "mode": "thresholds"
          },
          "mappings": [
            {
              "options": {
                "match": "null",
                "result": {
                  "text": "N/A"
                }
              },
              "type": "special"
            }
          ],
          "thresholds": {
            "mode": "absolute",
            "steps": [
              {
                "color": "rgba(71, 212, 59, 0.4)",
                "value": null
              },
              {
                "color": "rgba(245, 150, 40, 0.73)",
                "value": 70
              },
              {
                "color": "rgba(225, 40, 40, 0.59)",
                "value": 90
              }
            ]
          },
          "unit": "percent"
        },
        "overrides": []
      },
      "gridPos": {
        "h": 7,
        "w": 2,
        "x": 20,
        "y": 20
      },
      "id": 16,
      "interval": null,
      "links": [],
      "maxDataPoints": 100,
      "options": {
        "colorMode": "background",
        "graphMode": "area",
        "justifyMode": "auto",
        "orientation": "horizontal",
        "reduceOptions": {
          "calcs": [
            "mean"
          ],
          "fields": "",
          "values": false
        },
        "text": {},
        "textMode": "auto"
      },
      "pluginVersion": "8.2.5",
      "targets": [
        {
          "column": "\"/.percent\"",
          "dsType": "influxdb",
          "function": "mean",
          "groupBy": [
            {
              "params": [
                "auto"
              ],
              "type": "time"
            }
          ],
          "measurement": "fs",
          "orderByTime": "ASC",
          "policy": "default",
          "query": "SELECT mean(\"/.percent\") FROM \"$host.fs\" WHERE $timeFilter GROUP BY time($interval)",
          "refId": "A",
          "resultFormat": "time_series",
          "select": [
            [
              {
                "params": [
                  "percent"
                ],
                "type": "field"
              },
              {
                "params": [],
                "type": "mean"
              }
            ]
          ],
          "series": "fs",
          "tags": [
            {
              "key": "mnt_point",
              "operator": "=",
              "value": "/"
            },
            {
              "condition": "AND",
              "key": "hostname",
              "operator": "=~",
              "value": "/^$host$/"
            }
          ]
        }
      ],
      "title": "/ used",
      "type": "stat"
    },
    {
      "cacheTimeout": null,
      "datasource": "Glances",
      "fieldConfig": {
        "defaults": {
          "color": {
            "mode": "thresholds"
          },
          "mappings": [
            {
              "options": {
                "match": "null",
                "result": {
                  "text": "N/A"
                }
              },
              "type": "special"
            }
          ],
          "thresholds": {
            "mode": "absolute",
            "steps": [
              {
                "color": "rgba(71, 212, 59, 0.4)",
                "value": null
              },
              {
                "color": "rgba(245, 150, 40, 0.73)",
                "value": 70
              },
              {
                "color": "rgba(225, 40, 40, 0.59)",
                "value": 90
              }
            ]
          },
          "unit": "percent"
        },
        "overrides": []
      },
      "gridPos": {
        "h": 7,
        "w": 2,
        "x": 22,
        "y": 20
      },
      "id": 17,
      "interval": null,
      "links": [],
      "maxDataPoints": 100,
      "options": {
        "colorMode": "background",
        "graphMode": "area",
        "justifyMode": "auto",
        "orientation": "horizontal",
        "reduceOptions": {
          "calcs": [
            "mean"
          ],
          "fields": "",
          "values": false
        },
        "text": {},
        "textMode": "auto"
      },
      "pluginVersion": "8.2.5",
      "targets": [
        {
          "column": "\"/home.percent\"",
          "dsType": "influxdb",
          "function": "mean",
          "groupBy": [
            {
              "params": [
                "auto"
              ],
              "type": "time"
            }
          ],
          "measurement": "fs",
          "orderByTime": "ASC",
          "policy": "default",
          "query": "SELECT mean(\"percent\") FROM \"fs\" WHERE (\"hostname\" =~ /^$host$/) AND (\"mnt_point\" = '/boot') AND $timeFilter GROUP BY time($__interval)",
          "rawQuery": true,
          "refId": "A",
          "resultFormat": "time_series",
          "select": [
            [
              {
                "params": [
                  "percent"
                ],
                "type": "field"
              },
              {
                "params": [],
                "type": "mean"
              }
            ]
          ],
          "series": "fs",
          "tags": [
            {
              "key": "mnt_point",
              "operator": "=",
              "value": "/boot"
            }
          ]
        }
      ],
      "title": "/boot used",
      "type": "stat"
    },
    {
      "datasource": null,
      "gridPos": {
        "h": 3,
        "w": 24,
        "x": 0,
        "y": 27
      },
      "id": 22,
      "links": [],
      "options": {
        "content": "",
        "mode": "markdown"
      },
      "pluginVersion": "8.2.5",
      "title": "Sensors",
      "type": "text"
    },
    {
      "cards": {
        "cardPadding": null,
        "cardRound": null
      },
      "color": {
        "cardColor": "rgb(255, 0, 0)",
        "colorScale": "sqrt",
        "colorScheme": "interpolateReds",
        "exponent": 1,
        "min": null,
        "mode": "opacity"
      },
      "dataFormat": "timeseries",
      "datasource": "Glances",
      "gridPos": {
        "h": 6,
        "w": 12,
        "x": 0,
        "y": 30
      },
      "heatmap": {},
      "hideZeroBuckets": false,
      "highlightCards": true,
      "id": 21,
      "legend": {
        "show": false
      },
      "links": [],
      "reverseYBuckets": false,
      "targets": [
        {
          "alias": "AmbientTemperature",
          "dsType": "influxdb",
          "groupBy": [
            {
              "params": [
                "$__interval"
              ],
              "type": "time"
            },
            {
              "params": [
                "null"
              ],
              "type": "fill"
            }
          ],
          "measurement": "sensors",
          "orderByTime": "ASC",
          "policy": "default",
          "refId": "A",
          "resultFormat": "time_series",
          "select": [
            [
              {
                "params": [
                  "value"
                ],
                "type": "field"
              },
              {
                "params": [],
                "type": "mean"
              }
            ]
          ],
          "tags": [
            {
              "key": "label",
              "operator": "=",
              "value": "Ambient"
            },
            {
              "condition": "AND",
              "key": "hostname",
              "operator": "=~",
              "value": "/^$host$/"
            }
          ]
        }
      ],
      "title": "Ambiant temperature",
      "tooltip": {
        "show": true,
        "showHistogram": false
      },
      "type": "heatmap",
      "xAxis": {
        "show": true
      },
      "xBucketNumber": null,
      "xBucketSize": null,
      "yAxis": {
        "decimals": null,
        "format": "celsius",
        "logBase": 1,
        "max": null,
        "min": "0",
        "show": true,
        "splitFactor": null
      },
      "yBucketBound": "auto",
      "yBucketNumber": null,
      "yBucketSize": null
    },
    {
      "cards": {
        "cardPadding": null,
        "cardRound": null
      },
      "color": {
        "cardColor": "rgb(255, 0, 0)",
        "colorScale": "sqrt",
        "colorScheme": "interpolateOranges",
        "exponent": 1,
        "mode": "opacity"
      },
      "dataFormat": "timeseries",
      "datasource": "Glances",
      "gridPos": {
        "h": 6,
        "w": 12,
        "x": 12,
        "y": 30
      },
      "heatmap": {},
      "hideZeroBuckets": false,
      "highlightCards": true,
      "id": 23,
      "legend": {
        "show": false
      },
      "links": [],
      "reverseYBuckets": false,
      "targets": [
        {
          "alias": "CpuTemperature",
          "dsType": "influxdb",
          "groupBy": [
            {
              "params": [
                "$__interval"
              ],
              "type": "time"
            },
            {
              "params": [
                "null"
              ],
              "type": "fill"
            }
          ],
          "measurement": "sensors",
          "orderByTime": "ASC",
          "policy": "default",
          "refId": "A",
          "resultFormat": "time_series",
          "select": [
            [
              {
                "params": [
                  "value"
                ],
                "type": "field"
              },
              {
                "params": [],
                "type": "mean"
              }
            ]
          ],
          "tags": [
            {
              "key": "label",
              "operator": "=",
              "value": "CPU"
            },
            {
              "condition": "AND",
              "key": "hostname",
              "operator": "=~",
              "value": "/^$host$/"
            }
          ]
        }
      ],
      "title": "CPU temperature",
      "tooltip": {
        "show": true,
        "showHistogram": false
      },
      "type": "heatmap",
      "xAxis": {
        "show": true
      },
      "xBucketNumber": null,
      "xBucketSize": null,
      "yAxis": {
        "decimals": null,
        "format": "celsius",
        "logBase": 1,
        "max": null,
        "min": "0",
        "show": true,
        "splitFactor": null
      },
      "yBucketBound": "auto",
      "yBucketNumber": null,
      "yBucketSize": null
    },
    {
      "datasource": null,
      "editable": true,
      "error": false,
      "gridPos": {
        "h": 3,
        "w": 24,
        "x": 0,
        "y": 36
      },
      "id": 13,
      "links": [],
      "options": {
        "content": "",
        "mode": "markdown"
      },
      "pluginVersion": "8.2.5",
      "style": {},
      "title": "Containers",
      "type": "text"
    },
    {
      "aliasColors": {
        "$host.docker.mean": "#ba43a9",
        "CPU%": "#cca300",
        "MEM": "#2f575e"
      },
      "bars": false,
      "dashLength": 10,
      "dashes": false,
      "datasource": "Glances",
      "fieldConfig": {
        "defaults": {},
        "overrides": [
          {
            "matcher": {
              "id": "byName",
              "options": "MEM"
            },
            "properties": [
              {
                "id": "unit",
                "value": "decbytes"
              }
            ]
          }
        ]
      },
      "fill": 0,
      "fillGradient": 0,
      "gridPos": {
        "h": 8,
        "w": 8,
        "x": 0,
        "y": 39
      },
      "hiddenSeries": false,
      "id": 25,
      "legend": {
        "avg": false,
        "current": false,
        "max": false,
        "min": false,
        "show": true,
        "total": false,
        "values": false
      },
      "lines": true,
      "linewidth": 2,
      "links": [],
      "maxPerRow": 3,
      "nullPointMode": "null",
      "options": {
        "alertThreshold": true
      },
      "percentage": false,
      "pluginVersion": "8.2.5",
      "pointradius": 5,
      "points": false,
      "renderer": "flot",
      "repeat": "container",
      "repeatDirection": "h",
      "seriesOverrides": [
        {
          "$$hashKey": "object:3517",
          "alias": "MEM",
          "yaxis": 2
        },
        {
          "$$hashKey": "object:3518",
          "alias": "MEM",
          "fill": 10,
          "fillGradient": 8,
          "steppedLine": true,
          "zindex": -3
        }
      ],
      "spaceLength": 10,
      "stack": false,
      "steppedLine": false,
      "targets": [
        {
          "alias": "CPU%",
          "groupBy": [
            {
              "params": [
                "$__interval"
              ],
              "type": "time"
            },
            {
              "params": [
                "none"
              ],
              "type": "fill"
            }
          ],
          "hide": false,
          "measurement": "docker",
          "orderByTime": "ASC",
          "policy": "default",
          "query": "SELECT mean(\"cpu_percent\") FROM \"$host.docker\" WHERE $timeFilter GROUP BY time($__interval) fill(none)",
          "rawQuery": false,
          "refId": "A",
          "resultFormat": "time_series",
          "select": [
            [
              {
                "params": [
                  "cpu_percent"
                ],
                "type": "field"
              },
              {
                "params": [],
                "type": "mean"
              }
            ]
          ],
          "tags": [
            {
              "key": "name",
              "operator": "=~",
              "value": "/^$container$/"
            },
            {
              "condition": "AND",
              "key": "hostname",
              "operator": "=~",
              "value": "/^$host$/"
            }
          ]
        },
        {
          "alias": "MEM",
          "groupBy": [
            {
              "params": [
                "$__interval"
              ],
              "type": "time"
            },
            {
              "params": [
                "none"
              ],
              "type": "fill"
            }
          ],
          "hide": false,
          "measurement": "docker",
          "orderByTime": "ASC",
          "policy": "default",
          "query": "SELECT mean(\"cpu_percent\") FROM \"$host.docker\" WHERE $timeFilter GROUP BY time($__interval) fill(none)",
          "rawQuery": false,
          "refId": "B",
          "resultFormat": "time_series",
          "select": [
            [
              {
                "params": [
                  "memory_usage"
                ],
                "type": "field"
              },
              {
                "params": [],
                "type": "mean"
              }
            ]
          ],
          "tags": [
            {
              "key": "name",
              "operator": "=~",
              "value": "/^$container$/"
            },
            {
              "condition": "AND",
              "key": "hostname",
              "operator": "=~",
              "value": "/^$host$/"
            }
          ]
        }
      ],
      "thresholds": [],
      "timeFrom": null,
      "timeRegions": [],
      "timeShift": null,
      "title": "$container container",
      "tooltip": {
        "shared": true,
        "sort": 0,
        "value_type": "individual"
      },
      "type": "graph",
      "xaxis": {
        "buckets": null,
        "mode": "time",
        "name": null,
        "show": true,
        "values": []
      },
      "yaxes": [
        {
          "$$hashKey": "object:3541",
          "format": "percent",
          "label": null,
          "logBase": 1,
          "max": "100",
          "min": "0",
          "show": true
        },
        {
          "$$hashKey": "object:3542",
          "format": "decbytes",
          "label": null,
          "logBase": 1,
          "max": null,
          "min": "0",
          "show": true
        }
      ],
      "yaxis": {
        "align": false,
        "alignLevel": null
      }
    }
  ],
  "refresh": "5s",
  "schemaVersion": 32,
  "style": "dark",
  "tags": [],
  "templating": {
    "list": [
      {
        "allValue": null,
        "current": {
          "selected": true,
          "text": "pepino",
          "value": "pepino"
        },
        "datasource": "Glances",
        "definition": "show tag values with key=\"hostname\"",
        "description": null,
        "error": null,
        "hide": 0,
        "includeAll": false,
        "label": null,
        "multi": false,
        "name": "host",
        "options": [],
        "query": "show tag values with key=\"hostname\"",
        "refresh": 1,
        "regex": "",
        "skipUrlSync": false,
        "sort": 0,
        "tagValuesQuery": "",
        "tagsQuery": "",
        "type": "query",
        "useTags": false
      },
      {
        "allValue": null,
        "current": {
          "selected": false,
          "text": "All",
          "value": "$__all"
        },
        "datasource": "Glances",
        "definition": "show tag values with key=\"name\"",
        "description": null,
        "error": null,
        "hide": 0,
        "includeAll": true,
        "label": null,
        "multi": true,
        "name": "container",
        "options": [],
        "query": "show tag values with key=\"name\"",
        "refresh": 1,
        "regex": "/^isard-*/",
        "skipUrlSync": false,
        "sort": 1,
        "tagValuesQuery": "",
        "tagsQuery": "",
        "type": "query",
        "useTags": false
      },
      {
        "allValue": null,
        "current": {
          "selected": false,
          "text": "br-1d2339fa1354",
          "value": "br-1d2339fa1354"
        },
        "datasource": "Glances",
        "definition": "show tag values with key=\"interface_name\"",
        "description": null,
        "error": null,
        "hide": 0,
        "includeAll": false,
        "label": null,
        "multi": false,
        "name": "interface",
        "options": [],
        "query": "show tag values with key=\"interface_name\"",
        "refresh": 1,
        "regex": "",
        "skipUrlSync": false,
        "sort": 1,
        "tagValuesQuery": "",
        "tagsQuery": "",
        "type": "query",
        "useTags": false
      },
      {
        "allValue": null,
        "current": {
          "selected": false,
          "text": "loop0",
          "value": "loop0"
        },
        "datasource": "Glances",
        "definition": "show tag values with key=\"disk_name\"",
        "description": null,
        "error": null,
        "hide": 0,
        "includeAll": false,
        "label": null,
        "multi": false,
        "name": "disk",
        "options": [],
        "query": "show tag values with key=\"disk_name\"",
        "refresh": 1,
        "regex": "",
        "skipUrlSync": false,
        "sort": 1,
        "tagValuesQuery": "",
        "tagsQuery": "",
        "type": "query",
        "useTags": false
      }
    ]
  },
  "time": {
    "from": "now-1h",
    "to": "now"
  },
  "timepicker": {
    "collapse": false,
    "enable": true,
    "notice": false,
    "now": true,
    "refresh_intervals": [
      "5s",
      "10s",
      "30s",
      "1m",
      "5m",
      "15m",
      "30m",
      "1h",
      "2h",
      "1d"
    ],
    "status": "Stable",
    "time_options": [
      "5m",
      "15m",
      "1h",
      "6h",
      "12h",
      "24h",
      "2d",
      "7d",
      "30d"
    ],
    "type": "timepicker"
  },
  "timezone": "browser",
  "title": "Servers Status",
  "uid": "000000002",
  "version": 1
}