{
    "extends":      [
        "config:base"
    ],
    "baseBranches": [
        "dev"
    ],
    "assignees": [
        "x.laylatichy.x"
    ],
    "packageRules": [
      {
        "matchPackageNames": [
          "node",
          "npm"
        ],
        "groupName": "node engine"
      },
      {
        "matchPackagePatterns": [
          "^laylatichy"
        ],
        "groupName": "nano monorepo"
      },
      {
        "matchPackagePatterns": [
          "^phpstan"
        ],
        "groupName": "phpstan monorepo"
      }
    ]
}
